{"text_format":"1","workbook":"xlsx","n_sheets":4,"sheets":["銘柄一覧シート","ヒストリカルデータ取得シート","バックテストデータ_5D_5Y","利用方法説明"],"not_rendered":{"charts":0,"images":3,"macros":1,"external_links":0,"defined_names":1,"comments":0,"pivot_tables":0},"unopened":[],"bounds":{"document_bytes":16777216,"sheet_cells":100000,"rows_first":2000,"rows_last":500,"rows_between":2000,"halvings":0,"cell_chars":16384,"cell_head_chars":4096},"cells_cut":0,"cells_raw":0,"read":"whole","date_system":"1900"}

{"sheet":"銘柄一覧シート","index":0,"n_rows":105,"n_cols":19,"rows_kept":105,"cut":false,"hidden":false,"merged":[]}
[{"$f":"ヒストリカルデータ取得シート!A2","v":"更新日時 2025/03/04 09:27:56"}]
[null,"TOPIX100銘柄",null,null,"リアルタイム更新　エリア",null,null,null,null,null,null,"ヒストリカルデータ　エリア",null,null,null,"バックテスト勝敗エリア　（5営業日後成績）"]
[null,null,null,null,null,null,null,null,null,null,null,"ボリンジャーバンド (20日)",null,null,null,"ヒストリカルデータ（５年　2024年12月末まで）"]
[null,null,null,null,null,null,null,null,null,null,null,null,null,{"$f":"MID(ヒストリカルデータ取得シート!$E$39,1,10)&\"分迄\"","v":"分迄"},null,"　上限到達時シグナル",null,"　下限到達時シグナル"]
["＃","銘柄コード","銘柄名","上場部","現値","前日終値","前日比","時間","Tick回数","ＶＷＡＰ",null,"（＋2σ）","ゲージ","(－2σ)",null,"勝敗","平均変化率","勝敗","平均変化率"]
[1,1925,{"$f":"IF(B6=0,\"wait\",_xll.SNT.StockInst(B6,\"銘柄名称\"))","v":{"$error":"#NAME?"}},{"$f":"IF(B6=0,\"wait\",_xll.SNT.StockInst(B6,\"上場部\"))","v":{"$error":"#NAME?"}},{"$f":"IF(B6=0,\"wait\",_xll.SNT.StockInst(B6,\"現値\"))","v":{"$error":"#NAME?"}},{"$f":"IF(B6=0,\"wait\",_xll.SNT.StockInst(B6,\"前日終値\"))","v":{"$error":"#NAME?"}},{"$f":"IFERROR(E6-F6,\"wait\")","v":"wait"},{"$f":"IF(B6=0,\"wait\",MID(_xll.SNT.StockInst(B6,\"現値日時\"),12,5))","v":{"$error":"#NAME?"}},{"$f":"IF(B6=0,\"wait\",_xll.SNT.StockInst(B6,\"Tick回数\"))","v":{"$error":"#NAME?"}},{"$f":"IF(B6=0,\"wait\",_xll.SNT.StockInst(B6,\"VWAP\"))","v":{"$error":"#NAME?"}},null,{"$f":"IFERROR(INDEX(ヒストリカルデータ取得シート!$F$5:$DA$5, ROW(A1)),\"-\")","v":"-"},{"$f":"IFERROR((E6-N6)/(L6-N6),\"\")","v":""},{"$f":"IFERROR(INDEX(ヒストリカルデータ取得シート!$F$6:$DA$6, ROW(A1)),\"-\")","v":"-"},null,{"$f":"IF(AND(ISNUMBER(M6), M6>1), IFERROR(VLOOKUP(B6, バックテストデータ_5D_5Y!$B$2:$I$1562, 5, FALSE), \"データ無\"), \"\")","v":""},{"$f":"IF(AND(ISNUMBER(M6), M6>1), IFERROR(VLOOKUP(B6, バックテストデータ_5D_5Y!$B$2:$I$1562, 4, FALSE), \"データ無\"), \"\")","v":""},{"$f":"IF(M6<0,IFERROR(VLOOKUP(B6,バックテストデータ_5D_5Y!$B$2:$I$1562,8,FALSE),\"データ無\"),\"\")","v":""},{"$f":"IF(M6<0,IFERROR(VLOOKUP(B6,バックテストデータ_5D_5Y!$B$2:$I$1562,7,FALSE),\"データ無\"),\"\")","v":""}]
[2,1928,{"$f":"IF(B7=0,\"wait\",_xll.SNT.StockInst(B7,\"銘柄名称\"))","v":{"$error":"#NAME?"}},{"$f":"IF(B7=0,\"wait\",_xll.SNT.StockInst(B7,\"上場部\"))","v":{"$error":"#NAME?"}},{"$f":"IF(B7=0,\"wait\",_xll.SNT.StockInst(B7,\"現値\"))","v":{"$error":"#NAME?"}},{"$f":"IF(B7=0,\"wait\",_xll.SNT.StockInst(B7,\"前日終値\"))","v":{"$error":"#NAME?"}},{"$f":"IFERROR(E7-F7,\"wait\")","v":"wait"},{"$f":"IF(B7=0,\"wait\",MID(_xll.SNT.StockInst(B7,\"現値日時\"),12,5))","v":{"$error":"#NAME?"}},{"$f":"IF(B7=0,\"wait\",_xll.SNT.StockInst(B7,\"Tick回数\"))","v":{"$error":"#NAME?"}},{"$f":"IF(B7=0,\"wait\",_xll.SNT.StockInst(B7,\"VWAP\"))","v":{"$error":"#NAME?"}},null,{"$f":"IFERROR(INDEX(ヒストリカルデータ取得シート!$F$5:$DA$5, ROW(A2)),\"-\")","v":"-"},{"$f":"IFERROR((E7-N7)/(L7-N7),\"\")","v":""},{"$f":"IFERROR(INDEX(ヒストリカルデータ取得シート!$F$6:$DA$6, ROW(A2)),\"-\")","v":"-"},null,{"$f":"IF(AND(ISNUMBER(M7), M7>1), IFERROR(VLOOKUP(B7, バックテストデータ_5D_5Y!$B$2:$I$1562, 5, FALSE), \"データ無\"), \"\")","v":""},{"$f":"IF(AND(ISNUMBER(M7), M7>1), IFERROR(VLOOKUP(B7, バックテストデータ_5D_5Y!$B$2:$I$1562, 4, FALSE), \"データ無\"), \"\")","v":""},{"$f":"IF(M7<0,IFERROR(VLOOKUP(B7,バックテストデータ_5D_5Y!$B$2:$I$1562,8,FALSE),\"データ無\"),\"\")","v":""},{"$f":"IF(M7<0,IFERROR(VLOOKUP(B7,バックテストデータ_5D_5Y!$B$2:$I$1562,7,FALSE),\"データ無\"),\"\")","v":""}]
[3,2413,{"$f":"IF(B8=0,\"wait\",_xll.SNT.StockInst(B8,\"銘柄名称\"))","v":{"$error":"#NAME?"}},{"$f":"IF(B8=0,\"wait\",_xll.SNT.StockInst(B8,\"上場部\"))","v":{"$error":"#NAME?"}},{"$f":"IF(B8=0,\"wait\",_xll.SNT.StockInst(B8,\"現値\"))","v":{"$error":"#NAME?"}},{"$f":"IF(B8=0,\"wait\",_xll.SNT.StockInst(B8,\"前日終値\"))","v":{"$error":"#NAME?"}},"wait",{"$f":"IF(B8=0,\"wait\",MID(_xll.SNT.StockInst(B8,\"現値日時\"),12,5))","v":{"$error":"#NAME?"}},{"$f":"IF(B8=0,\"wait\",_xll.SNT.StockInst(B8,\"Tick回数\"))","v":{"$error":"#NAME?"}},{"$f":"IF(B8=0,\"wait\",_xll.SNT.StockInst(B8,\"VWAP\"))","v":{"$error":"#NAME?"}},null,{"$f":"IFERROR(INDEX(ヒストリカルデータ取得シート!$F$5:$DA$5, ROW(A3)),\"-\")","v":"-"},"",{"$f":"IFERROR(INDEX(ヒストリカルデータ取得シート!$F$6:$DA$6, ROW(A3)),\"-\")","v":"-"},null,{"$f":"IF(AND(ISNUMBER(M8), M8>1), IFERROR(VLOOKUP(B8, バックテストデータ_5D_5Y!$B$2:$I$1562, 5, FALSE), \"データ無\"), \"\")","v":""},{"$f":"IF(AND(ISNUMBER(M8), M8>1), IFERROR(VLOOKUP(B8, バックテストデータ_5D_5Y!$B$2:$I$1562, 4, FALSE), \"データ無\"), \"\")","v":""},{"$f":"IF(M8<0,IFERROR(VLOOKUP(B8,バックテストデータ_5D_5Y!$B$2:$I$1562,8,FALSE),\"データ無\"),\"\")","v":""},{"$f":"IF(M8<0,IFERROR(VLOOKUP(B8,バックテストデータ_5D_5Y!$B$2:$I$1562,7,FALSE),\"データ無\"),\"\")","v":""}]
{"$rows_left_out":98}
{"sheet":"ヒストリカルデータ取得シート","index":1,"n_rows":39,"n_cols":105,"rows_kept":39,"cut":false,"hidden":false,"merged":[]}
[]
["更新日時 2025/03/04 09:27:56"]
[null,null,null,null,"＃",1,2,3,4,5,6,7,8,9,10,11,12,13,14,15,16,17,18,19,20,21,22,23,24,25,26,27,28,29,30,31,32,33,34,35,36,37,38,39,40,41,42,43,44,45,46,47,48,49,50,51,52,53,54,55,56,57,58,59,60,61,62,63,64,65,66,67,68,69,70,71,72,73,74,75,76,77,78,79,80,81,82,83,84,85,86,87,88,89,90,91,92,93,94,95,96,97,98,99,100]
[null,null,null,null,"銘柄コード",{"$f":"銘柄一覧シート!B6","v":1925},{"$f":"銘柄一覧シート!B7","v":1928},{"$f":"銘柄一覧シート!B8","v":2413},{"$f":"銘柄一覧シート!B9","v":2502},{"$f":"銘柄一覧シート!B10","v":2503},{"$f":"銘柄一覧シート!B11","v":2802},{"$f":"銘柄一覧シート!B12","v":2914},{"$f":"銘柄一覧シート!B13","v":3382},{"$f":"銘柄一覧シート!B14","v":3402},{"$f":"銘柄一覧シート!B15","v":3407},{"$f":"銘柄一覧シート!B16","v":4063},{"$f":"銘柄一覧シート!B17","v":4188},{"$f":"銘柄一覧シート!B18","v":4452},{"$f":"銘柄一覧シート!B19","v":4502},{"$f":"銘柄一覧シート!B20","v":4503},{"$f":"銘柄一覧シート!B21","v":4507},{"$f":"銘柄一覧シート!B22","v":4519},{"$f":"銘柄一覧シート!B23","v":4523},{"$f":"銘柄一覧シート!B24","v":4528},{"$f":"銘柄一覧シート!B25","v":4543},{"$f":"銘柄一覧シート!B26","v":4568},{"$f":"銘柄一覧シート!B27","v":4578},{"$f":"銘柄一覧シート!B28","v":4661},{"$f":"銘柄一覧シート!B29","v":4689},{"$f":"銘柄一覧シート!B30","v":4901},{"$f":"銘柄一覧シート!B31","v":4911},{"$f":"銘柄一覧シート!B32","v":5020},{"$f":"銘柄一覧シート!B33","v":5108},{"$f":"銘柄一覧シート!B34","v":5401},{"$f":"銘柄一覧シート!B35","v":5713},{"$f":"銘柄一覧シート!B36","v":5802},{"$f":"銘柄一覧シート!B37","v":6098},{"$f":"銘柄一覧シート!B38","v":6178},{"$f":"銘柄一覧シート!B39","v":6273},{"$f":"銘柄一覧シート!B40","v":6301},{"$f":"銘柄一覧シート!B41","v":6326},{"$f":"銘柄一覧シート!B42","v":6367},{"$f":"銘柄一覧シート!B43","v":6501},{"$f":"銘柄一覧シート!B44","v":6503},{"$f":"銘柄一覧シート!B45","v":6586},{"$f":"銘柄一覧シート!B46","v":6594},{"$f":"銘柄一覧シート!B47","v":6645},{"$f":"銘柄一覧シート!B48","v":6702},{"$f":"銘柄一覧シート!B49","v":6752},{"$f":"銘柄一覧シート!B50","v":6758},{"$f":"銘柄一覧シート!B51","v":6861},{"$f":"銘柄一覧シート!B52","v":6869},{"$f":"銘柄一覧シート!B53","v":6902},{"$f":"銘柄一覧シート!B54","v":6920},{"$f":"銘柄一覧シート!B55","v":6954},{"$f":"銘柄一覧シート!B56","v":6971},{"$f":"銘柄一覧シート!B57","v":6981},{"$f":"銘柄一覧シート!B58","v":7011},{"$f":"銘柄一覧シート!B59","v":7201},{"$f":"銘柄一覧シート!B60","v":7203},{"$f":"銘柄一覧シート!B61","v":7267},{"$f":"銘柄一覧シート!B62","v":7269},{"$f":"銘柄一覧シート!B63","v":7270},{"$f":"銘柄一覧シート!B64","v":7309},{"$f":"銘柄一覧シート!B65","v":7733},{"$f":"銘柄一覧シート!B66","v":7741},{"$f":"銘柄一覧シート!B67","v":7751},{"$f":"銘柄一覧シート!B68","v":7832},{"$f":"銘柄一覧シート!B69","v":7974},{"$f":"銘柄一覧シート!B70","v":8001},{"$f":"銘柄一覧シート!B71","v":8002},{"$f":"銘柄一覧シート!B72","v":8031},{"$f":"銘柄一覧シート!B73","v":8035},{"$f":"銘柄一覧シート!B74","v":8053},{"$f":"銘柄一覧シート!B75","v":8058},{"$f":"銘柄一覧シート!B76","v":8113},{"$f":"銘柄一覧シート!B77","v":8267},{"$f":"銘柄一覧シート!B78","v":8306},{"$f":"銘柄一覧シート!B79","v":8308},{"$f":"銘柄一覧シート!B80","v":8309},{"$f":"銘柄一覧シート!B81","v":8316},{"$f":"銘柄一覧シート!B82","v":8411},{"$f":"銘柄一覧シート!B83","v":8591},{"$f":"銘柄一覧シート!B84","v":8604},{"$f":"銘柄一覧シート!B85","v":8630},{"$f":"銘柄一覧シート!B86","v":8697},{"$f":"銘柄一覧シート!B87","v":8725},{"$f":"銘柄一覧シート!B88","v":8750},{"$f":"銘柄一覧シート!B89","v":8766},{"$f":"銘柄一覧シート!B90","v":8801},{"$f":"銘柄一覧シート!B91","v":8802},{"$f":"銘柄一覧シート!B92","v":8830},{"$f":"銘柄一覧シート!B93","v":9020},{"$f":"銘柄一覧シート!B94","v":9021},{"$f":"銘柄一覧シート!B95","v":9022},{"$f":"銘柄一覧シート!B96","v":9101},{"$f":"銘柄一覧シート!B97","v":9202},{"$f":"銘柄一覧シート!B98","v":9432},{"$f":"銘柄一覧シート!B99","v":9433},{"$f":"銘柄一覧シート!B100","v":9434},{"$f":"銘柄一覧シート!B101","v":9735},{"$f":"銘柄一覧シート!B102","v":9843},{"$f":"銘柄一覧シート!B103","v":9983},{"$f":"銘柄一覧シート!B104","v":9984},{"$f":"銘柄一覧シート!B105","v":0}]
[null,null,null,null,"上限バンド（＋２σ）",{"$f":"IF(F4=0,\"wait\",AVERAGE(F$20:F$39)+2*_xlfn.STDEV.S(F$20:F$39))","v":{"$error":"#DIV/0!"}},{"$error":"#DIV/0!"},{"$error":"#DIV/0!"},{"$error":"#DIV/0!"},{"$error":"#DIV/0!"},{"$error":"#DIV/0!"},{"$error":"#DIV/0!"},{"$error":"#DIV/0!"},{"$error":"#DIV/0!"},{"$error":"#DIV/0!"},{"$error":"#DIV/0!"},{"$error":"#DIV/0!"},{"$error":"#DIV/0!"},{"$error":"#DIV/0!"},{"$error":"#DIV/0!"},{"$error":"#DIV/0!"},{"$error":"#DIV/0!"},{"$error":"#DIV/0!"},{"$error":"#DIV/0!"},{"$error":"#DIV/0!"},{"$error":"#DIV/0!"},{"$error":"#DIV/0!"},{"$error":"#DIV/0!"},{"$error":"#DIV/0!"},{"$error":"#DIV/0!"},{"$error":"#DIV/0!"},{"$error":"#DIV/0!"},{"$error":"#DIV/0!"},{"$error":"#DIV/0!"},{"$error":"#DIV/0!"},{"$error":"#DIV/0!"},{"$error":"#DIV/0!"},{"$f":"IF(AL4=0,\"wait\",AVERAGE(AL$20:AL$39)+2*_xlfn.STDEV.S(AL$20:AL$39))","v":{"$error":"#DIV/0!"}},{"$error":"#DIV/0!"},{"$error":"#DIV/0!"},{"$error":"#DIV/0!"},{"$error":"#DIV/0!"},{"$error":"#DIV/0!"},{"$error":"#DIV/0!"},{"$error":"#DIV/0!"},{"$error":"#DIV/0!"},{"$error":"#DIV/0!"},{"$error":"#DIV/0!"},{"$error":"#DIV/0!"},{"$error":"#DIV/0!"},{"$error":"#DIV/0!"},{"$error":"#DIV/0!"},{"$error":"#DIV/0!"},{"$error":"#DIV/0!"},{"$error":"#DIV/0!"},{"$error":"#DIV/0!"},{"$error":"#DIV/0!"},{"$error":"#DIV/0!"},{"$error":"#DIV/0!"},{"$error":"#DIV/0!"},{"$error":"#DIV/0!"},{"$error":"#DIV/0!"},{"$error":"#DIV/0!"},{"$error":"#DIV/0!"},{"$error":"#DIV/0!"},{"$error":"#DIV/0!"},{"$error":"#DIV/0!"},{"$error":"#DIV/0!"},{"$error":"#DIV/0!"},{"$f":"IF(BR4=0,\"wait\",AVERAGE(BR$20:BR$39)+2*_xlfn.STDEV.S(BR$20:BR$39))","v":{"$error":"#DIV/0!"}},{"$error":"#DIV/0!"},{"$error":"#DIV/0!"},{"$error":"#DIV/0!"},{"$error":"#DIV/0!"},{"$error":"#DIV/0!"},{"$error":"#DIV/0!"},{"$error":"#DIV/0!"},{"$error":"#DIV/0!"},{"$error":"#DIV/0!"},{"$error":"#DIV/0!"},{"$error":"#DIV/0!"},{"$error":"#DIV/0!"},{"$error":"#DIV/0!"},{"$error":"#DIV/0!"},{"$error":"#DIV/0!"},{"$error":"#DIV/0!"},{"$error":"#DIV/0!"},{"$error":"#DIV/0!"},{"$error":"#DIV/0!"},{"$error":"#DIV/0!"},{"$error":"#DIV/0!"},{"$error":"#DIV/0!"},{"$error":"#DIV/0!"},{"$error":"#DIV/0!"},{"$error":"#DIV/0!"},{"$error":"#DIV/0!"},{"$error":"#DIV/0!"},{"$error":"#DIV/0!"},{"$error":"#DIV/0!"},{"$error":"#DIV/0!"},{"$error":"#DIV/0!"},{"$f":"IF(CX4=0,\"wait\",AVERAGE(CX$20:CX$39)+2*_xlfn.STDEV.S(CX$20:CX$39))","v":{"$error":"#DIV/0!"}},{"$error":"#DIV/0!"},{"$error":"#DIV/0!"},"wait"]
[null,null,null,null,"下限バンド（－２σ）",{"$f":"IF(F4=0,\"wait\",AVERAGE(F$20:F$39)-2*_xlfn.STDEV.S(F$20:F$39))","v":{"$error":"#DIV/0!"}},{"$error":"#DIV/0!"},{"$error":"#DIV/0!"},{"$error":"#DIV/0!"},{"$error":"#DIV/0!"},{"$error":"#DIV/0!"},{"$error":"#DIV/0!"},{"$error":"#DIV/0!"},{"$error":"#DIV/0!"},{"$error":"#DIV/0!"},{"$error":"#DIV/0!"},{"$error":"#DIV/0!"},{"$error":"#DIV/0!"},{"$error":"#DIV/0!"},{"$error":"#DIV/0!"},{"$error":"#DIV/0!"},{"$error":"#DIV/0!"},{"$error":"#DIV/0!"},{"$error":"#DIV/0!"},{"$error":"#DIV/0!"},{"$error":"#DIV/0!"},{"$error":"#DIV/0!"},{"$error":"#DIV/0!"},{"$error":"#DIV/0!"},{"$error":"#DIV/0!"},{"$error":"#DIV/0!"},{"$error":"#DIV/0!"},{"$error":"#DIV/0!"},{"$error":"#DIV/0!"},{"$error":"#DIV/0!"},{"$error":"#DIV/0!"},{"$error":"#DIV/0!"},{"$f":"IF(AL4=0,\"wait\",AVERAGE(AL$20:AL$39)-2*_xlfn.STDEV.S(AL$20:AL$39))","v":{"$error":"#DIV/0!"}},{"$error":"#DIV/0!"},{"$error":"#DIV/0!"},{"$error":"#DIV/0!"},{"$error":"#DIV/0!"},{"$error":"#DIV/0!"},{"$error":"#DIV/0!"},{"$error":"#DIV/0!"},{"$error":"#DIV/0!"},{"$error":"#DIV/0!"},{"$error":"#DIV/0!"},{"$error":"#DIV/0!"},{"$error":"#DIV/0!"},{"$error":"#DIV/0!"},{"$error":"#DIV/0!"},{"$error":"#DIV/0!"},{"$error":"#DIV/0!"},{"$error":"#DIV/0!"},{"$error":"#DIV/0!"},{"$error":"#DIV/0!"},{"$error":"#DIV/0!"},{"$error":"#DIV/0!"},{"$error":"#DIV/0!"},{"$error":"#DIV/0!"},{"$error":"#DIV/0!"},{"$error":"#DIV/0!"},{"$error":"#DIV/0!"},{"$error":"#DIV/0!"},{"$error":"#DIV/0!"},{"$error":"#DIV/0!"},{"$error":"#DIV/0!"},{"$error":"#DIV/0!"},{"$f":"IF(BR4=0,\"wait\",AVERAGE(BR$20:BR$39)-2*_xlfn.STDEV.S(BR$20:BR$39))","v":{"$error":"#DIV/0!"}},{"$error":"#DIV/0!"},{"$error":"#DIV/0!"},{"$error":"#DIV/0!"},{"$error":"#DIV/0!"},{"$error":"#DIV/0!"},{"$error":"#DIV/0!"},{"$error":"#DIV/0!"},{"$error":"#DIV/0!"},{"$error":"#DIV/0!"},{"$error":"#DIV/0!"},{"$error":"#DIV/0!"},{"$error":"#DIV/0!"},{"$error":"#DIV/0!"},{"$error":"#DIV/0!"},{"$error":"#DIV/0!"},{"$error":"#DIV/0!"},{"$error":"#DIV/0!"},{"$error":"#DIV/0!"},{"$error":"#DIV/0!"},{"$error":"#DIV/0!"},{"$error":"#DIV/0!"},{"$error":"#DIV/0!"},{"$error":"#DIV/0!"},{"$error":"#DIV/0!"},{"$error":"#DIV/0!"},{"$error":"#DIV/0!"},{"$error":"#DIV/0!"},{"$error":"#DIV/0!"},{"$error":"#DIV/0!"},{"$error":"#DIV/0!"},{"$error":"#DIV/0!"},{"$error":"#DIV/0!"},{"$error":"#DIV/0!"},{"$error":"#DIV/0!"},"wait"]
["起動フラグ　（１以外は停止）"]
[0,null,null,null,{"$f":"IF($A$8=1,_xll.SNT.StockHist(TRUE,F4,\"1D\",30,\"日時@終値\"),\"wait\")","v":"wait"}]
{"$rows_left_out":32}
{"sheet":"バックテストデータ_5D_5Y","index":2,"n_rows":1562,"n_cols":9,"rows_kept":1562,"cut":false,"hidden":false,"merged":[]}
[]
["＃","銘柄コード","銘柄名","BB＋2σ 勝率","BB＋2σ 平均変化率","BB＋2σ 勝敗","BB-2σ 勝率","BB-2σ 平均変化率","BB-2σ 勝敗"]
[{"$f":"ROW()-2","v":1},1301,"極洋",0.5393,-2.18E-2,"48勝41敗",0.65710000000000002,2.6800000000000001E-2,"23勝12敗"]
[{"$f":"ROW()-2","v":2},1332,"ニッスイ",0.54790000000000005,-2.8000000000000001E-2,"40勝33敗",0.56520000000000004,3.3000000000000002E-2,"26勝20敗"]
[3,1333,"マルハニチロ",0.57579999999999998,-1.6199999999999999E-2,"38勝28敗",0.61019999999999996,2.4E-2,"36勝23敗"]
[4,1377,"サカタのタネ",0.65,-2.7900000000000001E-2,"39勝21敗",0.45610000000000001,4.0899999999999999E-2,"26勝31敗"]
[5,1379,"ホクト",0.60709999999999997,-1.44E-2,"34勝22敗",0.47539999999999999,1.47E-2,"29勝32敗"]
[6,1414,"ショーボンドホールディングス",0.55220000000000002,-2.1700000000000001E-2,"37勝30敗",0.4839,2.2499999999999999E-2,"30勝32敗"]
{"$rows_left_out":1555}
{"sheet":"利用方法説明","index":3,"n_rows":38,"n_cols":39,"rows_kept":38,"cut":false,"hidden":false,"merged":[[3,25,4,32],[17,1,18,17]]}
[]
[null,"利用方法　説明"]
[]
[null,"【　はじめに　】",null,null,null,null,null,null,null,null,null,null,null,null,null,null,null,null,null,null,null,null,null,null,null,"Ａ．　銘柄一覧シート"]
[null,"同エクセルシートは４枚のシートで構成されています。"]
[]
[]
[]
{"$rows_left_out":30}