{"text_format":"1","workbook":"xlsx","n_sheets":4,"sheets":["銘柄一覧シート","ヒストリカルデータ取得シート","バックテストデータ_5D_5Y","利用方法説明"],"not_rendered":{"charts":0,"images":3,"macros":1,"external_links":0,"defined_names":1,"comments":0,"pivot_tables":0},"unopened":[],"bounds":{"document_bytes":16777216,"sheet_cells":100000,"rows_first":2000,"rows_last":500,"rows_between":2000,"halvings":0,"cell_chars":16384,"cell_head_chars":4096},"cells_cut":0,"cells_raw":0,"read":"whole","date_system":"1900"}

{"sheet":"銘柄一覧シート","index":0,"n_rows":105,"n_cols":19,"rows_kept":105,"cut":false,"hidden":false,"merged":[]}
[{"$f":"ヒストリカルデータ取得シート!A2","v":"更新日時 2025/03/04 09:27:56"}]
[null,"TOPIX100銘柄",null,null,"リアルタイム更新　エリア",null,null,null,null,null,null,"ヒストリカルデータ　エリア",null,null,null,"バックテスト勝敗エリア　（5営業日後成績）"]
[null,null,null,null,null,null,null,null,null,null,null,"ボリンジャーバンド (20日)",null,null,null,"ヒストリカルデータ（５年　2024年12月末まで）"]
[null,null,null,null,null,null,null,null,null,null,null,null,null,{"$f":"MID(ヒストリカルデータ取得シート!$E$39,1,10)&\"分迄\"","v":"分迄"},null,"　上限到達時シグナル",null,"　下限到達時シグナル"]
["＃","銘柄コード","銘柄名","上場部","現値","前日終値","前日比","時間","Tick回数","ＶＷＡＰ",null,"（＋2σ）","ゲージ","(－2σ)",null,"勝敗","平均変化率","勝敗","平均変化率"]
[1,1925,{"$f":"IF(B6=0,\"wait\",_xll.SNT.StockInst(B6,\"銘柄名称\"))","v":{"$error":"#NAME?"}},{"$f":"IF(B6=0,\"wait\",_xll.SNT.StockInst(B6,\"上場部\"))","v":{"$error":"#NAME?"}},{"$f":"IF(B6=0,\"wait\",_xll.SNT.StockInst(B6,\"現値\"))","v":{"$error":"#NAME?"}},{"$f":"IF(B6=0,\"wait\",_xll.SNT.StockInst(B6,\"前日終値\"))","v":{"$error":"#NAME?"}},{"$f":"IFERROR(E6-F6,\"wait\")","v":"wait"},{"$f":"IF(B6=0,\"wait\",MID(_xll.SNT.StockInst(B6,\"現値日時\"),12,5))","v":{"$error":"#NAME?"}},{"$f":"IF(B6=0,\"wait\",_xll.SNT.StockInst(B6,\"Tick回数\"))","v":{"$error":"#NAME?"}},{"$f":"IF(B6=0,\"wait\",_xll.SNT.StockInst(B6,\"VWAP\"))","v":{"$error":"#NAME?"}},null,{"$f":"IFERROR(INDEX(ヒストリカルデータ取得シート!$F$5:$DA$5, ROW(A1)),\"-\")","v":"-"},{"$f":"IFERROR((E6-N6)/(L6-N6),\"\")","v":""},{"$f":"IFERROR(INDEX(ヒストリカルデータ取得シート!$F$6:$DA$6, ROW(A1)),\"-\")","v":"-"},null,{"$f":"IF(AND(ISNUMBER(M6), M6>1), IFERROR(VLOOKUP(B6, バックテストデータ_5D_5Y!$B$2:$I$1562, 5, FALSE), \"データ無\"), \"\")","v":""},{"$f":"IF(AND(ISNUMBER(M6), M6>1), IFERROR(VLOOKUP(B6, バックテストデータ_5D_5Y!$B$2:$I$1562, 4, FALSE), \"データ無\"), \"\")","v":""},{"$f":"IF(M6<0,IFERROR(VLOOKUP(B6,バックテストデータ_5D_5Y!$B$2:$I$1562,8,FALSE),\"データ無\"),\"\")","v":""},{"$f":"IF(M6<0,IFERROR(VLOOKUP(B6,バックテストデータ_5D_5Y!$B$2:$I$1562,7,FALSE),\"データ無\"),\"\")","v":""}]
[2,1928,{"$f":"IF(B7=0,\"wait\",_xll.SNT.StockInst(B7,\"銘柄名称\"))","v":{"$error":"#NAME?"}},{"$f":"IF(B7=0,\"wait\",_xll.SNT.StockInst(B7,\"上場部\"))","v":{"$error":"#NAME?"}},{"$f":"IF(B7=0,\"wait\",_xll.SNT.StockInst(B7,\"現値\"))","v":{"$error":"#NAME?"}},{"$f":"IF(B7=0,\"wait\",_xll.SNT.StockInst(B7,\"前日終値\"))","v":{"$error":"#NAME?"}},{"$f":"IFERROR(E7-F7,\"wait\")","v":"wait"},{"$f":"IF(B7=0,\"wait\",MID(_xll.SNT.StockInst(B7,\"現値日時\"),12,5))","v":{"$error":"#NAME?"}},{"$f":"IF(B7=0,\"wait\",_xll.SNT.StockInst(B7,\"Tick回数\"))","v":{"$error":"#NAME?"}},{"$f":"IF(B7=0,\"wait\",_xll.SNT.StockInst(B7,\"VWAP\"))","v":{"$error":"#NAME?"}},null,{"$f":"IFERROR(INDEX(ヒストリカルデータ取得シート!$F$5:$DA$5, ROW(A2)),\"-\")","v":"-"},{"$f":"IFERROR((E7-N7)/(L7-N7),\"\")","v":""},{"$f":"IFERROR(INDEX(ヒストリカルデータ取得シート!$F$6:$DA$6, ROW(A2)),\"-\")","v":"-"},null,{"$f":"IF(AND(ISNUMBER(M7), M7>1), IFERROR(VLOOKUP(B7, バックテストデータ_5D_5Y!$B$2:$I$1562, 5, FALSE), \"データ無\"), \"\")","v":""},{"$f":"IF(AND(ISNUMBER(M7), M7>1), IFERROR(VLOOKUP(B7, バックテストデータ_5D_5Y!$B$2:$I$1562, 4, FALSE), \"データ無\"), \"\")","v":""},{"$f":"IF(M7<0,IFERROR(VLOOKUP(B7,バックテストデータ_5D_5Y!$B$2:$I$1562,8,FALSE),\"データ無\"),\"\")","v":""},{"$f":"IF(M7<0,IFERROR(VLOOKUP(B7,バックテストデータ_5D_5Y!$B$2:$I$1562,7,FALSE),\"データ無\"),\"\")","v":""}]
[3,2413,{"$f":"IF(B8=0,\"wait\",_xll.SNT.StockInst(B8,\"銘柄名称\"))","v":{"$error":"#NAME?"}},{"$f":"IF(B8=0,\"wait\",_xll.SNT.StockInst(B8,\"上場部\"))","v":{"$error":"#NAME?"}},{"$f":"IF(B8=0,\"wait\",_xll.SNT.StockInst(B8,\"現値\"))","v":{"$error":"#NAME?"}},{"$f":"IF(B8=0,\"wait\",_xll.SNT.StockInst(B8,\"前日終値\"))","v":{"$error":"#NAME?"}},"wait",{"$f":"IF(B8=0,\"wait\",MID(_xll.SNT.StockInst(B8,\"現値日時\"),12,5))","v":{"$error":"#NAME?"}},{"$f":"IF(B8=0,\"wait\",_xll.SNT.StockInst(B8,\"Tick回数\"))","v":{"$error":"#NAME?"}},{"$f":"IF(B8=0,\"wait\",_xll.SNT.StockInst(B8,\"VWAP\"))","v":{"$error":"#NAME?"}},null,{"$f":"IFERROR(INDEX(ヒストリカルデータ取得シート!$F$5:$DA$5, ROW(A3)),\"-\")","v":"-"},"",{"$f":"IFERROR(INDEX(ヒストリカルデータ取得シート!$F$6:$DA$6, ROW(A3)),\"-\")","v":"-"},null,{"$f":"IF(AND(ISNUMBER(M8), M8>1), IFERROR(VLOOKUP(B8, バックテストデータ_5D_5Y!$B$2:$I$1562, 5, FALSE), \"データ無\"), \"\")","v":""},{"$f":"IF(AND(ISNUMBER(M8), M8>1), IFERROR(VLOOKUP(B8, バックテストデータ_5D_5Y!$B$2:$I$1562, 4, FALSE), \"データ無\"), \"\")","v":""},{"$f":"IF(M8<0,IFERROR(VLOOKUP(B8,バックテストデータ_5D_5Y!$B$2:$I$1562,8,FALSE),\"データ無\"),\"\")","v":""},{"$f":"IF(M8<0,IFERROR(VLOOKUP(B8,バックテストデータ_5D_5Y!$B$2:$I$1562,7,FALSE),\"データ無\"),\"\")","v":""}]
[4,2502,{"$f":"IF(B9=0,\"wait\",_xll.SNT.StockInst(B9,\"銘柄名称\"))","v":{"$error":"#NAME?"}},{"$f":"IF(B9=0,\"wait\",_xll.SNT.StockInst(B9,\"上場部\"))","v":{"$error":"#NAME?"}},{"$f":"IF(B9=0,\"wait\",_xll.SNT.StockInst(B9,\"現値\"))","v":{"$error":"#NAME?"}},{"$f":"IF(B9=0,\"wait\",_xll.SNT.StockInst(B9,\"前日終値\"))","v":{"$error":"#NAME?"}},"wait",{"$f":"IF(B9=0,\"wait\",MID(_xll.SNT.StockInst(B9,\"現値日時\"),12,5))","v":{"$error":"#NAME?"}},{"$f":"IF(B9=0,\"wait\",_xll.SNT.StockInst(B9,\"Tick回数\"))","v":{"$error":"#NAME?"}},{"$f":"IF(B9=0,\"wait\",_xll.SNT.StockInst(B9,\"VWAP\"))","v":{"$error":"#NAME?"}},null,{"$f":"IFERROR(INDEX(ヒストリカルデータ取得シート!$F$5:$DA$5, ROW(A4)),\"-\")","v":"-"},"",{"$f":"IFERROR(INDEX(ヒストリカルデータ取得シート!$F$6:$DA$6, ROW(A4)),\"-\")","v":"-"},null,{"$f":"IF(AND(ISNUMBER(M9), M9>1), IFERROR(VLOOKUP(B9, バックテストデータ_5D_5Y!$B$2:$I$1562, 5, FALSE), \"データ無\"), \"\")","v":""},{"$f":"IF(AND(ISNUMBER(M9), M9>1), IFERROR(VLOOKUP(B9, バックテストデータ_5D_5Y!$B$2:$I$1562, 4, FALSE), \"データ無\"), \"\")","v":""},{"$f":"IF(M9<0,IFERROR(VLOOKUP(B9,バックテストデータ_5D_5Y!$B$2:$I$1562,8,FALSE),\"データ無\"),\"\")","v":""},{"$f":"IF(M9<0,IFERROR(VLOOKUP(B9,バックテストデータ_5D_5Y!$B$2:$I$1562,7,FALSE),\"データ無\"),\"\")","v":""}]
[5,2503,{"$f":"IF(B10=0,\"wait\",_xll.SNT.StockInst(B10,\"銘柄名称\"))","v":{"$error":"#NAME?"}},{"$f":"IF(B10=0,\"wait\",_xll.SNT.StockInst(B10,\"上場部\"))","v":{"$error":"#NAME?"}},{"$f":"IF(B10=0,\"wait\",_xll.SNT.StockInst(B10,\"現値\"))","v":{"$error":"#NAME?"}},{"$f":"IF(B10=0,\"wait\",_xll.SNT.StockInst(B10,\"前日終値\"))","v":{"$error":"#NAME?"}},"wait",{"$f":"IF(B10=0,\"wait\",MID(_xll.SNT.StockInst(B10,\"現値日時\"),12,5))","v":{"$error":"#NAME?"}},{"$f":"IF(B10=0,\"wait\",_xll.SNT.StockInst(B10,\"Tick回数\"))","v":{"$error":"#NAME?"}},{"$f":"IF(B10=0,\"wait\",_xll.SNT.StockInst(B10,\"VWAP\"))","v":{"$error":"#NAME?"}},null,{"$f":"IFERROR(INDEX(ヒストリカルデータ取得シート!$F$5:$DA$5, ROW(A5)),\"-\")","v":"-"},"",{"$f":"IFERROR(INDEX(ヒストリカルデータ取得シート!$F$6:$DA$6, ROW(A5)),\"-\")","v":"-"},null,{"$f":"IF(AND(ISNUMBER(M10), M10>1), IFERROR(VLOOKUP(B10, バックテストデータ_5D_5Y!$B$2:$I$1562, 5, FALSE), \"データ無\"), \"\")","v":""},{"$f":"IF(AND(ISNUMBER(M10), M10>1), IFERROR(VLOOKUP(B10, バックテストデータ_5D_5Y!$B$2:$I$1562, 4, FALSE), \"データ無\"), \"\")","v":""},{"$f":"IF(M10<0,IFERROR(VLOOKUP(B10,バックテストデータ_5D_5Y!$B$2:$I$1562,8,FALSE),\"データ無\"),\"\")","v":""},{"$f":"IF(M10<0,IFERROR(VLOOKUP(B10,バックテストデータ_5D_5Y!$B$2:$I$1562,7,FALSE),\"データ無\"),\"\")","v":""}]
[6,2802,{"$f":"IF(B11=0,\"wait\",_xll.SNT.StockInst(B11,\"銘柄名称\"))","v":{"$error":"#NAME?"}},{"$f":"IF(B11=0,\"wait\",_xll.SNT.StockInst(B11,\"上場部\"))","v":{"$error":"#NAME?"}},{"$f":"IF(B11=0,\"wait\",_xll.SNT.StockInst(B11,\"現値\"))","v":{"$error":"#NAME?"}},{"$f":"IF(B11=0,\"wait\",_xll.SNT.StockInst(B11,\"前日終値\"))","v":{"$error":"#NAME?"}},"wait",{"$f":"IF(B11=0,\"wait\",MID(_xll.SNT.StockInst(B11,\"現値日時\"),12,5))","v":{"$error":"#NAME?"}},{"$f":"IF(B11=0,\"wait\",_xll.SNT.StockInst(B11,\"Tick回数\"))","v":{"$error":"#NAME?"}},{"$f":"IF(B11=0,\"wait\",_xll.SNT.StockInst(B11,\"VWAP\"))","v":{"$error":"#NAME?"}},null,{"$f":"IFERROR(INDEX(ヒストリカルデータ取得シート!$F$5:$DA$5, ROW(A6)),\"-\")","v":"-"},"",{"$f":"IFERROR(INDEX(ヒストリカルデータ取得シート!$F$6:$DA$6, ROW(A6)),\"-\")","v":"-"},null,{"$f":"IF(AND(ISNUMBER(M11), M11>1), IFERROR(VLOOKUP(B11, バックテストデータ_5D_5Y!$B$2:$I$1562, 5, FALSE), \"データ無\"), \"\")","v":""},{"$f":"IF(AND(ISNUMBER(M11), M11>1), IFERROR(VLOOKUP(B11, バックテストデータ_5D_5Y!$B$2:$I$1562, 4, FALSE), \"データ無\"), \"\")","v":""},{"$f":"IF(M11<0,IFERROR(VLOOKUP(B11,バックテストデータ_5D_5Y!$B$2:$I$1562,8,FALSE),\"データ無\"),\"\")","v":""},{"$f":"IF(M11<0,IFERROR(VLOOKUP(B11,バックテストデータ_5D_5Y!$B$2:$I$1562,7,FALSE),\"データ無\"),\"\")","v":""}]
[7,2914,{"$f":"IF(B12=0,\"wait\",_xll.SNT.StockInst(B12,\"銘柄名称\"))","v":{"$error":"#NAME?"}},{"$f":"IF(B12=0,\"wait\",_xll.SNT.StockInst(B12,\"上場部\"))","v":{"$error":"#NAME?"}},{"$f":"IF(B12=0,\"wait\",_xll.SNT.StockInst(B12,\"現値\"))","v":{"$error":"#NAME?"}},{"$f":"IF(B12=0,\"wait\",_xll.SNT.StockInst(B12,\"前日終値\"))","v":{"$error":"#NAME?"}},"wait",{"$f":"IF(B12=0,\"wait\",MID(_xll.SNT.StockInst(B12,\"現値日時\"),12,5))","v":{"$error":"#NAME?"}},{"$f":"IF(B12=0,\"wait\",_xll.SNT.StockInst(B12,\"Tick回数\"))","v":{"$error":"#NAME?"}},{"$f":"IF(B12=0,\"wait\",_xll.SNT.StockInst(B12,\"VWAP\"))","v":{"$error":"#NAME?"}},null,{"$f":"IFERROR(INDEX(ヒストリカルデータ取得シート!$F$5:$DA$5, ROW(A7)),\"-\")","v":"-"},"",{"$f":"IFERROR(INDEX(ヒストリカルデータ取得シート!$F$6:$DA$6, ROW(A7)),\"-\")","v":"-"},null,{"$f":"IF(AND(ISNUMBER(M12), M12>1), IFERROR(VLOOKUP(B12, バックテストデータ_5D_5Y!$B$2:$I$1562, 5, FALSE), \"データ無\"), \"\")","v":""},{"$f":"IF(AND(ISNUMBER(M12), M12>1), IFERROR(VLOOKUP(B12, バックテストデータ_5D_5Y!$B$2:$I$1562, 4, FALSE), \"データ無\"), \"\")","v":""},{"$f":"IF(M12<0,IFERROR(VLOOKUP(B12,バックテストデータ_5D_5Y!$B$2:$I$1562,8,FALSE),\"データ無\"),\"\")","v":""},{"$f":"IF(M12<0,IFERROR(VLOOKUP(B12,バックテストデータ_5D_5Y!$B$2:$I$1562,7,FALSE),\"データ無\"),\"\")","v":""}]
[8,3382,{"$f":"IF(B13=0,\"wait\",_xll.SNT.StockInst(B13,\"銘柄名称\"))","v":{"$error":"#NAME?"}},{"$f":"IF(B13=0,\"wait\",_xll.SNT.StockInst(B13,\"上場部\"))","v":{"$error":"#NAME?"}},{"$f":"IF(B13=0,\"wait\",_xll.SNT.StockInst(B13,\"現値\"))","v":{"$error":"#NAME?"}},{"$f":"IF(B13=0,\"wait\",_xll.SNT.StockInst(B13,\"前日終値\"))","v":{"$error":"#NAME?"}},"wait",{"$f":"IF(B13=0,\"wait\",MID(_xll.SNT.StockInst(B13,\"現値日時\"),12,5))","v":{"$error":"#NAME?"}},{"$f":"IF(B13=0,\"wait\",_xll.SNT.StockInst(B13,\"Tick回数\"))","v":{"$error":"#NAME?"}},{"$f":"IF(B13=0,\"wait\",_xll.SNT.StockInst(B13,\"VWAP\"))","v":{"$error":"#NAME?"}},null,{"$f":"IFERROR(INDEX(ヒストリカルデータ取得シート!$F$5:$DA$5, ROW(A8)),\"-\")","v":"-"},"",{"$f":"IFERROR(INDEX(ヒストリカルデータ取得シート!$F$6:$DA$6, ROW(A8)),\"-\")","v":"-"},null,{"$f":"IF(AND(ISNUMBER(M13), M13>1), IFERROR(VLOOKUP(B13, バックテストデータ_5D_5Y!$B$2:$I$1562, 5, FALSE), \"データ無\"), \"\")","v":""},{"$f":"IF(AND(ISNUMBER(M13), M13>1), IFERROR(VLOOKUP(B13, バックテストデータ_5D_5Y!$B$2:$I$1562, 4, FALSE), \"データ無\"), \"\")","v":""},{"$f":"IF(M13<0,IFERROR(VLOOKUP(B13,バックテストデータ_5D_5Y!$B$2:$I$1562,8,FALSE),\"データ無\"),\"\")","v":""},{"$f":"IF(M13<0,IFERROR(VLOOKUP(B13,バックテストデータ_5D_5Y!$B$2:$I$1562,7,FALSE),\"データ無\"),\"\")","v":""}]
[9,3402,{"$f":"IF(B14=0,\"wait\",_xll.SNT.StockInst(B14,\"銘柄名称\"))","v":{"$error":"#NAME?"}},{"$f":"IF(B14=0,\"wait\",_xll.SNT.StockInst(B14,\"上場部\"))","v":{"$error":"#NAME?"}},{"$f":"IF(B14=0,\"wait\",_xll.SNT.StockInst(B14,\"現値\"))","v":{"$error":"#NAME?"}},{"$f":"IF(B14=0,\"wait\",_xll.SNT.StockInst(B14,\"前日終値\"))","v":{"$error":"#NAME?"}},"wait",{"$f":"IF(B14=0,\"wait\",MID(_xll.SNT.StockInst(B14,\"現値日時\"),12,5))","v":{"$error":"#NAME?"}},{"$f":"IF(B14=0,\"wait\",_xll.SNT.StockInst(B14,\"Tick回数\"))","v":{"$error":"#NAME?"}},{"$f":"IF(B14=0,\"wait\",_xll.SNT.StockInst(B14,\"VWAP\"))","v":{"$error":"#NAME?"}},null,{"$f":"IFERROR(INDEX(ヒストリカルデータ取得シート!$F$5:$DA$5, ROW(A9)),\"-\")","v":"-"},"",{"$f":"IFERROR(INDEX(ヒストリカルデータ取得シート!$F$6:$DA$6, ROW(A9)),\"-\")","v":"-"},null,{"$f":"IF(AND(ISNUMBER(M14), M14>1), IFERROR(VLOOKUP(B14, バックテストデータ_5D_5Y!$B$2:$I$1562, 5, FALSE), \"データ無\"), \"\")","v":""},{"$f":"IF(AND(ISNUMBER(M14), M14>1), IFERROR(VLOOKUP(B14, バックテストデータ_5D_5Y!$B$2:$I$1562, 4, FALSE), \"データ無\"), \"\")","v":""},{"$f":"IF(M14<0,IFERROR(VLOOKUP(B14,バックテストデータ_5D_5Y!$B$2:$I$1562,8,FALSE),\"データ無\"),\"\")","v":""},{"$f":"IF(M14<0,IFERROR(VLOOKUP(B14,バックテストデータ_5D_5Y!$B$2:$I$1562,7,FALSE),\"データ無\"),\"\")","v":""}]
[10,3407,{"$f":"IF(B15=0,\"wait\",_xll.SNT.StockInst(B15,\"銘柄名称\"))","v":{"$error":"#NAME?"}},{"$f":"IF(B15=0,\"wait\",_xll.SNT.StockInst(B15,\"上場部\"))","v":{"$error":"#NAME?"}},{"$f":"IF(B15=0,\"wait\",_xll.SNT.StockInst(B15,\"現値\"))","v":{"$error":"#NAME?"}},{"$f":"IF(B15=0,\"wait\",_xll.SNT.StockInst(B15,\"前日終値\"))","v":{"$error":"#NAME?"}},"wait",{"$f":"IF(B15=0,\"wait\",MID(_xll.SNT.StockInst(B15,\"現値日時\"),12,5))","v":{"$error":"#NAME?"}},{"$f":"IF(B15=0,\"wait\",_xll.SNT.StockInst(B15,\"Tick回数\"))","v":{"$error":"#NAME?"}},{"$f":"IF(B15=0,\"wait\",_xll.SNT.StockInst(B15,\"VWAP\"))","v":{"$error":"#NAME?"}},null,{"$f":"IFERROR(INDEX(ヒストリカルデータ取得シート!$F$5:$DA$5, ROW(A10)),\"-\")","v":"-"},"",{"$f":"IFERROR(INDEX(ヒストリカルデータ取得シート!$F$6:$DA$6, ROW(A10)),\"-\")","v":"-"},null,{"$f":"IF(AND(ISNUMBER(M15), M15>1), IFERROR(VLOOKUP(B15, バックテストデータ_5D_5Y!$B$2:$I$1562, 5, FALSE), \"データ無\"), \"\")","v":""},{"$f":"IF(AND(ISNUMBER(M15), M15>1), IFERROR(VLOOKUP(B15, バックテストデータ_5D_5Y!$B$2:$I$1562, 4, FALSE), \"データ無\"), \"\")","v":""},{"$f":"IF(M15<0,IFERROR(VLOOKUP(B15,バックテストデータ_5D_5Y!$B$2:$I$1562,8,FALSE),\"データ無\"),\"\")","v":""},{"$f":"IF(M15<0,IFERROR(VLOOKUP(B15,バックテストデータ_5D_5Y!$B$2:$I$1562,7,FALSE),\"データ無\"),\"\")","v":""}]
[11,4063,{"$f":"IF(B16=0,\"wait\",_xll.SNT.StockInst(B16,\"銘柄名称\"))","v":{"$error":"#NAME?"}},{"$f":"IF(B16=0,\"wait\",_xll.SNT.StockInst(B16,\"上場部\"))","v":{"$error":"#NAME?"}},{"$f":"IF(B16=0,\"wait\",_xll.SNT.StockInst(B16,\"現値\"))","v":{"$error":"#NAME?"}},{"$f":"IF(B16=0,\"wait\",_xll.SNT.StockInst(B16,\"前日終値\"))","v":{"$error":"#NAME?"}},"wait",{"$f":"IF(B16=0,\"wait\",MID(_xll.SNT.StockInst(B16,\"現値日時\"),12,5))","v":{"$error":"#NAME?"}},{"$f":"IF(B16=0,\"wait\",_xll.SNT.StockInst(B16,\"Tick回数\"))","v":{"$error":"#NAME?"}},{"$f":"IF(B16=0,\"wait\",_xll.SNT.StockInst(B16,\"VWAP\"))","v":{"$error":"#NAME?"}},null,{"$f":"IFERROR(INDEX(ヒストリカルデータ取得シート!$F$5:$DA$5, ROW(A11)),\"-\")","v":"-"},"",{"$f":"IFERROR(INDEX(ヒストリカルデータ取得シート!$F$6:$DA$6, ROW(A11)),\"-\")","v":"-"},null,{"$f":"IF(AND(ISNUMBER(M16), M16>1), IFERROR(VLOOKUP(B16, バックテストデータ_5D_5Y!$B$2:$I$1562, 5, FALSE), \"データ無\"), \"\")","v":""},{"$f":"IF(AND(ISNUMBER(M16), M16>1), IFERROR(VLOOKUP(B16, バックテストデータ_5D_5Y!$B$2:$I$1562, 4, FALSE), \"データ無\"), \"\")","v":""},{"$f":"IF(M16<0,IFERROR(VLOOKUP(B16,バックテストデータ_5D_5Y!$B$2:$I$1562,8,FALSE),\"データ無\"),\"\")","v":""},{"$f":"IF(M16<0,IFERROR(VLOOKUP(B16,バックテストデータ_5D_5Y!$B$2:$I$1562,7,FALSE),\"データ無\"),\"\")","v":""}]
[12,4188,{"$f":"IF(B17=0,\"wait\",_xll.SNT.StockInst(B17,\"銘柄名称\"))","v":{"$error":"#NAME?"}},{"$f":"IF(B17=0,\"wait\",_xll.SNT.StockInst(B17,\"上場部\"))","v":{"$error":"#NAME?"}},{"$f":"IF(B17=0,\"wait\",_xll.SNT.StockInst(B17,\"現値\"))","v":{"$error":"#NAME?"}},{"$f":"IF(B17=0,\"wait\",_xll.SNT.StockInst(B17,\"前日終値\"))","v":{"$error":"#NAME?"}},"wait",{"$f":"IF(B17=0,\"wait\",MID(_xll.SNT.StockInst(B17,\"現値日時\"),12,5))","v":{"$error":"#NAME?"}},{"$f":"IF(B17=0,\"wait\",_xll.SNT.StockInst(B17,\"Tick回数\"))","v":{"$error":"#NAME?"}},{"$f":"IF(B17=0,\"wait\",_xll.SNT.StockInst(B17,\"VWAP\"))","v":{"$error":"#NAME?"}},null,{"$f":"IFERROR(INDEX(ヒストリカルデータ取得シート!$F$5:$DA$5, ROW(A12)),\"-\")","v":"-"},"",{"$f":"IFERROR(INDEX(ヒストリカルデータ取得シート!$F$6:$DA$6, ROW(A12)),\"-\")","v":"-"},null,{"$f":"IF(AND(ISNUMBER(M17), M17>1), IFERROR(VLOOKUP(B17, バックテストデータ_5D_5Y!$B$2:$I$1562, 5, FALSE), \"データ無\"), \"\")","v":""},{"$f":"IF(AND(ISNUMBER(M17), M17>1), IFERROR(VLOOKUP(B17, バックテストデータ_5D_5Y!$B$2:$I$1562, 4, FALSE), \"データ無\"), \"\")","v":""},{"$f":"IF(M17<0,IFERROR(VLOOKUP(B17,バックテストデータ_5D_5Y!$B$2:$I$1562,8,FALSE),\"データ無\"),\"\")","v":""},{"$f":"IF(M17<0,IFERROR(VLOOKUP(B17,バックテストデータ_5D_5Y!$B$2:$I$1562,7,FALSE),\"データ無\"),\"\")","v":""}]
[13,4452,{"$f":"IF(B18=0,\"wait\",_xll.SNT.StockInst(B18,\"銘柄名称\"))","v":{"$error":"#NAME?"}},{"$f":"IF(B18=0,\"wait\",_xll.SNT.StockInst(B18,\"上場部\"))","v":{"$error":"#NAME?"}},{"$f":"IF(B18=0,\"wait\",_xll.SNT.StockInst(B18,\"現値\"))","v":{"$error":"#NAME?"}},{"$f":"IF(B18=0,\"wait\",_xll.SNT.StockInst(B18,\"前日終値\"))","v":{"$error":"#NAME?"}},"wait",{"$f":"IF(B18=0,\"wait\",MID(_xll.SNT.StockInst(B18,\"現値日時\"),12,5))","v":{"$error":"#NAME?"}},{"$f":"IF(B18=0,\"wait\",_xll.SNT.StockInst(B18,\"Tick回数\"))","v":{"$error":"#NAME?"}},{"$f":"IF(B18=0,\"wait\",_xll.SNT.StockInst(B18,\"VWAP\"))","v":{"$error":"#NAME?"}},null,{"$f":"IFERROR(INDEX(ヒストリカルデータ取得シート!$F$5:$DA$5, ROW(A13)),\"-\")","v":"-"},"",{"$f":"IFERROR(INDEX(ヒストリカルデータ取得シート!$F$6:$DA$6, ROW(A13)),\"-\")","v":"-"},null,{"$f":"IF(AND(ISNUMBER(M18), M18>1), IFERROR(VLOOKUP(B18, バックテストデータ_5D_5Y!$B$2:$I$1562, 5, FALSE), \"データ無\"), \"\")","v":""},{"$f":"IF(AND(ISNUMBER(M18), M18>1), IFERROR(VLOOKUP(B18, バックテストデータ_5D_5Y!$B$2:$I$1562, 4, FALSE), \"データ無\"), \"\")","v":""},{"$f":"IF(M18<0,IFERROR(VLOOKUP(B18,バックテストデータ_5D_5Y!$B$2:$I$1562,8,FALSE),\"データ無\"),\"\")","v":""},{"$f":"IF(M18<0,IFERROR(VLOOKUP(B18,バックテストデータ_5D_5Y!$B$2:$I$1562,7,FALSE),\"データ無\"),\"\")","v":""}]
[14,4502,{"$f":"IF(B19=0,\"wait\",_xll.SNT.StockInst(B19,\"銘柄名称\"))","v":{"$error":"#NAME?"}},{"$f":"IF(B19=0,\"wait\",_xll.SNT.StockInst(B19,\"上場部\"))","v":{"$error":"#NAME?"}},{"$f":"IF(B19=0,\"wait\",_xll.SNT.StockInst(B19,\"現値\"))","v":{"$error":"#NAME?"}},{"$f":"IF(B19=0,\"wait\",_xll.SNT.StockInst(B19,\"前日終値\"))","v":{"$error":"#NAME?"}},"wait",{"$f":"IF(B19=0,\"wait\",MID(_xll.SNT.StockInst(B19,\"現値日時\"),12,5))","v":{"$error":"#NAME?"}},{"$f":"IF(B19=0,\"wait\",_xll.SNT.StockInst(B19,\"Tick回数\"))","v":{"$error":"#NAME?"}},{"$f":"IF(B19=0,\"wait\",_xll.SNT.StockInst(B19,\"VWAP\"))","v":{"$error":"#NAME?"}},null,{"$f":"IFERROR(INDEX(ヒストリカルデータ取得シート!$F$5:$DA$5, ROW(A14)),\"-\")","v":"-"},"",{"$f":"IFERROR(INDEX(ヒストリカルデータ取得シート!$F$6:$DA$6, ROW(A14)),\"-\")","v":"-"},null,{"$f":"IF(AND(ISNUMBER(M19), M19>1), IFERROR(VLOOKUP(B19, バックテストデータ_5D_5Y!$B$2:$I$1562, 5, FALSE), \"データ無\"), \"\")","v":""},{"$f":"IF(AND(ISNUMBER(M19), M19>1), IFERROR(VLOOKUP(B19, バックテストデータ_5D_5Y!$B$2:$I$1562, 4, FALSE), \"データ無\"), \"\")","v":""},{"$f":"IF(M19<0,IFERROR(VLOOKUP(B19,バックテストデータ_5D_5Y!$B$2:$I$1562,8,FALSE),\"データ無\"),\"\")","v":""},{"$f":"IF(M19<0,IFERROR(VLOOKUP(B19,バックテストデータ_5D_5Y!$B$2:$I$1562,7,FALSE),\"データ無\"),\"\")","v":""}]
[15,4503,{"$f":"IF(B20=0,\"wait\",_xll.SNT.StockInst(B20,\"銘柄名称\"))","v":{"$error":"#NAME?"}},{"$f":"IF(B20=0,\"wait\",_xll.SNT.StockInst(B20,\"上場部\"))","v":{"$error":"#NAME?"}},{"$f":"IF(B20=0,\"wait\",_xll.SNT.StockInst(B20,\"現値\"))","v":{"$error":"#NAME?"}},{"$f":"IF(B20=0,\"wait\",_xll.SNT.StockInst(B20,\"前日終値\"))","v":{"$error":"#NAME?"}},"wait",{"$f":"IF(B20=0,\"wait\",MID(_xll.SNT.StockInst(B20,\"現値日時\"),12,5))","v":{"$error":"#NAME?"}},{"$f":"IF(B20=0,\"wait\",_xll.SNT.StockInst(B20,\"Tick回数\"))","v":{"$error":"#NAME?"}},{"$f":"IF(B20=0,\"wait\",_xll.SNT.StockInst(B20,\"VWAP\"))","v":{"$error":"#NAME?"}},null,{"$f":"IFERROR(INDEX(ヒストリカルデータ取得シート!$F$5:$DA$5, ROW(A15)),\"-\")","v":"-"},"",{"$f":"IFERROR(INDEX(ヒストリカルデータ取得シート!$F$6:$DA$6, ROW(A15)),\"-\")","v":"-"},null,{"$f":"IF(AND(ISNUMBER(M20), M20>1), IFERROR(VLOOKUP(B20, バックテストデータ_5D_5Y!$B$2:$I$1562, 5, FALSE), \"データ無\"), \"\")","v":""},{"$f":"IF(AND(ISNUMBER(M20), M20>1), IFERROR(VLOOKUP(B20, バックテストデータ_5D_5Y!$B$2:$I$1562, 4, FALSE), \"データ無\"), \"\")","v":""},{"$f":"IF(M20<0,IFERROR(VLOOKUP(B20,バックテストデータ_5D_5Y!$B$2:$I$1562,8,FALSE),\"データ無\"),\"\")","v":""},{"$f":"IF(M20<0,IFERROR(VLOOKUP(B20,バックテストデータ_5D_5Y!$B$2:$I$1562,7,FALSE),\"データ無\"),\"\")","v":""}]
[16,4507,{"$f":"IF(B21=0,\"wait\",_xll.SNT.StockInst(B21,\"銘柄名称\"))","v":{"$error":"#NAME?"}},{"$f":"IF(B21=0,\"wait\",_xll.SNT.StockInst(B21,\"上場部\"))","v":{"$error":"#NAME?"}},{"$f":"IF(B21=0,\"wait\",_xll.SNT.StockInst(B21,\"現値\"))","v":{"$error":"#NAME?"}},{"$f":"IF(B21=0,\"wait\",_xll.SNT.StockInst(B21,\"前日終値\"))","v":{"$error":"#NAME?"}},"wait",{"$f":"IF(B21=0,\"wait\",MID(_xll.SNT.StockInst(B21,\"現値日時\"),12,5))","v":{"$error":"#NAME?"}},{"$f":"IF(B21=0,\"wait\",_xll.SNT.StockInst(B21,\"Tick回数\"))","v":{"$error":"#NAME?"}},{"$f":"IF(B21=0,\"wait\",_xll.SNT.StockInst(B21,\"VWAP\"))","v":{"$error":"#NAME?"}},null,{"$f":"IFERROR(INDEX(ヒストリカルデータ取得シート!$F$5:$DA$5, ROW(A16)),\"-\")","v":"-"},"",{"$f":"IFERROR(INDEX(ヒストリカルデータ取得シート!$F$6:$DA$6, ROW(A16)),\"-\")","v":"-"},null,{"$f":"IF(AND(ISNUMBER(M21), M21>1), IFERROR(VLOOKUP(B21, バックテストデータ_5D_5Y!$B$2:$I$1562, 5, FALSE), \"データ無\"), \"\")","v":""},{"$f":"IF(AND(ISNUMBER(M21), M21>1), IFERROR(VLOOKUP(B21, バックテストデータ_5D_5Y!$B$2:$I$1562, 4, FALSE), \"データ無\"), \"\")","v":""},{"$f":"IF(M21<0,IFERROR(VLOOKUP(B21,バックテストデータ_5D_5Y!$B$2:$I$1562,8,FALSE),\"データ無\"),\"\")","v":""},{"$f":"IF(M21<0,IFERROR(VLOOKUP(B21,バックテストデータ_5D_5Y!$B$2:$I$1562,7,FALSE),\"データ無\"),\"\")","v":""}]
[17,4519,{"$f":"IF(B22=0,\"wait\",_xll.SNT.StockInst(B22,\"銘柄名称\"))","v":{"$error":"#NAME?"}},{"$f":"IF(B22=0,\"wait\",_xll.SNT.StockInst(B22,\"上場部\"))","v":{"$error":"#NAME?"}},{"$f":"IF(B22=0,\"wait\",_xll.SNT.StockInst(B22,\"現値\"))","v":{"$error":"#NAME?"}},{"$f":"IF(B22=0,\"wait\",_xll.SNT.StockInst(B22,\"前日終値\"))","v":{"$error":"#NAME?"}},"wait",{"$f":"IF(B22=0,\"wait\",MID(_xll.SNT.StockInst(B22,\"現値日時\"),12,5))","v":{"$error":"#NAME?"}},{"$f":"IF(B22=0,\"wait\",_xll.SNT.StockInst(B22,\"Tick回数\"))","v":{"$error":"#NAME?"}},{"$f":"IF(B22=0,\"wait\",_xll.SNT.StockInst(B22,\"VWAP\"))","v":{"$error":"#NAME?"}},null,{"$f":"IFERROR(INDEX(ヒストリカルデータ取得シート!$F$5:$DA$5, ROW(A17)),\"-\")","v":"-"},"",{"$f":"IFERROR(INDEX(ヒストリカルデータ取得シート!$F$6:$DA$6, ROW(A17)),\"-\")","v":"-"},null,{"$f":"IF(AND(ISNUMBER(M22), M22>1), IFERROR(VLOOKUP(B22, バックテストデータ_5D_5Y!$B$2:$I$1562, 5, FALSE), \"データ無\"), \"\")","v":""},{"$f":"IF(AND(ISNUMBER(M22), M22>1), IFERROR(VLOOKUP(B22, バックテストデータ_5D_5Y!$B$2:$I$1562, 4, FALSE), \"データ無\"), \"\")","v":""},{"$f":"IF(M22<0,IFERROR(VLOOKUP(B22,バックテストデータ_5D_5Y!$B$2:$I$1562,8,FALSE),\"データ無\"),\"\")","v":""},{"$f":"IF(M22<0,IFERROR(VLOOKUP(B22,バックテストデータ_5D_5Y!$B$2:$I$1562,7,FALSE),\"データ無\"),\"\")","v":""}]
[18,4523,{"$f":"IF(B23=0,\"wait\",_xll.SNT.StockInst(B23,\"銘柄名称\"))","v":{"$error":"#NAME?"}},{"$f":"IF(B23=0,\"wait\",_xll.SNT.StockInst(B23,\"上場部\"))","v":{"$error":"#NAME?"}},{"$f":"IF(B23=0,\"wait\",_xll.SNT.StockInst(B23,\"現値\"))","v":{"$error":"#NAME?"}},{"$f":"IF(B23=0,\"wait\",_xll.SNT.StockInst(B23,\"前日終値\"))","v":{"$error":"#NAME?"}},"wait",{"$f":"IF(B23=0,\"wait\",MID(_xll.SNT.StockInst(B23,\"現値日時\"),12,5))","v":{"$error":"#NAME?"}},{"$f":"IF(B23=0,\"wait\",_xll.SNT.StockInst(B23,\"Tick回数\"))","v":{"$error":"#NAME?"}},{"$f":"IF(B23=0,\"wait\",_xll.SNT.StockInst(B23,\"VWAP\"))","v":{"$error":"#NAME?"}},null,{"$f":"IFERROR(INDEX(ヒストリカルデータ取得シート!$F$5:$DA$5, ROW(A18)),\"-\")","v":"-"},"",{"$f":"IFERROR(INDEX(ヒストリカルデータ取得シート!$F$6:$DA$6, ROW(A18)),\"-\")","v":"-"},null,{"$f":"IF(AND(ISNUMBER(M23), M23>1), IFERROR(VLOOKUP(B23, バックテストデータ_5D_5Y!$B$2:$I$1562, 5, FALSE), \"データ無\"), \"\")","v":""},{"$f":"IF(AND(ISNUMBER(M23), M23>1), IFERROR(VLOOKUP(B23, バックテストデータ_5D_5Y!$B$2:$I$1562, 4, FALSE), \"データ無\"), \"\")","v":""},{"$f":"IF(M23<0,IFERROR(VLOOKUP(B23,バックテストデータ_5D_5Y!$B$2:$I$1562,8,FALSE),\"データ無\"),\"\")","v":""},{"$f":"IF(M23<0,IFERROR(VLOOKUP(B23,バックテストデータ_5D_5Y!$B$2:$I$1562,7,FALSE),\"データ無\"),\"\")","v":""}]
[19,4528,{"$f":"IF(B24=0,\"wait\",_xll.SNT.StockInst(B24,\"銘柄名称\"))","v":{"$error":"#NAME?"}},{"$f":"IF(B24=0,\"wait\",_xll.SNT.StockInst(B24,\"上場部\"))","v":{"$error":"#NAME?"}},{"$f":"IF(B24=0,\"wait\",_xll.SNT.StockInst(B24,\"現値\"))","v":{"$error":"#NAME?"}},{"$f":"IF(B24=0,\"wait\",_xll.SNT.StockInst(B24,\"前日終値\"))","v":{"$error":"#NAME?"}},"wait",{"$f":"IF(B24=0,\"wait\",MID(_xll.SNT.StockInst(B24,\"現値日時\"),12,5))","v":{"$error":"#NAME?"}},{"$f":"IF(B24=0,\"wait\",_xll.SNT.StockInst(B24,\"Tick回数\"))","v":{"$error":"#NAME?"}},{"$f":"IF(B24=0,\"wait\",_xll.SNT.StockInst(B24,\"VWAP\"))","v":{"$error":"#NAME?"}},null,{"$f":"IFERROR(INDEX(ヒストリカルデータ取得シート!$F$5:$DA$5, ROW(A19)),\"-\")","v":"-"},"",{"$f":"IFERROR(INDEX(ヒストリカルデータ取得シート!$F$6:$DA$6, ROW(A19)),\"-\")","v":"-"},null,{"$f":"IF(AND(ISNUMBER(M24), M24>1), IFERROR(VLOOKUP(B24, バックテストデータ_5D_5Y!$B$2:$I$1562, 5, FALSE), \"データ無\"), \"\")","v":""},{"$f":"IF(AND(ISNUMBER(M24), M24>1), IFERROR(VLOOKUP(B24, バックテストデータ_5D_5Y!$B$2:$I$1562, 4, FALSE), \"データ無\"), \"\")","v":""},{"$f":"IF(M24<0,IFERROR(VLOOKUP(B24,バックテストデータ_5D_5Y!$B$2:$I$1562,8,FALSE),\"データ無\"),\"\")","v":""},{"$f":"IF(M24<0,IFERROR(VLOOKUP(B24,バックテストデータ_5D_5Y!$B$2:$I$1562,7,FALSE),\"データ無\"),\"\")","v":""}]
[20,4543,{"$f":"IF(B25=0,\"wait\",_xll.SNT.StockInst(B25,\"銘柄名称\"))","v":{"$error":"#NAME?"}},{"$f":"IF(B25=0,\"wait\",_xll.SNT.StockInst(B25,\"上場部\"))","v":{"$error":"#NAME?"}},{"$f":"IF(B25=0,\"wait\",_xll.SNT.StockInst(B25,\"現値\"))","v":{"$error":"#NAME?"}},{"$f":"IF(B25=0,\"wait\",_xll.SNT.StockInst(B25,\"前日終値\"))","v":{"$error":"#NAME?"}},"wait",{"$f":"IF(B25=0,\"wait\",MID(_xll.SNT.StockInst(B25,\"現値日時\"),12,5))","v":{"$error":"#NAME?"}},{"$f":"IF(B25=0,\"wait\",_xll.SNT.StockInst(B25,\"Tick回数\"))","v":{"$error":"#NAME?"}},{"$f":"IF(B25=0,\"wait\",_xll.SNT.StockInst(B25,\"VWAP\"))","v":{"$error":"#NAME?"}},null,{"$f":"IFERROR(INDEX(ヒストリカルデータ取得シート!$F$5:$DA$5, ROW(A20)),\"-\")","v":"-"},"",{"$f":"IFERROR(INDEX(ヒストリカルデータ取得シート!$F$6:$DA$6, ROW(A20)),\"-\")","v":"-"},null,{"$f":"IF(AND(ISNUMBER(M25), M25>1), IFERROR(VLOOKUP(B25, バックテストデータ_5D_5Y!$B$2:$I$1562, 5, FALSE), \"データ無\"), \"\")","v":""},{"$f":"IF(AND(ISNUMBER(M25), M25>1), IFERROR(VLOOKUP(B25, バックテストデータ_5D_5Y!$B$2:$I$1562, 4, FALSE), \"データ無\"), \"\")","v":""},{"$f":"IF(M25<0,IFERROR(VLOOKUP(B25,バックテストデータ_5D_5Y!$B$2:$I$1562,8,FALSE),\"データ無\"),\"\")","v":""},{"$f":"IF(M25<0,IFERROR(VLOOKUP(B25,バックテストデータ_5D_5Y!$B$2:$I$1562,7,FALSE),\"データ無\"),\"\")","v":""}]
[21,4568,{"$f":"IF(B26=0,\"wait\",_xll.SNT.StockInst(B26,\"銘柄名称\"))","v":{"$error":"#NAME?"}},{"$f":"IF(B26=0,\"wait\",_xll.SNT.StockInst(B26,\"上場部\"))","v":{"$error":"#NAME?"}},{"$f":"IF(B26=0,\"wait\",_xll.SNT.StockInst(B26,\"現値\"))","v":{"$error":"#NAME?"}},{"$f":"IF(B26=0,\"wait\",_xll.SNT.StockInst(B26,\"前日終値\"))","v":{"$error":"#NAME?"}},"wait",{"$f":"IF(B26=0,\"wait\",MID(_xll.SNT.StockInst(B26,\"現値日時\"),12,5))","v":{"$error":"#NAME?"}},{"$f":"IF(B26=0,\"wait\",_xll.SNT.StockInst(B26,\"Tick回数\"))","v":{"$error":"#NAME?"}},{"$f":"IF(B26=0,\"wait\",_xll.SNT.StockInst(B26,\"VWAP\"))","v":{"$error":"#NAME?"}},null,{"$f":"IFERROR(INDEX(ヒストリカルデータ取得シート!$F$5:$DA$5, ROW(A21)),\"-\")","v":"-"},"",{"$f":"IFERROR(INDEX(ヒストリカルデータ取得シート!$F$6:$DA$6, ROW(A21)),\"-\")","v":"-"},null,{"$f":"IF(AND(ISNUMBER(M26), M26>1), IFERROR(VLOOKUP(B26, バックテストデータ_5D_5Y!$B$2:$I$1562, 5, FALSE), \"データ無\"), \"\")","v":""},{"$f":"IF(AND(ISNUMBER(M26), M26>1), IFERROR(VLOOKUP(B26, バックテストデータ_5D_5Y!$B$2:$I$1562, 4, FALSE), \"データ無\"), \"\")","v":""},{"$f":"IF(M26<0,IFERROR(VLOOKUP(B26,バックテストデータ_5D_5Y!$B$2:$I$1562,8,FALSE),\"データ無\"),\"\")","v":""},{"$f":"IF(M26<0,IFERROR(VLOOKUP(B26,バックテストデータ_5D_5Y!$B$2:$I$1562,7,FALSE),\"データ無\"),\"\")","v":""}]
[22,4578,{"$f":"IF(B27=0,\"wait\",_xll.SNT.StockInst(B27,\"銘柄名称\"))","v":{"$error":"#NAME?"}},{"$f":"IF(B27=0,\"wait\",_xll.SNT.StockInst(B27,\"上場部\"))","v":{"$error":"#NAME?"}},{"$f":"IF(B27=0,\"wait\",_xll.SNT.StockInst(B27,\"現値\"))","v":{"$error":"#NAME?"}},{"$f":"IF(B27=0,\"wait\",_xll.SNT.StockInst(B27,\"前日終値\"))","v":{"$error":"#NAME?"}},"wait",{"$f":"IF(B27=0,\"wait\",MID(_xll.SNT.StockInst(B27,\"現値日時\"),12,5))","v":{"$error":"#NAME?"}},{"$f":"IF(B27=0,\"wait\",_xll.SNT.StockInst(B27,\"Tick回数\"))","v":{"$error":"#NAME?"}},{"$f":"IF(B27=0,\"wait\",_xll.SNT.StockInst(B27,\"VWAP\"))","v":{"$error":"#NAME?"}},null,{"$f":"IFERROR(INDEX(ヒストリカルデータ取得シート!$F$5:$DA$5, ROW(A22)),\"-\")","v":"-"},"",{"$f":"IFERROR(INDEX(ヒストリカルデータ取得シート!$F$6:$DA$6, ROW(A22)),\"-\")","v":"-"},null,{"$f":"IF(AND(ISNUMBER(M27), M27>1), IFERROR(VLOOKUP(B27, バックテストデータ_5D_5Y!$B$2:$I$1562, 5, FALSE), \"データ無\"), \"\")","v":""},{"$f":"IF(AND(ISNUMBER(M27), M27>1), IFERROR(VLOOKUP(B27, バックテストデータ_5D_5Y!$B$2:$I$1562, 4, FALSE), \"データ無\"), \"\")","v":""},{"$f":"IF(M27<0,IFERROR(VLOOKUP(B27,バックテストデータ_5D_5Y!$B$2:$I$1562,8,FALSE),\"データ無\"),\"\")","v":""},{"$f":"IF(M27<0,IFERROR(VLOOKUP(B27,バックテストデータ_5D_5Y!$B$2:$I$1562,7,FALSE),\"データ無\"),\"\")","v":""}]
[23,4661,{"$f":"IF(B28=0,\"wait\",_xll.SNT.StockInst(B28,\"銘柄名称\"))","v":{"$error":"#NAME?"}},{"$f":"IF(B28=0,\"wait\",_xll.SNT.StockInst(B28,\"上場部\"))","v":{"$error":"#NAME?"}},{"$f":"IF(B28=0,\"wait\",_xll.SNT.StockInst(B28,\"現値\"))","v":{"$error":"#NAME?"}},{"$f":"IF(B28=0,\"wait\",_xll.SNT.StockInst(B28,\"前日終値\"))","v":{"$error":"#NAME?"}},"wait",{"$f":"IF(B28=0,\"wait\",MID(_xll.SNT.StockInst(B28,\"現値日時\"),12,5))","v":{"$error":"#NAME?"}},{"$f":"IF(B28=0,\"wait\",_xll.SNT.StockInst(B28,\"Tick回数\"))","v":{"$error":"#NAME?"}},{"$f":"IF(B28=0,\"wait\",_xll.SNT.StockInst(B28,\"VWAP\"))","v":{"$error":"#NAME?"}},null,{"$f":"IFERROR(INDEX(ヒストリカルデータ取得シート!$F$5:$DA$5, ROW(A23)),\"-\")","v":"-"},"",{"$f":"IFERROR(INDEX(ヒストリカルデータ取得シート!$F$6:$DA$6, ROW(A23)),\"-\")","v":"-"},null,{"$f":"IF(AND(ISNUMBER(M28), M28>1), IFERROR(VLOOKUP(B28, バックテストデータ_5D_5Y!$B$2:$I$1562, 5, FALSE), \"データ無\"), \"\")","v":""},{"$f":"IF(AND(ISNUMBER(M28), M28>1), IFERROR(VLOOKUP(B28, バックテストデータ_5D_5Y!$B$2:$I$1562, 4, FALSE), \"データ無\"), \"\")","v":""},{"$f":"IF(M28<0,IFERROR(VLOOKUP(B28,バックテストデータ_5D_5Y!$B$2:$I$1562,8,FALSE),\"データ無\"),\"\")","v":""},{"$f":"IF(M28<0,IFERROR(VLOOKUP(B28,バックテストデータ_5D_5Y!$B$2:$I$1562,7,FALSE),\"データ無\"),\"\")","v":""}]
[24,4689,{"$f":"IF(B29=0,\"wait\",_xll.SNT.StockInst(B29,\"銘柄名称\"))","v":{"$error":"#NAME?"}},{"$f":"IF(B29=0,\"wait\",_xll.SNT.StockInst(B29,\"上場部\"))","v":{"$error":"#NAME?"}},{"$f":"IF(B29=0,\"wait\",_xll.SNT.StockInst(B29,\"現値\"))","v":{"$error":"#NAME?"}},{"$f":"IF(B29=0,\"wait\",_xll.SNT.StockInst(B29,\"前日終値\"))","v":{"$error":"#NAME?"}},"wait",{"$f":"IF(B29=0,\"wait\",MID(_xll.SNT.StockInst(B29,\"現値日時\"),12,5))","v":{"$error":"#NAME?"}},{"$f":"IF(B29=0,\"wait\",_xll.SNT.StockInst(B29,\"Tick回数\"))","v":{"$error":"#NAME?"}},{"$f":"IF(B29=0,\"wait\",_xll.SNT.StockInst(B29,\"VWAP\"))","v":{"$error":"#NAME?"}},null,{"$f":"IFERROR(INDEX(ヒストリカルデータ取得シート!$F$5:$DA$5, ROW(A24)),\"-\")","v":"-"},"",{"$f":"IFERROR(INDEX(ヒストリカルデータ取得シート!$F$6:$DA$6, ROW(A24)),\"-\")","v":"-"},null,{"$f":"IF(AND(ISNUMBER(M29), M29>1), IFERROR(VLOOKUP(B29, バックテストデータ_5D_5Y!$B$2:$I$1562, 5, FALSE), \"データ無\"), \"\")","v":""},{"$f":"IF(AND(ISNUMBER(M29), M29>1), IFERROR(VLOOKUP(B29, バックテストデータ_5D_5Y!$B$2:$I$1562, 4, FALSE), \"データ無\"), \"\")","v":""},{"$f":"IF(M29<0,IFERROR(VLOOKUP(B29,バックテストデータ_5D_5Y!$B$2:$I$1562,8,FALSE),\"データ無\"),\"\")","v":""},{"$f":"IF(M29<0,IFERROR(VLOOKUP(B29,バックテストデータ_5D_5Y!$B$2:$I$1562,7,FALSE),\"データ無\"),\"\")","v":""}]
[25,4901,{"$f":"IF(B30=0,\"wait\",_xll.SNT.StockInst(B30,\"銘柄名称\"))","v":{"$error":"#NAME?"}},{"$f":"IF(B30=0,\"wait\",_xll.SNT.StockInst(B30,\"上場部\"))","v":{"$error":"#NAME?"}},{"$f":"IF(B30=0,\"wait\",_xll.SNT.StockInst(B30,\"現値\"))","v":{"$error":"#NAME?"}},{"$f":"IF(B30=0,\"wait\",_xll.SNT.StockInst(B30,\"前日終値\"))","v":{"$error":"#NAME?"}},"wait",{"$f":"IF(B30=0,\"wait\",MID(_xll.SNT.StockInst(B30,\"現値日時\"),12,5))","v":{"$error":"#NAME?"}},{"$f":"IF(B30=0,\"wait\",_xll.SNT.StockInst(B30,\"Tick回数\"))","v":{"$error":"#NAME?"}},{"$f":"IF(B30=0,\"wait\",_xll.SNT.StockInst(B30,\"VWAP\"))","v":{"$error":"#NAME?"}},null,{"$f":"IFERROR(INDEX(ヒストリカルデータ取得シート!$F$5:$DA$5, ROW(A25)),\"-\")","v":"-"},"",{"$f":"IFERROR(INDEX(ヒストリカルデータ取得シート!$F$6:$DA$6, ROW(A25)),\"-\")","v":"-"},null,{"$f":"IF(AND(ISNUMBER(M30), M30>1), IFERROR(VLOOKUP(B30, バックテストデータ_5D_5Y!$B$2:$I$1562, 5, FALSE), \"データ無\"), \"\")","v":""},{"$f":"IF(AND(ISNUMBER(M30), M30>1), IFERROR(VLOOKUP(B30, バックテストデータ_5D_5Y!$B$2:$I$1562, 4, FALSE), \"データ無\"), \"\")","v":""},{"$f":"IF(M30<0,IFERROR(VLOOKUP(B30,バックテストデータ_5D_5Y!$B$2:$I$1562,8,FALSE),\"データ無\"),\"\")","v":""},{"$f":"IF(M30<0,IFERROR(VLOOKUP(B30,バックテストデータ_5D_5Y!$B$2:$I$1562,7,FALSE),\"データ無\"),\"\")","v":""}]
[26,4911,{"$f":"IF(B31=0,\"wait\",_xll.SNT.StockInst(B31,\"銘柄名称\"))","v":{"$error":"#NAME?"}},{"$f":"IF(B31=0,\"wait\",_xll.SNT.StockInst(B31,\"上場部\"))","v":{"$error":"#NAME?"}},{"$f":"IF(B31=0,\"wait\",_xll.SNT.StockInst(B31,\"現値\"))","v":{"$error":"#NAME?"}},{"$f":"IF(B31=0,\"wait\",_xll.SNT.StockInst(B31,\"前日終値\"))","v":{"$error":"#NAME?"}},"wait",{"$f":"IF(B31=0,\"wait\",MID(_xll.SNT.StockInst(B31,\"現値日時\"),12,5))","v":{"$error":"#NAME?"}},{"$f":"IF(B31=0,\"wait\",_xll.SNT.StockInst(B31,\"Tick回数\"))","v":{"$error":"#NAME?"}},{"$f":"IF(B31=0,\"wait\",_xll.SNT.StockInst(B31,\"VWAP\"))","v":{"$error":"#NAME?"}},null,{"$f":"IFERROR(INDEX(ヒストリカルデータ取得シート!$F$5:$DA$5, ROW(A26)),\"-\")","v":"-"},"",{"$f":"IFERROR(INDEX(ヒストリカルデータ取得シート!$F$6:$DA$6, ROW(A26)),\"-\")","v":"-"},null,{"$f":"IF(AND(ISNUMBER(M31), M31>1), IFERROR(VLOOKUP(B31, バックテストデータ_5D_5Y!$B$2:$I$1562, 5, FALSE), \"データ無\"), \"\")","v":""},{"$f":"IF(AND(ISNUMBER(M31), M31>1), IFERROR(VLOOKUP(B31, バックテストデータ_5D_5Y!$B$2:$I$1562, 4, FALSE), \"データ無\"), \"\")","v":""},{"$f":"IF(M31<0,IFERROR(VLOOKUP(B31,バックテストデータ_5D_5Y!$B$2:$I$1562,8,FALSE),\"データ無\"),\"\")","v":""},{"$f":"IF(M31<0,IFERROR(VLOOKUP(B31,バックテストデータ_5D_5Y!$B$2:$I$1562,7,FALSE),\"データ無\"),\"\")","v":""}]
[27,5020,{"$f":"IF(B32=0,\"wait\",_xll.SNT.StockInst(B32,\"銘柄名称\"))","v":{"$error":"#NAME?"}},{"$f":"IF(B32=0,\"wait\",_xll.SNT.StockInst(B32,\"上場部\"))","v":{"$error":"#NAME?"}},{"$f":"IF(B32=0,\"wait\",_xll.SNT.StockInst(B32,\"現値\"))","v":{"$error":"#NAME?"}},{"$f":"IF(B32=0,\"wait\",_xll.SNT.StockInst(B32,\"前日終値\"))","v":{"$error":"#NAME?"}},"wait",{"$f":"IF(B32=0,\"wait\",MID(_xll.SNT.StockInst(B32,\"現値日時\"),12,5))","v":{"$error":"#NAME?"}},{"$f":"IF(B32=0,\"wait\",_xll.SNT.StockInst(B32,\"Tick回数\"))","v":{"$error":"#NAME?"}},{"$f":"IF(B32=0,\"wait\",_xll.SNT.StockInst(B32,\"VWAP\"))","v":{"$error":"#NAME?"}},null,{"$f":"IFERROR(INDEX(ヒストリカルデータ取得シート!$F$5:$DA$5, ROW(A27)),\"-\")","v":"-"},"",{"$f":"IFERROR(INDEX(ヒストリカルデータ取得シート!$F$6:$DA$6, ROW(A27)),\"-\")","v":"-"},null,{"$f":"IF(AND(ISNUMBER(M32), M32>1), IFERROR(VLOOKUP(B32, バックテストデータ_5D_5Y!$B$2:$I$1562, 5, FALSE), \"データ無\"), \"\")","v":""},{"$f":"IF(AND(ISNUMBER(M32), M32>1), IFERROR(VLOOKUP(B32, バックテストデータ_5D_5Y!$B$2:$I$1562, 4, FALSE), \"データ無\"), \"\")","v":""},{"$f":"IF(M32<0,IFERROR(VLOOKUP(B32,バックテストデータ_5D_5Y!$B$2:$I$1562,8,FALSE),\"データ無\"),\"\")","v":""},{"$f":"IF(M32<0,IFERROR(VLOOKUP(B32,バックテストデータ_5D_5Y!$B$2:$I$1562,7,FALSE),\"データ無\"),\"\")","v":""}]
[28,5108,{"$f":"IF(B33=0,\"wait\",_xll.SNT.StockInst(B33,\"銘柄名称\"))","v":{"$error":"#NAME?"}},{"$f":"IF(B33=0,\"wait\",_xll.SNT.StockInst(B33,\"上場部\"))","v":{"$error":"#NAME?"}},{"$f":"IF(B33=0,\"wait\",_xll.SNT.StockInst(B33,\"現値\"))","v":{"$error":"#NAME?"}},{"$f":"IF(B33=0,\"wait\",_xll.SNT.StockInst(B33,\"前日終値\"))","v":{"$error":"#NAME?"}},"wait",{"$f":"IF(B33=0,\"wait\",MID(_xll.SNT.StockInst(B33,\"現値日時\"),12,5))","v":{"$error":"#NAME?"}},{"$f":"IF(B33=0,\"wait\",_xll.SNT.StockInst(B33,\"Tick回数\"))","v":{"$error":"#NAME?"}},{"$f":"IF(B33=0,\"wait\",_xll.SNT.StockInst(B33,\"VWAP\"))","v":{"$error":"#NAME?"}},null,{"$f":"IFERROR(INDEX(ヒストリカルデータ取得シート!$F$5:$DA$5, ROW(A28)),\"-\")","v":"-"},"",{"$f":"IFERROR(INDEX(ヒストリカルデータ取得シート!$F$6:$DA$6, ROW(A28)),\"-\")","v":"-"},null,{"$f":"IF(AND(ISNUMBER(M33), M33>1), IFERROR(VLOOKUP(B33, バックテストデータ_5D_5Y!$B$2:$I$1562, 5, FALSE), \"データ無\"), \"\")","v":""},{"$f":"IF(AND(ISNUMBER(M33), M33>1), IFERROR(VLOOKUP(B33, バックテストデータ_5D_5Y!$B$2:$I$1562, 4, FALSE), \"データ無\"), \"\")","v":""},{"$f":"IF(M33<0,IFERROR(VLOOKUP(B33,バックテストデータ_5D_5Y!$B$2:$I$1562,8,FALSE),\"データ無\"),\"\")","v":""},{"$f":"IF(M33<0,IFERROR(VLOOKUP(B33,バックテストデータ_5D_5Y!$B$2:$I$1562,7,FALSE),\"データ無\"),\"\")","v":""}]
[29,5401,{"$f":"IF(B34=0,\"wait\",_xll.SNT.StockInst(B34,\"銘柄名称\"))","v":{"$error":"#NAME?"}},{"$f":"IF(B34=0,\"wait\",_xll.SNT.StockInst(B34,\"上場部\"))","v":{"$error":"#NAME?"}},{"$f":"IF(B34=0,\"wait\",_xll.SNT.StockInst(B34,\"現値\"))","v":{"$error":"#NAME?"}},{"$f":"IF(B34=0,\"wait\",_xll.SNT.StockInst(B34,\"前日終値\"))","v":{"$error":"#NAME?"}},"wait",{"$f":"IF(B34=0,\"wait\",MID(_xll.SNT.StockInst(B34,\"現値日時\"),12,5))","v":{"$error":"#NAME?"}},{"$f":"IF(B34=0,\"wait\",_xll.SNT.StockInst(B34,\"Tick回数\"))","v":{"$error":"#NAME?"}},{"$f":"IF(B34=0,\"wait\",_xll.SNT.StockInst(B34,\"VWAP\"))","v":{"$error":"#NAME?"}},null,{"$f":"IFERROR(INDEX(ヒストリカルデータ取得シート!$F$5:$DA$5, ROW(A29)),\"-\")","v":"-"},"",{"$f":"IFERROR(INDEX(ヒストリカルデータ取得シート!$F$6:$DA$6, ROW(A29)),\"-\")","v":"-"},null,{"$f":"IF(AND(ISNUMBER(M34), M34>1), IFERROR(VLOOKUP(B34, バックテストデータ_5D_5Y!$B$2:$I$1562, 5, FALSE), \"データ無\"), \"\")","v":""},{"$f":"IF(AND(ISNUMBER(M34), M34>1), IFERROR(VLOOKUP(B34, バックテストデータ_5D_5Y!$B$2:$I$1562, 4, FALSE), \"データ無\"), \"\")","v":""},{"$f":"IF(M34<0,IFERROR(VLOOKUP(B34,バックテストデータ_5D_5Y!$B$2:$I$1562,8,FALSE),\"データ無\"),\"\")","v":""},{"$f":"IF(M34<0,IFERROR(VLOOKUP(B34,バックテストデータ_5D_5Y!$B$2:$I$1562,7,FALSE),\"データ無\"),\"\")","v":""}]
[30,5713,{"$f":"IF(B35=0,\"wait\",_xll.SNT.StockInst(B35,\"銘柄名称\"))","v":{"$error":"#NAME?"}},{"$f":"IF(B35=0,\"wait\",_xll.SNT.StockInst(B35,\"上場部\"))","v":{"$error":"#NAME?"}},{"$f":"IF(B35=0,\"wait\",_xll.SNT.StockInst(B35,\"現値\"))","v":{"$error":"#NAME?"}},{"$f":"IF(B35=0,\"wait\",_xll.SNT.StockInst(B35,\"前日終値\"))","v":{"$error":"#NAME?"}},"wait",{"$f":"IF(B35=0,\"wait\",MID(_xll.SNT.StockInst(B35,\"現値日時\"),12,5))","v":{"$error":"#NAME?"}},{"$f":"IF(B35=0,\"wait\",_xll.SNT.StockInst(B35,\"Tick回数\"))","v":{"$error":"#NAME?"}},{"$f":"IF(B35=0,\"wait\",_xll.SNT.StockInst(B35,\"VWAP\"))","v":{"$error":"#NAME?"}},null,{"$f":"IFERROR(INDEX(ヒストリカルデータ取得シート!$F$5:$DA$5, ROW(A30)),\"-\")","v":"-"},"",{"$f":"IFERROR(INDEX(ヒストリカルデータ取得シート!$F$6:$DA$6, ROW(A30)),\"-\")","v":"-"},null,{"$f":"IF(AND(ISNUMBER(M35), M35>1), IFERROR(VLOOKUP(B35, バックテストデータ_5D_5Y!$B$2:$I$1562, 5, FALSE), \"データ無\"), \"\")","v":""},{"$f":"IF(AND(ISNUMBER(M35), M35>1), IFERROR(VLOOKUP(B35, バックテストデータ_5D_5Y!$B$2:$I$1562, 4, FALSE), \"データ無\"), \"\")","v":""},{"$f":"IF(M35<0,IFERROR(VLOOKUP(B35,バックテストデータ_5D_5Y!$B$2:$I$1562,8,FALSE),\"データ無\"),\"\")","v":""},{"$f":"IF(M35<0,IFERROR(VLOOKUP(B35,バックテストデータ_5D_5Y!$B$2:$I$1562,7,FALSE),\"データ無\"),\"\")","v":""}]
[31,5802,{"$f":"IF(B36=0,\"wait\",_xll.SNT.StockInst(B36,\"銘柄名称\"))","v":{"$error":"#NAME?"}},{"$f":"IF(B36=0,\"wait\",_xll.SNT.StockInst(B36,\"上場部\"))","v":{"$error":"#NAME?"}},{"$f":"IF(B36=0,\"wait\",_xll.SNT.StockInst(B36,\"現値\"))","v":{"$error":"#NAME?"}},{"$f":"IF(B36=0,\"wait\",_xll.SNT.StockInst(B36,\"前日終値\"))","v":{"$error":"#NAME?"}},"wait",{"$f":"IF(B36=0,\"wait\",MID(_xll.SNT.StockInst(B36,\"現値日時\"),12,5))","v":{"$error":"#NAME?"}},{"$f":"IF(B36=0,\"wait\",_xll.SNT.StockInst(B36,\"Tick回数\"))","v":{"$error":"#NAME?"}},{"$f":"IF(B36=0,\"wait\",_xll.SNT.StockInst(B36,\"VWAP\"))","v":{"$error":"#NAME?"}},null,{"$f":"IFERROR(INDEX(ヒストリカルデータ取得シート!$F$5:$DA$5, ROW(A31)),\"-\")","v":"-"},"",{"$f":"IFERROR(INDEX(ヒストリカルデータ取得シート!$F$6:$DA$6, ROW(A31)),\"-\")","v":"-"},null,{"$f":"IF(AND(ISNUMBER(M36), M36>1), IFERROR(VLOOKUP(B36, バックテストデータ_5D_5Y!$B$2:$I$1562, 5, FALSE), \"データ無\"), \"\")","v":""},{"$f":"IF(AND(ISNUMBER(M36), M36>1), IFERROR(VLOOKUP(B36, バックテストデータ_5D_5Y!$B$2:$I$1562, 4, FALSE), \"データ無\"), \"\")","v":""},{"$f":"IF(M36<0,IFERROR(VLOOKUP(B36,バックテストデータ_5D_5Y!$B$2:$I$1562,8,FALSE),\"データ無\"),\"\")","v":""},{"$f":"IF(M36<0,IFERROR(VLOOKUP(B36,バックテストデータ_5D_5Y!$B$2:$I$1562,7,FALSE),\"データ無\"),\"\")","v":""}]
[32,6098,{"$f":"IF(B37=0,\"wait\",_xll.SNT.StockInst(B37,\"銘柄名称\"))","v":{"$error":"#NAME?"}},{"$f":"IF(B37=0,\"wait\",_xll.SNT.StockInst(B37,\"上場部\"))","v":{"$error":"#NAME?"}},{"$f":"IF(B37=0,\"wait\",_xll.SNT.StockInst(B37,\"現値\"))","v":{"$error":"#NAME?"}},{"$f":"IF(B37=0,\"wait\",_xll.SNT.StockInst(B37,\"前日終値\"))","v":{"$error":"#NAME?"}},"wait",{"$f":"IF(B37=0,\"wait\",MID(_xll.SNT.StockInst(B37,\"現値日時\"),12,5))","v":{"$error":"#NAME?"}},{"$f":"IF(B37=0,\"wait\",_xll.SNT.StockInst(B37,\"Tick回数\"))","v":{"$error":"#NAME?"}},{"$f":"IF(B37=0,\"wait\",_xll.SNT.StockInst(B37,\"VWAP\"))","v":{"$error":"#NAME?"}},null,{"$f":"IFERROR(INDEX(ヒストリカルデータ取得シート!$F$5:$DA$5, ROW(A32)),\"-\")","v":"-"},"",{"$f":"IFERROR(INDEX(ヒストリカルデータ取得シート!$F$6:$DA$6, ROW(A32)),\"-\")","v":"-"},null,{"$f":"IF(AND(ISNUMBER(M37), M37>1), IFERROR(VLOOKUP(B37, バックテストデータ_5D_5Y!$B$2:$I$1562, 5, FALSE), \"データ無\"), \"\")","v":""},{"$f":"IF(AND(ISNUMBER(M37), M37>1), IFERROR(VLOOKUP(B37, バックテストデータ_5D_5Y!$B$2:$I$1562, 4, FALSE), \"データ無\"), \"\")","v":""},{"$f":"IF(M37<0,IFERROR(VLOOKUP(B37,バックテストデータ_5D_5Y!$B$2:$I$1562,8,FALSE),\"データ無\"),\"\")","v":""},{"$f":"IF(M37<0,IFERROR(VLOOKUP(B37,バックテストデータ_5D_5Y!$B$2:$I$1562,7,FALSE),\"データ無\"),\"\")","v":""}]
[33,6178,{"$f":"IF(B38=0,\"wait\",_xll.SNT.StockInst(B38,\"銘柄名称\"))","v":{"$error":"#NAME?"}},{"$f":"IF(B38=0,\"wait\",_xll.SNT.StockInst(B38,\"上場部\"))","v":{"$error":"#NAME?"}},{"$f":"IF(B38=0,\"wait\",_xll.SNT.StockInst(B38,\"現値\"))","v":{"$error":"#NAME?"}},{"$f":"IF(B38=0,\"wait\",_xll.SNT.StockInst(B38,\"前日終値\"))","v":{"$error":"#NAME?"}},"wait",{"$f":"IF(B38=0,\"wait\",MID(_xll.SNT.StockInst(B38,\"現値日時\"),12,5))","v":{"$error":"#NAME?"}},{"$f":"IF(B38=0,\"wait\",_xll.SNT.StockInst(B38,\"Tick回数\"))","v":{"$error":"#NAME?"}},{"$f":"IF(B38=0,\"wait\",_xll.SNT.StockInst(B38,\"VWAP\"))","v":{"$error":"#NAME?"}},null,{"$f":"IFERROR(INDEX(ヒストリカルデータ取得シート!$F$5:$DA$5, ROW(A33)),\"-\")","v":"-"},"",{"$f":"IFERROR(INDEX(ヒストリカルデータ取得シート!$F$6:$DA$6, ROW(A33)),\"-\")","v":"-"},null,{"$f":"IF(AND(ISNUMBER(M38), M38>1), IFERROR(VLOOKUP(B38, バックテストデータ_5D_5Y!$B$2:$I$1562, 5, FALSE), \"データ無\"), \"\")","v":""},{"$f":"IF(AND(ISNUMBER(M38), M38>1), IFERROR(VLOOKUP(B38, バックテストデータ_5D_5Y!$B$2:$I$1562, 4, FALSE), \"データ無\"), \"\")","v":""},{"$f":"IF(M38<0,IFERROR(VLOOKUP(B38,バックテストデータ_5D_5Y!$B$2:$I$1562,8,FALSE),\"データ無\"),\"\")","v":""},{"$f":"IF(M38<0,IFERROR(VLOOKUP(B38,バックテストデータ_5D_5Y!$B$2:$I$1562,7,FALSE),\"データ無\"),\"\")","v":""}]
[34,6273,{"$f":"IF(B39=0,\"wait\",_xll.SNT.StockInst(B39,\"銘柄名称\"))","v":{"$error":"#NAME?"}},{"$f":"IF(B39=0,\"wait\",_xll.SNT.StockInst(B39,\"上場部\"))","v":{"$error":"#NAME?"}},{"$f":"IF(B39=0,\"wait\",_xll.SNT.StockInst(B39,\"現値\"))","v":{"$error":"#NAME?"}},{"$f":"IF(B39=0,\"wait\",_xll.SNT.StockInst(B39,\"前日終値\"))","v":{"$error":"#NAME?"}},"wait",{"$f":"IF(B39=0,\"wait\",MID(_xll.SNT.StockInst(B39,\"現値日時\"),12,5))","v":{"$error":"#NAME?"}},{"$f":"IF(B39=0,\"wait\",_xll.SNT.StockInst(B39,\"Tick回数\"))","v":{"$error":"#NAME?"}},{"$f":"IF(B39=0,\"wait\",_xll.SNT.StockInst(B39,\"VWAP\"))","v":{"$error":"#NAME?"}},null,{"$f":"IFERROR(INDEX(ヒストリカルデータ取得シート!$F$5:$DA$5, ROW(A34)),\"-\")","v":"-"},"",{"$f":"IFERROR(INDEX(ヒストリカルデータ取得シート!$F$6:$DA$6, ROW(A34)),\"-\")","v":"-"},null,{"$f":"IF(AND(ISNUMBER(M39), M39>1), IFERROR(VLOOKUP(B39, バックテストデータ_5D_5Y!$B$2:$I$1562, 5, FALSE), \"データ無\"), \"\")","v":""},{"$f":"IF(AND(ISNUMBER(M39), M39>1), IFERROR(VLOOKUP(B39, バックテストデータ_5D_5Y!$B$2:$I$1562, 4, FALSE), \"データ無\"), \"\")","v":""},{"$f":"IF(M39<0,IFERROR(VLOOKUP(B39,バックテストデータ_5D_5Y!$B$2:$I$1562,8,FALSE),\"データ無\"),\"\")","v":""},{"$f":"IF(M39<0,IFERROR(VLOOKUP(B39,バックテストデータ_5D_5Y!$B$2:$I$1562,7,FALSE),\"データ無\"),\"\")","v":""}]
[35,6301,{"$f":"IF(B40=0,\"wait\",_xll.SNT.StockInst(B40,\"銘柄名称\"))","v":{"$error":"#NAME?"}},{"$f":"IF(B40=0,\"wait\",_xll.SNT.StockInst(B40,\"上場部\"))","v":{"$error":"#NAME?"}},{"$f":"IF(B40=0,\"wait\",_xll.SNT.StockInst(B40,\"現値\"))","v":{"$error":"#NAME?"}},{"$f":"IF(B40=0,\"wait\",_xll.SNT.StockInst(B40,\"前日終値\"))","v":{"$error":"#NAME?"}},"wait",{"$f":"IF(B40=0,\"wait\",MID(_xll.SNT.StockInst(B40,\"現値日時\"),12,5))","v":{"$error":"#NAME?"}},{"$f":"IF(B40=0,\"wait\",_xll.SNT.StockInst(B40,\"Tick回数\"))","v":{"$error":"#NAME?"}},{"$f":"IF(B40=0,\"wait\",_xll.SNT.StockInst(B40,\"VWAP\"))","v":{"$error":"#NAME?"}},null,{"$f":"IFERROR(INDEX(ヒストリカルデータ取得シート!$F$5:$DA$5, ROW(A35)),\"-\")","v":"-"},"",{"$f":"IFERROR(INDEX(ヒストリカルデータ取得シート!$F$6:$DA$6, ROW(A35)),\"-\")","v":"-"},null,{"$f":"IF(AND(ISNUMBER(M40), M40>1), IFERROR(VLOOKUP(B40, バックテストデータ_5D_5Y!$B$2:$I$1562, 5, FALSE), \"データ無\"), \"\")","v":""},{"$f":"IF(AND(ISNUMBER(M40), M40>1), IFERROR(VLOOKUP(B40, バックテストデータ_5D_5Y!$B$2:$I$1562, 4, FALSE), \"データ無\"), \"\")","v":""},{"$f":"IF(M40<0,IFERROR(VLOOKUP(B40,バックテストデータ_5D_5Y!$B$2:$I$1562,8,FALSE),\"データ無\"),\"\")","v":""},{"$f":"IF(M40<0,IFERROR(VLOOKUP(B40,バックテストデータ_5D_5Y!$B$2:$I$1562,7,FALSE),\"データ無\"),\"\")","v":""}]
[36,6326,{"$f":"IF(B41=0,\"wait\",_xll.SNT.StockInst(B41,\"銘柄名称\"))","v":{"$error":"#NAME?"}},{"$f":"IF(B41=0,\"wait\",_xll.SNT.StockInst(B41,\"上場部\"))","v":{"$error":"#NAME?"}},{"$f":"IF(B41=0,\"wait\",_xll.SNT.StockInst(B41,\"現値\"))","v":{"$error":"#NAME?"}},{"$f":"IF(B41=0,\"wait\",_xll.SNT.StockInst(B41,\"前日終値\"))","v":{"$error":"#NAME?"}},"wait",{"$f":"IF(B41=0,\"wait\",MID(_xll.SNT.StockInst(B41,\"現値日時\"),12,5))","v":{"$error":"#NAME?"}},{"$f":"IF(B41=0,\"wait\",_xll.SNT.StockInst(B41,\"Tick回数\"))","v":{"$error":"#NAME?"}},{"$f":"IF(B41=0,\"wait\",_xll.SNT.StockInst(B41,\"VWAP\"))","v":{"$error":"#NAME?"}},null,{"$f":"IFERROR(INDEX(ヒストリカルデータ取得シート!$F$5:$DA$5, ROW(A36)),\"-\")","v":"-"},"",{"$f":"IFERROR(INDEX(ヒストリカルデータ取得シート!$F$6:$DA$6, ROW(A36)),\"-\")","v":"-"},null,{"$f":"IF(AND(ISNUMBER(M41), M41>1), IFERROR(VLOOKUP(B41, バックテストデータ_5D_5Y!$B$2:$I$1562, 5, FALSE), \"データ無\"), \"\")","v":""},{"$f":"IF(AND(ISNUMBER(M41), M41>1), IFERROR(VLOOKUP(B41, バックテストデータ_5D_5Y!$B$2:$I$1562, 4, FALSE), \"データ無\"), \"\")","v":""},{"$f":"IF(M41<0,IFERROR(VLOOKUP(B41,バックテストデータ_5D_5Y!$B$2:$I$1562,8,FALSE),\"データ無\"),\"\")","v":""},{"$f":"IF(M41<0,IFERROR(VLOOKUP(B41,バックテストデータ_5D_5Y!$B$2:$I$1562,7,FALSE),\"データ無\"),\"\")","v":""}]
[37,6367,{"$f":"IF(B42=0,\"wait\",_xll.SNT.StockInst(B42,\"銘柄名称\"))","v":{"$error":"#NAME?"}},{"$f":"IF(B42=0,\"wait\",_xll.SNT.StockInst(B42,\"上場部\"))","v":{"$error":"#NAME?"}},{"$f":"IF(B42=0,\"wait\",_xll.SNT.StockInst(B42,\"現値\"))","v":{"$error":"#NAME?"}},{"$f":"IF(B42=0,\"wait\",_xll.SNT.StockInst(B42,\"前日終値\"))","v":{"$error":"#NAME?"}},"wait",{"$f":"IF(B42=0,\"wait\",MID(_xll.SNT.StockInst(B42,\"現値日時\"),12,5))","v":{"$error":"#NAME?"}},{"$f":"IF(B42=0,\"wait\",_xll.SNT.StockInst(B42,\"Tick回数\"))","v":{"$error":"#NAME?"}},{"$f":"IF(B42=0,\"wait\",_xll.SNT.StockInst(B42,\"VWAP\"))","v":{"$error":"#NAME?"}},null,{"$f":"IFERROR(INDEX(ヒストリカルデータ取得シート!$F$5:$DA$5, ROW(A37)),\"-\")","v":"-"},"",{"$f":"IFERROR(INDEX(ヒストリカルデータ取得シート!$F$6:$DA$6, ROW(A37)),\"-\")","v":"-"},null,{"$f":"IF(AND(ISNUMBER(M42), M42>1), IFERROR(VLOOKUP(B42, バックテストデータ_5D_5Y!$B$2:$I$1562, 5, FALSE), \"データ無\"), \"\")","v":""},{"$f":"IF(AND(ISNUMBER(M42), M42>1), IFERROR(VLOOKUP(B42, バックテストデータ_5D_5Y!$B$2:$I$1562, 4, FALSE), \"データ無\"), \"\")","v":""},{"$f":"IF(M42<0,IFERROR(VLOOKUP(B42,バックテストデータ_5D_5Y!$B$2:$I$1562,8,FALSE),\"データ無\"),\"\")","v":""},{"$f":"IF(M42<0,IFERROR(VLOOKUP(B42,バックテストデータ_5D_5Y!$B$2:$I$1562,7,FALSE),\"データ無\"),\"\")","v":""}]
[38,6501,{"$f":"IF(B43=0,\"wait\",_xll.SNT.StockInst(B43,\"銘柄名称\"))","v":{"$error":"#NAME?"}},{"$f":"IF(B43=0,\"wait\",_xll.SNT.StockInst(B43,\"上場部\"))","v":{"$error":"#NAME?"}},{"$f":"IF(B43=0,\"wait\",_xll.SNT.StockInst(B43,\"現値\"))","v":{"$error":"#NAME?"}},{"$f":"IF(B43=0,\"wait\",_xll.SNT.StockInst(B43,\"前日終値\"))","v":{"$error":"#NAME?"}},"wait",{"$f":"IF(B43=0,\"wait\",MID(_xll.SNT.StockInst(B43,\"現値日時\"),12,5))","v":{"$error":"#NAME?"}},{"$f":"IF(B43=0,\"wait\",_xll.SNT.StockInst(B43,\"Tick回数\"))","v":{"$error":"#NAME?"}},{"$f":"IF(B43=0,\"wait\",_xll.SNT.StockInst(B43,\"VWAP\"))","v":{"$error":"#NAME?"}},null,{"$f":"IFERROR(INDEX(ヒストリカルデータ取得シート!$F$5:$DA$5, ROW(A38)),\"-\")","v":"-"},"",{"$f":"IFERROR(INDEX(ヒストリカルデータ取得シート!$F$6:$DA$6, ROW(A38)),\"-\")","v":"-"},null,{"$f":"IF(AND(ISNUMBER(M43), M43>1), IFERROR(VLOOKUP(B43, バックテストデータ_5D_5Y!$B$2:$I$1562, 5, FALSE), \"データ無\"), \"\")","v":""},{"$f":"IF(AND(ISNUMBER(M43), M43>1), IFERROR(VLOOKUP(B43, バックテストデータ_5D_5Y!$B$2:$I$1562, 4, FALSE), \"データ無\"), \"\")","v":""},{"$f":"IF(M43<0,IFERROR(VLOOKUP(B43,バックテストデータ_5D_5Y!$B$2:$I$1562,8,FALSE),\"データ無\"),\"\")","v":""},{"$f":"IF(M43<0,IFERROR(VLOOKUP(B43,バックテストデータ_5D_5Y!$B$2:$I$1562,7,FALSE),\"データ無\"),\"\")","v":""}]
[39,6503,{"$f":"IF(B44=0,\"wait\",_xll.SNT.StockInst(B44,\"銘柄名称\"))","v":{"$error":"#NAME?"}},{"$f":"IF(B44=0,\"wait\",_xll.SNT.StockInst(B44,\"上場部\"))","v":{"$error":"#NAME?"}},{"$f":"IF(B44=0,\"wait\",_xll.SNT.StockInst(B44,\"現値\"))","v":{"$error":"#NAME?"}},{"$f":"IF(B44=0,\"wait\",_xll.SNT.StockInst(B44,\"前日終値\"))","v":{"$error":"#NAME?"}},"wait",{"$f":"IF(B44=0,\"wait\",MID(_xll.SNT.StockInst(B44,\"現値日時\"),12,5))","v":{"$error":"#NAME?"}},{"$f":"IF(B44=0,\"wait\",_xll.SNT.StockInst(B44,\"Tick回数\"))","v":{"$error":"#NAME?"}},{"$f":"IF(B44=0,\"wait\",_xll.SNT.StockInst(B44,\"VWAP\"))","v":{"$error":"#NAME?"}},null,{"$f":"IFERROR(INDEX(ヒストリカルデータ取得シート!$F$5:$DA$5, ROW(A39)),\"-\")","v":"-"},"",{"$f":"IFERROR(INDEX(ヒストリカルデータ取得シート!$F$6:$DA$6, ROW(A39)),\"-\")","v":"-"},null,{"$f":"IF(AND(ISNUMBER(M44), M44>1), IFERROR(VLOOKUP(B44, バックテストデータ_5D_5Y!$B$2:$I$1562, 5, FALSE), \"データ無\"), \"\")","v":""},{"$f":"IF(AND(ISNUMBER(M44), M44>1), IFERROR(VLOOKUP(B44, バックテストデータ_5D_5Y!$B$2:$I$1562, 4, FALSE), \"データ無\"), \"\")","v":""},{"$f":"IF(M44<0,IFERROR(VLOOKUP(B44,バックテストデータ_5D_5Y!$B$2:$I$1562,8,FALSE),\"データ無\"),\"\")","v":""},{"$f":"IF(M44<0,IFERROR(VLOOKUP(B44,バックテストデータ_5D_5Y!$B$2:$I$1562,7,FALSE),\"データ無\"),\"\")","v":""}]
[40,6586,{"$f":"IF(B45=0,\"wait\",_xll.SNT.StockInst(B45,\"銘柄名称\"))","v":{"$error":"#NAME?"}},{"$f":"IF(B45=0,\"wait\",_xll.SNT.StockInst(B45,\"上場部\"))","v":{"$error":"#NAME?"}},{"$f":"IF(B45=0,\"wait\",_xll.SNT.StockInst(B45,\"現値\"))","v":{"$error":"#NAME?"}},{"$f":"IF(B45=0,\"wait\",_xll.SNT.StockInst(B45,\"前日終値\"))","v":{"$error":"#NAME?"}},"wait",{"$f":"IF(B45=0,\"wait\",MID(_xll.SNT.StockInst(B45,\"現値日時\"),12,5))","v":{"$error":"#NAME?"}},{"$f":"IF(B45=0,\"wait\",_xll.SNT.StockInst(B45,\"Tick回数\"))","v":{"$error":"#NAME?"}},{"$f":"IF(B45=0,\"wait\",_xll.SNT.StockInst(B45,\"VWAP\"))","v":{"$error":"#NAME?"}},null,{"$f":"IFERROR(INDEX(ヒストリカルデータ取得シート!$F$5:$DA$5, ROW(A40)),\"-\")","v":"-"},"",{"$f":"IFERROR(INDEX(ヒストリカルデータ取得シート!$F$6:$DA$6, ROW(A40)),\"-\")","v":"-"},null,{"$f":"IF(AND(ISNUMBER(M45), M45>1), IFERROR(VLOOKUP(B45, バックテストデータ_5D_5Y!$B$2:$I$1562, 5, FALSE), \"データ無\"), \"\")","v":""},{"$f":"IF(AND(ISNUMBER(M45), M45>1), IFERROR(VLOOKUP(B45, バックテストデータ_5D_5Y!$B$2:$I$1562, 4, FALSE), \"データ無\"), \"\")","v":""},{"$f":"IF(M45<0,IFERROR(VLOOKUP(B45,バックテストデータ_5D_5Y!$B$2:$I$1562,8,FALSE),\"データ無\"),\"\")","v":""},{"$f":"IF(M45<0,IFERROR(VLOOKUP(B45,バックテストデータ_5D_5Y!$B$2:$I$1562,7,FALSE),\"データ無\"),\"\")","v":""}]
[41,6594,{"$f":"IF(B46=0,\"wait\",_xll.SNT.StockInst(B46,\"銘柄名称\"))","v":{"$error":"#NAME?"}},{"$f":"IF(B46=0,\"wait\",_xll.SNT.StockInst(B46,\"上場部\"))","v":{"$error":"#NAME?"}},{"$f":"IF(B46=0,\"wait\",_xll.SNT.StockInst(B46,\"現値\"))","v":{"$error":"#NAME?"}},{"$f":"IF(B46=0,\"wait\",_xll.SNT.StockInst(B46,\"前日終値\"))","v":{"$error":"#NAME?"}},"wait",{"$f":"IF(B46=0,\"wait\",MID(_xll.SNT.StockInst(B46,\"現値日時\"),12,5))","v":{"$error":"#NAME?"}},{"$f":"IF(B46=0,\"wait\",_xll.SNT.StockInst(B46,\"Tick回数\"))","v":{"$error":"#NAME?"}},{"$f":"IF(B46=0,\"wait\",_xll.SNT.StockInst(B46,\"VWAP\"))","v":{"$error":"#NAME?"}},null,{"$f":"IFERROR(INDEX(ヒストリカルデータ取得シート!$F$5:$DA$5, ROW(A41)),\"-\")","v":"-"},"",{"$f":"IFERROR(INDEX(ヒストリカルデータ取得シート!$F$6:$DA$6, ROW(A41)),\"-\")","v":"-"},null,{"$f":"IF(AND(ISNUMBER(M46), M46>1), IFERROR(VLOOKUP(B46, バックテストデータ_5D_5Y!$B$2:$I$1562, 5, FALSE), \"データ無\"), \"\")","v":""},{"$f":"IF(AND(ISNUMBER(M46), M46>1), IFERROR(VLOOKUP(B46, バックテストデータ_5D_5Y!$B$2:$I$1562, 4, FALSE), \"データ無\"), \"\")","v":""},{"$f":"IF(M46<0,IFERROR(VLOOKUP(B46,バックテストデータ_5D_5Y!$B$2:$I$1562,8,FALSE),\"データ無\"),\"\")","v":""},{"$f":"IF(M46<0,IFERROR(VLOOKUP(B46,バックテストデータ_5D_5Y!$B$2:$I$1562,7,FALSE),\"データ無\"),\"\")","v":""}]
[42,6645,{"$f":"IF(B47=0,\"wait\",_xll.SNT.StockInst(B47,\"銘柄名称\"))","v":{"$error":"#NAME?"}},{"$f":"IF(B47=0,\"wait\",_xll.SNT.StockInst(B47,\"上場部\"))","v":{"$error":"#NAME?"}},{"$f":"IF(B47=0,\"wait\",_xll.SNT.StockInst(B47,\"現値\"))","v":{"$error":"#NAME?"}},{"$f":"IF(B47=0,\"wait\",_xll.SNT.StockInst(B47,\"前日終値\"))","v":{"$error":"#NAME?"}},"wait",{"$f":"IF(B47=0,\"wait\",MID(_xll.SNT.StockInst(B47,\"現値日時\"),12,5))","v":{"$error":"#NAME?"}},{"$f":"IF(B47=0,\"wait\",_xll.SNT.StockInst(B47,\"Tick回数\"))","v":{"$error":"#NAME?"}},{"$f":"IF(B47=0,\"wait\",_xll.SNT.StockInst(B47,\"VWAP\"))","v":{"$error":"#NAME?"}},null,{"$f":"IFERROR(INDEX(ヒストリカルデータ取得シート!$F$5:$DA$5, ROW(A42)),\"-\")","v":"-"},"",{"$f":"IFERROR(INDEX(ヒストリカルデータ取得シート!$F$6:$DA$6, ROW(A42)),\"-\")","v":"-"},null,{"$f":"IF(AND(ISNUMBER(M47), M47>1), IFERROR(VLOOKUP(B47, バックテストデータ_5D_5Y!$B$2:$I$1562, 5, FALSE), \"データ無\"), \"\")","v":""},{"$f":"IF(AND(ISNUMBER(M47), M47>1), IFERROR(VLOOKUP(B47, バックテストデータ_5D_5Y!$B$2:$I$1562, 4, FALSE), \"データ無\"), \"\")","v":""},{"$f":"IF(M47<0,IFERROR(VLOOKUP(B47,バックテストデータ_5D_5Y!$B$2:$I$1562,8,FALSE),\"データ無\"),\"\")","v":""},{"$f":"IF(M47<0,IFERROR(VLOOKUP(B47,バックテストデータ_5D_5Y!$B$2:$I$1562,7,FALSE),\"データ無\"),\"\")","v":""}]
[43,6702,{"$f":"IF(B48=0,\"wait\",_xll.SNT.StockInst(B48,\"銘柄名称\"))","v":{"$error":"#NAME?"}},{"$f":"IF(B48=0,\"wait\",_xll.SNT.StockInst(B48,\"上場部\"))","v":{"$error":"#NAME?"}},{"$f":"IF(B48=0,\"wait\",_xll.SNT.StockInst(B48,\"現値\"))","v":{"$error":"#NAME?"}},{"$f":"IF(B48=0,\"wait\",_xll.SNT.StockInst(B48,\"前日終値\"))","v":{"$error":"#NAME?"}},"wait",{"$f":"IF(B48=0,\"wait\",MID(_xll.SNT.StockInst(B48,\"現値日時\"),12,5))","v":{"$error":"#NAME?"}},{"$f":"IF(B48=0,\"wait\",_xll.SNT.StockInst(B48,\"Tick回数\"))","v":{"$error":"#NAME?"}},{"$f":"IF(B48=0,\"wait\",_xll.SNT.StockInst(B48,\"VWAP\"))","v":{"$error":"#NAME?"}},null,{"$f":"IFERROR(INDEX(ヒストリカルデータ取得シート!$F$5:$DA$5, ROW(A43)),\"-\")","v":"-"},"",{"$f":"IFERROR(INDEX(ヒストリカルデータ取得シート!$F$6:$DA$6, ROW(A43)),\"-\")","v":"-"},null,{"$f":"IF(AND(ISNUMBER(M48), M48>1), IFERROR(VLOOKUP(B48, バックテストデータ_5D_5Y!$B$2:$I$1562, 5, FALSE), \"データ無\"), \"\")","v":""},{"$f":"IF(AND(ISNUMBER(M48), M48>1), IFERROR(VLOOKUP(B48, バックテストデータ_5D_5Y!$B$2:$I$1562, 4, FALSE), \"データ無\"), \"\")","v":""},{"$f":"IF(M48<0,IFERROR(VLOOKUP(B48,バックテストデータ_5D_5Y!$B$2:$I$1562,8,FALSE),\"データ無\"),\"\")","v":""},{"$f":"IF(M48<0,IFERROR(VLOOKUP(B48,バックテストデータ_5D_5Y!$B$2:$I$1562,7,FALSE),\"データ無\"),\"\")","v":""}]
[44,6752,{"$f":"IF(B49=0,\"wait\",_xll.SNT.StockInst(B49,\"銘柄名称\"))","v":{"$error":"#NAME?"}},{"$f":"IF(B49=0,\"wait\",_xll.SNT.StockInst(B49,\"上場部\"))","v":{"$error":"#NAME?"}},{"$f":"IF(B49=0,\"wait\",_xll.SNT.StockInst(B49,\"現値\"))","v":{"$error":"#NAME?"}},{"$f":"IF(B49=0,\"wait\",_xll.SNT.StockInst(B49,\"前日終値\"))","v":{"$error":"#NAME?"}},"wait",{"$f":"IF(B49=0,\"wait\",MID(_xll.SNT.StockInst(B49,\"現値日時\"),12,5))","v":{"$error":"#NAME?"}},{"$f":"IF(B49=0,\"wait\",_xll.SNT.StockInst(B49,\"Tick回数\"))","v":{"$error":"#NAME?"}},{"$f":"IF(B49=0,\"wait\",_xll.SNT.StockInst(B49,\"VWAP\"))","v":{"$error":"#NAME?"}},null,{"$f":"IFERROR(INDEX(ヒストリカルデータ取得シート!$F$5:$DA$5, ROW(A44)),\"-\")","v":"-"},"",{"$f":"IFERROR(INDEX(ヒストリカルデータ取得シート!$F$6:$DA$6, ROW(A44)),\"-\")","v":"-"},null,{"$f":"IF(AND(ISNUMBER(M49), M49>1), IFERROR(VLOOKUP(B49, バックテストデータ_5D_5Y!$B$2:$I$1562, 5, FALSE), \"データ無\"), \"\")","v":""},{"$f":"IF(AND(ISNUMBER(M49), M49>1), IFERROR(VLOOKUP(B49, バックテストデータ_5D_5Y!$B$2:$I$1562, 4, FALSE), \"データ無\"), \"\")","v":""},{"$f":"IF(M49<0,IFERROR(VLOOKUP(B49,バックテストデータ_5D_5Y!$B$2:$I$1562,8,FALSE),\"データ無\"),\"\")","v":""},{"$f":"IF(M49<0,IFERROR(VLOOKUP(B49,バックテストデータ_5D_5Y!$B$2:$I$1562,7,FALSE),\"データ無\"),\"\")","v":""}]
[45,6758,{"$f":"IF(B50=0,\"wait\",_xll.SNT.StockInst(B50,\"銘柄名称\"))","v":{"$error":"#NAME?"}},{"$f":"IF(B50=0,\"wait\",_xll.SNT.StockInst(B50,\"上場部\"))","v":{"$error":"#NAME?"}},{"$f":"IF(B50=0,\"wait\",_xll.SNT.StockInst(B50,\"現値\"))","v":{"$error":"#NAME?"}},{"$f":"IF(B50=0,\"wait\",_xll.SNT.StockInst(B50,\"前日終値\"))","v":{"$error":"#NAME?"}},"wait",{"$f":"IF(B50=0,\"wait\",MID(_xll.SNT.StockInst(B50,\"現値日時\"),12,5))","v":{"$error":"#NAME?"}},{"$f":"IF(B50=0,\"wait\",_xll.SNT.StockInst(B50,\"Tick回数\"))","v":{"$error":"#NAME?"}},{"$f":"IF(B50=0,\"wait\",_xll.SNT.StockInst(B50,\"VWAP\"))","v":{"$error":"#NAME?"}},null,{"$f":"IFERROR(INDEX(ヒストリカルデータ取得シート!$F$5:$DA$5, ROW(A45)),\"-\")","v":"-"},"",{"$f":"IFERROR(INDEX(ヒストリカルデータ取得シート!$F$6:$DA$6, ROW(A45)),\"-\")","v":"-"},null,{"$f":"IF(AND(ISNUMBER(M50), M50>1), IFERROR(VLOOKUP(B50, バックテストデータ_5D_5Y!$B$2:$I$1562, 5, FALSE), \"データ無\"), \"\")","v":""},{"$f":"IF(AND(ISNUMBER(M50), M50>1), IFERROR(VLOOKUP(B50, バックテストデータ_5D_5Y!$B$2:$I$1562, 4, FALSE), \"データ無\"), \"\")","v":""},{"$f":"IF(M50<0,IFERROR(VLOOKUP(B50,バックテストデータ_5D_5Y!$B$2:$I$1562,8,FALSE),\"データ無\"),\"\")","v":""},{"$f":"IF(M50<0,IFERROR(VLOOKUP(B50,バックテストデータ_5D_5Y!$B$2:$I$1562,7,FALSE),\"データ無\"),\"\")","v":""}]
[46,6861,{"$f":"IF(B51=0,\"wait\",_xll.SNT.StockInst(B51,\"銘柄名称\"))","v":{"$error":"#NAME?"}},{"$f":"IF(B51=0,\"wait\",_xll.SNT.StockInst(B51,\"上場部\"))","v":{"$error":"#NAME?"}},{"$f":"IF(B51=0,\"wait\",_xll.SNT.StockInst(B51,\"現値\"))","v":{"$error":"#NAME?"}},{"$f":"IF(B51=0,\"wait\",_xll.SNT.StockInst(B51,\"前日終値\"))","v":{"$error":"#NAME?"}},"wait",{"$f":"IF(B51=0,\"wait\",MID(_xll.SNT.StockInst(B51,\"現値日時\"),12,5))","v":{"$error":"#NAME?"}},{"$f":"IF(B51=0,\"wait\",_xll.SNT.StockInst(B51,\"Tick回数\"))","v":{"$error":"#NAME?"}},{"$f":"IF(B51=0,\"wait\",_xll.SNT.StockInst(B51,\"VWAP\"))","v":{"$error":"#NAME?"}},null,{"$f":"IFERROR(INDEX(ヒストリカルデータ取得シート!$F$5:$DA$5, ROW(A46)),\"-\")","v":"-"},"",{"$f":"IFERROR(INDEX(ヒストリカルデータ取得シート!$F$6:$DA$6, ROW(A46)),\"-\")","v":"-"},null,{"$f":"IF(AND(ISNUMBER(M51), M51>1), IFERROR(VLOOKUP(B51, バックテストデータ_5D_5Y!$B$2:$I$1562, 5, FALSE), \"データ無\"), \"\")","v":""},{"$f":"IF(AND(ISNUMBER(M51), M51>1), IFERROR(VLOOKUP(B51, バックテストデータ_5D_5Y!$B$2:$I$1562, 4, FALSE), \"データ無\"), \"\")","v":""},{"$f":"IF(M51<0,IFERROR(VLOOKUP(B51,バックテストデータ_5D_5Y!$B$2:$I$1562,8,FALSE),\"データ無\"),\"\")","v":""},{"$f":"IF(M51<0,IFERROR(VLOOKUP(B51,バックテストデータ_5D_5Y!$B$2:$I$1562,7,FALSE),\"データ無\"),\"\")","v":""}]
[47,6869,{"$f":"IF(B52=0,\"wait\",_xll.SNT.StockInst(B52,\"銘柄名称\"))","v":{"$error":"#NAME?"}},{"$f":"IF(B52=0,\"wait\",_xll.SNT.StockInst(B52,\"上場部\"))","v":{"$error":"#NAME?"}},{"$f":"IF(B52=0,\"wait\",_xll.SNT.StockInst(B52,\"現値\"))","v":{"$error":"#NAME?"}},{"$f":"IF(B52=0,\"wait\",_xll.SNT.StockInst(B52,\"前日終値\"))","v":{"$error":"#NAME?"}},"wait",{"$f":"IF(B52=0,\"wait\",MID(_xll.SNT.StockInst(B52,\"現値日時\"),12,5))","v":{"$error":"#NAME?"}},{"$f":"IF(B52=0,\"wait\",_xll.SNT.StockInst(B52,\"Tick回数\"))","v":{"$error":"#NAME?"}},{"$f":"IF(B52=0,\"wait\",_xll.SNT.StockInst(B52,\"VWAP\"))","v":{"$error":"#NAME?"}},null,{"$f":"IFERROR(INDEX(ヒストリカルデータ取得シート!$F$5:$DA$5, ROW(A47)),\"-\")","v":"-"},"",{"$f":"IFERROR(INDEX(ヒストリカルデータ取得シート!$F$6:$DA$6, ROW(A47)),\"-\")","v":"-"},null,{"$f":"IF(AND(ISNUMBER(M52), M52>1), IFERROR(VLOOKUP(B52, バックテストデータ_5D_5Y!$B$2:$I$1562, 5, FALSE), \"データ無\"), \"\")","v":""},{"$f":"IF(AND(ISNUMBER(M52), M52>1), IFERROR(VLOOKUP(B52, バックテストデータ_5D_5Y!$B$2:$I$1562, 4, FALSE), \"データ無\"), \"\")","v":""},{"$f":"IF(M52<0,IFERROR(VLOOKUP(B52,バックテストデータ_5D_5Y!$B$2:$I$1562,8,FALSE),\"データ無\"),\"\")","v":""},{"$f":"IF(M52<0,IFERROR(VLOOKUP(B52,バックテストデータ_5D_5Y!$B$2:$I$1562,7,FALSE),\"データ無\"),\"\")","v":""}]
[48,6902,{"$f":"IF(B53=0,\"wait\",_xll.SNT.StockInst(B53,\"銘柄名称\"))","v":{"$error":"#NAME?"}},{"$f":"IF(B53=0,\"wait\",_xll.SNT.StockInst(B53,\"上場部\"))","v":{"$error":"#NAME?"}},{"$f":"IF(B53=0,\"wait\",_xll.SNT.StockInst(B53,\"現値\"))","v":{"$error":"#NAME?"}},{"$f":"IF(B53=0,\"wait\",_xll.SNT.StockInst(B53,\"前日終値\"))","v":{"$error":"#NAME?"}},"wait",{"$f":"IF(B53=0,\"wait\",MID(_xll.SNT.StockInst(B53,\"現値日時\"),12,5))","v":{"$error":"#NAME?"}},{"$f":"IF(B53=0,\"wait\",_xll.SNT.StockInst(B53,\"Tick回数\"))","v":{"$error":"#NAME?"}},{"$f":"IF(B53=0,\"wait\",_xll.SNT.StockInst(B53,\"VWAP\"))","v":{"$error":"#NAME?"}},null,{"$f":"IFERROR(INDEX(ヒストリカルデータ取得シート!$F$5:$DA$5, ROW(A48)),\"-\")","v":"-"},"",{"$f":"IFERROR(INDEX(ヒストリカルデータ取得シート!$F$6:$DA$6, ROW(A48)),\"-\")","v":"-"},null,{"$f":"IF(AND(ISNUMBER(M53), M53>1), IFERROR(VLOOKUP(B53, バックテストデータ_5D_5Y!$B$2:$I$1562, 5, FALSE), \"データ無\"), \"\")","v":""},{"$f":"IF(AND(ISNUMBER(M53), M53>1), IFERROR(VLOOKUP(B53, バックテストデータ_5D_5Y!$B$2:$I$1562, 4, FALSE), \"データ無\"), \"\")","v":""},{"$f":"IF(M53<0,IFERROR(VLOOKUP(B53,バックテストデータ_5D_5Y!$B$2:$I$1562,8,FALSE),\"データ無\"),\"\")","v":""},{"$f":"IF(M53<0,IFERROR(VLOOKUP(B53,バックテストデータ_5D_5Y!$B$2:$I$1562,7,FALSE),\"データ無\"),\"\")","v":""}]
[49,6920,{"$f":"IF(B54=0,\"wait\",_xll.SNT.StockInst(B54,\"銘柄名称\"))","v":{"$error":"#NAME?"}},{"$f":"IF(B54=0,\"wait\",_xll.SNT.StockInst(B54,\"上場部\"))","v":{"$error":"#NAME?"}},{"$f":"IF(B54=0,\"wait\",_xll.SNT.StockInst(B54,\"現値\"))","v":{"$error":"#NAME?"}},{"$f":"IF(B54=0,\"wait\",_xll.SNT.StockInst(B54,\"前日終値\"))","v":{"$error":"#NAME?"}},"wait",{"$f":"IF(B54=0,\"wait\",MID(_xll.SNT.StockInst(B54,\"現値日時\"),12,5))","v":{"$error":"#NAME?"}},{"$f":"IF(B54=0,\"wait\",_xll.SNT.StockInst(B54,\"Tick回数\"))","v":{"$error":"#NAME?"}},{"$f":"IF(B54=0,\"wait\",_xll.SNT.StockInst(B54,\"VWAP\"))","v":{"$error":"#NAME?"}},null,{"$f":"IFERROR(INDEX(ヒストリカルデータ取得シート!$F$5:$DA$5, ROW(A49)),\"-\")","v":"-"},"",{"$f":"IFERROR(INDEX(ヒストリカルデータ取得シート!$F$6:$DA$6, ROW(A49)),\"-\")","v":"-"},null,{"$f":"IF(AND(ISNUMBER(M54), M54>1), IFERROR(VLOOKUP(B54, バックテストデータ_5D_5Y!$B$2:$I$1562, 5, FALSE), \"データ無\"), \"\")","v":""},{"$f":"IF(AND(ISNUMBER(M54), M54>1), IFERROR(VLOOKUP(B54, バックテストデータ_5D_5Y!$B$2:$I$1562, 4, FALSE), \"データ無\"), \"\")","v":""},{"$f":"IF(M54<0,IFERROR(VLOOKUP(B54,バックテストデータ_5D_5Y!$B$2:$I$1562,8,FALSE),\"データ無\"),\"\")","v":""},{"$f":"IF(M54<0,IFERROR(VLOOKUP(B54,バックテストデータ_5D_5Y!$B$2:$I$1562,7,FALSE),\"データ無\"),\"\")","v":""}]
[50,6954,{"$f":"IF(B55=0,\"wait\",_xll.SNT.StockInst(B55,\"銘柄名称\"))","v":{"$error":"#NAME?"}},{"$f":"IF(B55=0,\"wait\",_xll.SNT.StockInst(B55,\"上場部\"))","v":{"$error":"#NAME?"}},{"$f":"IF(B55=0,\"wait\",_xll.SNT.StockInst(B55,\"現値\"))","v":{"$error":"#NAME?"}},{"$f":"IF(B55=0,\"wait\",_xll.SNT.StockInst(B55,\"前日終値\"))","v":{"$error":"#NAME?"}},"wait",{"$f":"IF(B55=0,\"wait\",MID(_xll.SNT.StockInst(B55,\"現値日時\"),12,5))","v":{"$error":"#NAME?"}},{"$f":"IF(B55=0,\"wait\",_xll.SNT.StockInst(B55,\"Tick回数\"))","v":{"$error":"#NAME?"}},{"$f":"IF(B55=0,\"wait\",_xll.SNT.StockInst(B55,\"VWAP\"))","v":{"$error":"#NAME?"}},null,{"$f":"IFERROR(INDEX(ヒストリカルデータ取得シート!$F$5:$DA$5, ROW(A50)),\"-\")","v":"-"},"",{"$f":"IFERROR(INDEX(ヒストリカルデータ取得シート!$F$6:$DA$6, ROW(A50)),\"-\")","v":"-"},null,{"$f":"IF(AND(ISNUMBER(M55), M55>1), IFERROR(VLOOKUP(B55, バックテストデータ_5D_5Y!$B$2:$I$1562, 5, FALSE), \"データ無\"), \"\")","v":""},{"$f":"IF(AND(ISNUMBER(M55), M55>1), IFERROR(VLOOKUP(B55, バックテストデータ_5D_5Y!$B$2:$I$1562, 4, FALSE), \"データ無\"), \"\")","v":""},{"$f":"IF(M55<0,IFERROR(VLOOKUP(B55,バックテストデータ_5D_5Y!$B$2:$I$1562,8,FALSE),\"データ無\"),\"\")","v":""},{"$f":"IF(M55<0,IFERROR(VLOOKUP(B55,バックテストデータ_5D_5Y!$B$2:$I$1562,7,FALSE),\"データ無\"),\"\")","v":""}]
[51,6971,{"$f":"IF(B56=0,\"wait\",_xll.SNT.StockInst(B56,\"銘柄名称\"))","v":{"$error":"#NAME?"}},{"$f":"IF(B56=0,\"wait\",_xll.SNT.StockInst(B56,\"上場部\"))","v":{"$error":"#NAME?"}},{"$f":"IF(B56=0,\"wait\",_xll.SNT.StockInst(B56,\"現値\"))","v":{"$error":"#NAME?"}},{"$f":"IF(B56=0,\"wait\",_xll.SNT.StockInst(B56,\"前日終値\"))","v":{"$error":"#NAME?"}},{"$f":"IFERROR(E56-F56,\"wait\")","v":"wait"},{"$f":"IF(B56=0,\"wait\",MID(_xll.SNT.StockInst(B56,\"現値日時\"),12,5))","v":{"$error":"#NAME?"}},{"$f":"IF(B56=0,\"wait\",_xll.SNT.StockInst(B56,\"Tick回数\"))","v":{"$error":"#NAME?"}},{"$f":"IF(B56=0,\"wait\",_xll.SNT.StockInst(B56,\"VWAP\"))","v":{"$error":"#NAME?"}},null,{"$f":"IFERROR(INDEX(ヒストリカルデータ取得シート!$F$5:$DA$5, ROW(A51)),\"-\")","v":"-"},"",{"$f":"IFERROR(INDEX(ヒストリカルデータ取得シート!$F$6:$DA$6, ROW(A51)),\"-\")","v":"-"},null,{"$f":"IF(AND(ISNUMBER(M56), M56>1), IFERROR(VLOOKUP(B56, バックテストデータ_5D_5Y!$B$2:$I$1562, 5, FALSE), \"データ無\"), \"\")","v":""},{"$f":"IF(AND(ISNUMBER(M56), M56>1), IFERROR(VLOOKUP(B56, バックテストデータ_5D_5Y!$B$2:$I$1562, 4, FALSE), \"データ無\"), \"\")","v":""},{"$f":"IF(M56<0,IFERROR(VLOOKUP(B56,バックテストデータ_5D_5Y!$B$2:$I$1562,8,FALSE),\"データ無\"),\"\")","v":""},{"$f":"IF(M56<0,IFERROR(VLOOKUP(B56,バックテストデータ_5D_5Y!$B$2:$I$1562,7,FALSE),\"データ無\"),\"\")","v":""}]
[52,6981,{"$f":"IF(B57=0,\"wait\",_xll.SNT.StockInst(B57,\"銘柄名称\"))","v":{"$error":"#NAME?"}},{"$f":"IF(B57=0,\"wait\",_xll.SNT.StockInst(B57,\"上場部\"))","v":{"$error":"#NAME?"}},{"$f":"IF(B57=0,\"wait\",_xll.SNT.StockInst(B57,\"現値\"))","v":{"$error":"#NAME?"}},{"$f":"IF(B57=0,\"wait\",_xll.SNT.StockInst(B57,\"前日終値\"))","v":{"$error":"#NAME?"}},"wait",{"$f":"IF(B57=0,\"wait\",MID(_xll.SNT.StockInst(B57,\"現値日時\"),12,5))","v":{"$error":"#NAME?"}},{"$f":"IF(B57=0,\"wait\",_xll.SNT.StockInst(B57,\"Tick回数\"))","v":{"$error":"#NAME?"}},{"$f":"IF(B57=0,\"wait\",_xll.SNT.StockInst(B57,\"VWAP\"))","v":{"$error":"#NAME?"}},null,{"$f":"IFERROR(INDEX(ヒストリカルデータ取得シート!$F$5:$DA$5, ROW(A52)),\"-\")","v":"-"},"",{"$f":"IFERROR(INDEX(ヒストリカルデータ取得シート!$F$6:$DA$6, ROW(A52)),\"-\")","v":"-"},null,{"$f":"IF(AND(ISNUMBER(M57), M57>1), IFERROR(VLOOKUP(B57, バックテストデータ_5D_5Y!$B$2:$I$1562, 5, FALSE), \"データ無\"), \"\")","v":""},{"$f":"IF(AND(ISNUMBER(M57), M57>1), IFERROR(VLOOKUP(B57, バックテストデータ_5D_5Y!$B$2:$I$1562, 4, FALSE), \"データ無\"), \"\")","v":""},{"$f":"IF(M57<0,IFERROR(VLOOKUP(B57,バックテストデータ_5D_5Y!$B$2:$I$1562,8,FALSE),\"データ無\"),\"\")","v":""},{"$f":"IF(M57<0,IFERROR(VLOOKUP(B57,バックテストデータ_5D_5Y!$B$2:$I$1562,7,FALSE),\"データ無\"),\"\")","v":""}]
[53,7011,{"$f":"IF(B58=0,\"wait\",_xll.SNT.StockInst(B58,\"銘柄名称\"))","v":{"$error":"#NAME?"}},{"$f":"IF(B58=0,\"wait\",_xll.SNT.StockInst(B58,\"上場部\"))","v":{"$error":"#NAME?"}},{"$f":"IF(B58=0,\"wait\",_xll.SNT.StockInst(B58,\"現値\"))","v":{"$error":"#NAME?"}},{"$f":"IF(B58=0,\"wait\",_xll.SNT.StockInst(B58,\"前日終値\"))","v":{"$error":"#NAME?"}},"wait",{"$f":"IF(B58=0,\"wait\",MID(_xll.SNT.StockInst(B58,\"現値日時\"),12,5))","v":{"$error":"#NAME?"}},{"$f":"IF(B58=0,\"wait\",_xll.SNT.StockInst(B58,\"Tick回数\"))","v":{"$error":"#NAME?"}},{"$f":"IF(B58=0,\"wait\",_xll.SNT.StockInst(B58,\"VWAP\"))","v":{"$error":"#NAME?"}},null,{"$f":"IFERROR(INDEX(ヒストリカルデータ取得シート!$F$5:$DA$5, ROW(A53)),\"-\")","v":"-"},"",{"$f":"IFERROR(INDEX(ヒストリカルデータ取得シート!$F$6:$DA$6, ROW(A53)),\"-\")","v":"-"},null,{"$f":"IF(AND(ISNUMBER(M58), M58>1), IFERROR(VLOOKUP(B58, バックテストデータ_5D_5Y!$B$2:$I$1562, 5, FALSE), \"データ無\"), \"\")","v":""},{"$f":"IF(AND(ISNUMBER(M58), M58>1), IFERROR(VLOOKUP(B58, バックテストデータ_5D_5Y!$B$2:$I$1562, 4, FALSE), \"データ無\"), \"\")","v":""},{"$f":"IF(M58<0,IFERROR(VLOOKUP(B58,バックテストデータ_5D_5Y!$B$2:$I$1562,8,FALSE),\"データ無\"),\"\")","v":""},{"$f":"IF(M58<0,IFERROR(VLOOKUP(B58,バックテストデータ_5D_5Y!$B$2:$I$1562,7,FALSE),\"データ無\"),\"\")","v":""}]
[54,7201,{"$f":"IF(B59=0,\"wait\",_xll.SNT.StockInst(B59,\"銘柄名称\"))","v":{"$error":"#NAME?"}},{"$f":"IF(B59=0,\"wait\",_xll.SNT.StockInst(B59,\"上場部\"))","v":{"$error":"#NAME?"}},{"$f":"IF(B59=0,\"wait\",_xll.SNT.StockInst(B59,\"現値\"))","v":{"$error":"#NAME?"}},{"$f":"IF(B59=0,\"wait\",_xll.SNT.StockInst(B59,\"前日終値\"))","v":{"$error":"#NAME?"}},"wait",{"$f":"IF(B59=0,\"wait\",MID(_xll.SNT.StockInst(B59,\"現値日時\"),12,5))","v":{"$error":"#NAME?"}},{"$f":"IF(B59=0,\"wait\",_xll.SNT.StockInst(B59,\"Tick回数\"))","v":{"$error":"#NAME?"}},{"$f":"IF(B59=0,\"wait\",_xll.SNT.StockInst(B59,\"VWAP\"))","v":{"$error":"#NAME?"}},null,{"$f":"IFERROR(INDEX(ヒストリカルデータ取得シート!$F$5:$DA$5, ROW(A54)),\"-\")","v":"-"},"",{"$f":"IFERROR(INDEX(ヒストリカルデータ取得シート!$F$6:$DA$6, ROW(A54)),\"-\")","v":"-"},null,{"$f":"IF(AND(ISNUMBER(M59), M59>1), IFERROR(VLOOKUP(B59, バックテストデータ_5D_5Y!$B$2:$I$1562, 5, FALSE), \"データ無\"), \"\")","v":""},{"$f":"IF(AND(ISNUMBER(M59), M59>1), IFERROR(VLOOKUP(B59, バックテストデータ_5D_5Y!$B$2:$I$1562, 4, FALSE), \"データ無\"), \"\")","v":""},{"$f":"IF(M59<0,IFERROR(VLOOKUP(B59,バックテストデータ_5D_5Y!$B$2:$I$1562,8,FALSE),\"データ無\"),\"\")","v":""},{"$f":"IF(M59<0,IFERROR(VLOOKUP(B59,バックテストデータ_5D_5Y!$B$2:$I$1562,7,FALSE),\"データ無\"),\"\")","v":""}]
[55,7203,{"$f":"IF(B60=0,\"wait\",_xll.SNT.StockInst(B60,\"銘柄名称\"))","v":{"$error":"#NAME?"}},{"$f":"IF(B60=0,\"wait\",_xll.SNT.StockInst(B60,\"上場部\"))","v":{"$error":"#NAME?"}},{"$f":"IF(B60=0,\"wait\",_xll.SNT.StockInst(B60,\"現値\"))","v":{"$error":"#NAME?"}},{"$f":"IF(B60=0,\"wait\",_xll.SNT.StockInst(B60,\"前日終値\"))","v":{"$error":"#NAME?"}},"wait",{"$f":"IF(B60=0,\"wait\",MID(_xll.SNT.StockInst(B60,\"現値日時\"),12,5))","v":{"$error":"#NAME?"}},{"$f":"IF(B60=0,\"wait\",_xll.SNT.StockInst(B60,\"Tick回数\"))","v":{"$error":"#NAME?"}},{"$f":"IF(B60=0,\"wait\",_xll.SNT.StockInst(B60,\"VWAP\"))","v":{"$error":"#NAME?"}},null,{"$f":"IFERROR(INDEX(ヒストリカルデータ取得シート!$F$5:$DA$5, ROW(A55)),\"-\")","v":"-"},"",{"$f":"IFERROR(INDEX(ヒストリカルデータ取得シート!$F$6:$DA$6, ROW(A55)),\"-\")","v":"-"},null,{"$f":"IF(AND(ISNUMBER(M60), M60>1), IFERROR(VLOOKUP(B60, バックテストデータ_5D_5Y!$B$2:$I$1562, 5, FALSE), \"データ無\"), \"\")","v":""},{"$f":"IF(AND(ISNUMBER(M60), M60>1), IFERROR(VLOOKUP(B60, バックテストデータ_5D_5Y!$B$2:$I$1562, 4, FALSE), \"データ無\"), \"\")","v":""},{"$f":"IF(M60<0,IFERROR(VLOOKUP(B60,バックテストデータ_5D_5Y!$B$2:$I$1562,8,FALSE),\"データ無\"),\"\")","v":""},{"$f":"IF(M60<0,IFERROR(VLOOKUP(B60,バックテストデータ_5D_5Y!$B$2:$I$1562,7,FALSE),\"データ無\"),\"\")","v":""}]
[56,7267,{"$f":"IF(B61=0,\"wait\",_xll.SNT.StockInst(B61,\"銘柄名称\"))","v":{"$error":"#NAME?"}},{"$f":"IF(B61=0,\"wait\",_xll.SNT.StockInst(B61,\"上場部\"))","v":{"$error":"#NAME?"}},{"$f":"IF(B61=0,\"wait\",_xll.SNT.StockInst(B61,\"現値\"))","v":{"$error":"#NAME?"}},{"$f":"IF(B61=0,\"wait\",_xll.SNT.StockInst(B61,\"前日終値\"))","v":{"$error":"#NAME?"}},"wait",{"$f":"IF(B61=0,\"wait\",MID(_xll.SNT.StockInst(B61,\"現値日時\"),12,5))","v":{"$error":"#NAME?"}},{"$f":"IF(B61=0,\"wait\",_xll.SNT.StockInst(B61,\"Tick回数\"))","v":{"$error":"#NAME?"}},{"$f":"IF(B61=0,\"wait\",_xll.SNT.StockInst(B61,\"VWAP\"))","v":{"$error":"#NAME?"}},null,{"$f":"IFERROR(INDEX(ヒストリカルデータ取得シート!$F$5:$DA$5, ROW(A56)),\"-\")","v":"-"},"",{"$f":"IFERROR(INDEX(ヒストリカルデータ取得シート!$F$6:$DA$6, ROW(A56)),\"-\")","v":"-"},null,{"$f":"IF(AND(ISNUMBER(M61), M61>1), IFERROR(VLOOKUP(B61, バックテストデータ_5D_5Y!$B$2:$I$1562, 5, FALSE), \"データ無\"), \"\")","v":""},{"$f":"IF(AND(ISNUMBER(M61), M61>1), IFERROR(VLOOKUP(B61, バックテストデータ_5D_5Y!$B$2:$I$1562, 4, FALSE), \"データ無\"), \"\")","v":""},{"$f":"IF(M61<0,IFERROR(VLOOKUP(B61,バックテストデータ_5D_5Y!$B$2:$I$1562,8,FALSE),\"データ無\"),\"\")","v":""},{"$f":"IF(M61<0,IFERROR(VLOOKUP(B61,バックテストデータ_5D_5Y!$B$2:$I$1562,7,FALSE),\"データ無\"),\"\")","v":""}]
[57,7269,{"$f":"IF(B62=0,\"wait\",_xll.SNT.StockInst(B62,\"銘柄名称\"))","v":{"$error":"#NAME?"}},{"$f":"IF(B62=0,\"wait\",_xll.SNT.StockInst(B62,\"上場部\"))","v":{"$error":"#NAME?"}},{"$f":"IF(B62=0,\"wait\",_xll.SNT.StockInst(B62,\"現値\"))","v":{"$error":"#NAME?"}},{"$f":"IF(B62=0,\"wait\",_xll.SNT.StockInst(B62,\"前日終値\"))","v":{"$error":"#NAME?"}},"wait",{"$f":"IF(B62=0,\"wait\",MID(_xll.SNT.StockInst(B62,\"現値日時\"),12,5))","v":{"$error":"#NAME?"}},{"$f":"IF(B62=0,\"wait\",_xll.SNT.StockInst(B62,\"Tick回数\"))","v":{"$error":"#NAME?"}},{"$f":"IF(B62=0,\"wait\",_xll.SNT.StockInst(B62,\"VWAP\"))","v":{"$error":"#NAME?"}},null,{"$f":"IFERROR(INDEX(ヒストリカルデータ取得シート!$F$5:$DA$5, ROW(A57)),\"-\")","v":"-"},"",{"$f":"IFERROR(INDEX(ヒストリカルデータ取得シート!$F$6:$DA$6, ROW(A57)),\"-\")","v":"-"},null,{"$f":"IF(AND(ISNUMBER(M62), M62>1), IFERROR(VLOOKUP(B62, バックテストデータ_5D_5Y!$B$2:$I$1562, 5, FALSE), \"データ無\"), \"\")","v":""},{"$f":"IF(AND(ISNUMBER(M62), M62>1), IFERROR(VLOOKUP(B62, バックテストデータ_5D_5Y!$B$2:$I$1562, 4, FALSE), \"データ無\"), \"\")","v":""},{"$f":"IF(M62<0,IFERROR(VLOOKUP(B62,バックテストデータ_5D_5Y!$B$2:$I$1562,8,FALSE),\"データ無\"),\"\")","v":""},{"$f":"IF(M62<0,IFERROR(VLOOKUP(B62,バックテストデータ_5D_5Y!$B$2:$I$1562,7,FALSE),\"データ無\"),\"\")","v":""}]
[58,7270,{"$f":"IF(B63=0,\"wait\",_xll.SNT.StockInst(B63,\"銘柄名称\"))","v":{"$error":"#NAME?"}},{"$f":"IF(B63=0,\"wait\",_xll.SNT.StockInst(B63,\"上場部\"))","v":{"$error":"#NAME?"}},{"$f":"IF(B63=0,\"wait\",_xll.SNT.StockInst(B63,\"現値\"))","v":{"$error":"#NAME?"}},{"$f":"IF(B63=0,\"wait\",_xll.SNT.StockInst(B63,\"前日終値\"))","v":{"$error":"#NAME?"}},"wait",{"$f":"IF(B63=0,\"wait\",MID(_xll.SNT.StockInst(B63,\"現値日時\"),12,5))","v":{"$error":"#NAME?"}},{"$f":"IF(B63=0,\"wait\",_xll.SNT.StockInst(B63,\"Tick回数\"))","v":{"$error":"#NAME?"}},{"$f":"IF(B63=0,\"wait\",_xll.SNT.StockInst(B63,\"VWAP\"))","v":{"$error":"#NAME?"}},null,{"$f":"IFERROR(INDEX(ヒストリカルデータ取得シート!$F$5:$DA$5, ROW(A58)),\"-\")","v":"-"},"",{"$f":"IFERROR(INDEX(ヒストリカルデータ取得シート!$F$6:$DA$6, ROW(A58)),\"-\")","v":"-"},null,{"$f":"IF(AND(ISNUMBER(M63), M63>1), IFERROR(VLOOKUP(B63, バックテストデータ_5D_5Y!$B$2:$I$1562, 5, FALSE), \"データ無\"), \"\")","v":""},{"$f":"IF(AND(ISNUMBER(M63), M63>1), IFERROR(VLOOKUP(B63, バックテストデータ_5D_5Y!$B$2:$I$1562, 4, FALSE), \"データ無\"), \"\")","v":""},{"$f":"IF(M63<0,IFERROR(VLOOKUP(B63,バックテストデータ_5D_5Y!$B$2:$I$1562,8,FALSE),\"データ無\"),\"\")","v":""},{"$f":"IF(M63<0,IFERROR(VLOOKUP(B63,バックテストデータ_5D_5Y!$B$2:$I$1562,7,FALSE),\"データ無\"),\"\")","v":""}]
[59,7309,{"$f":"IF(B64=0,\"wait\",_xll.SNT.StockInst(B64,\"銘柄名称\"))","v":{"$error":"#NAME?"}},{"$f":"IF(B64=0,\"wait\",_xll.SNT.StockInst(B64,\"上場部\"))","v":{"$error":"#NAME?"}},{"$f":"IF(B64=0,\"wait\",_xll.SNT.StockInst(B64,\"現値\"))","v":{"$error":"#NAME?"}},{"$f":"IF(B64=0,\"wait\",_xll.SNT.StockInst(B64,\"前日終値\"))","v":{"$error":"#NAME?"}},"wait",{"$f":"IF(B64=0,\"wait\",MID(_xll.SNT.StockInst(B64,\"現値日時\"),12,5))","v":{"$error":"#NAME?"}},{"$f":"IF(B64=0,\"wait\",_xll.SNT.StockInst(B64,\"Tick回数\"))","v":{"$error":"#NAME?"}},{"$f":"IF(B64=0,\"wait\",_xll.SNT.StockInst(B64,\"VWAP\"))","v":{"$error":"#NAME?"}},null,{"$f":"IFERROR(INDEX(ヒストリカルデータ取得シート!$F$5:$DA$5, ROW(A59)),\"-\")","v":"-"},"",{"$f":"IFERROR(INDEX(ヒストリカルデータ取得シート!$F$6:$DA$6, ROW(A59)),\"-\")","v":"-"},null,{"$f":"IF(AND(ISNUMBER(M64), M64>1), IFERROR(VLOOKUP(B64, バックテストデータ_5D_5Y!$B$2:$I$1562, 5, FALSE), \"データ無\"), \"\")","v":""},{"$f":"IF(AND(ISNUMBER(M64), M64>1), IFERROR(VLOOKUP(B64, バックテストデータ_5D_5Y!$B$2:$I$1562, 4, FALSE), \"データ無\"), \"\")","v":""},{"$f":"IF(M64<0,IFERROR(VLOOKUP(B64,バックテストデータ_5D_5Y!$B$2:$I$1562,8,FALSE),\"データ無\"),\"\")","v":""},{"$f":"IF(M64<0,IFERROR(VLOOKUP(B64,バックテストデータ_5D_5Y!$B$2:$I$1562,7,FALSE),\"データ無\"),\"\")","v":""}]
[60,7733,{"$f":"IF(B65=0,\"wait\",_xll.SNT.StockInst(B65,\"銘柄名称\"))","v":{"$error":"#NAME?"}},{"$f":"IF(B65=0,\"wait\",_xll.SNT.StockInst(B65,\"上場部\"))","v":{"$error":"#NAME?"}},{"$f":"IF(B65=0,\"wait\",_xll.SNT.StockInst(B65,\"現値\"))","v":{"$error":"#NAME?"}},{"$f":"IF(B65=0,\"wait\",_xll.SNT.StockInst(B65,\"前日終値\"))","v":{"$error":"#NAME?"}},"wait",{"$f":"IF(B65=0,\"wait\",MID(_xll.SNT.StockInst(B65,\"現値日時\"),12,5))","v":{"$error":"#NAME?"}},{"$f":"IF(B65=0,\"wait\",_xll.SNT.StockInst(B65,\"Tick回数\"))","v":{"$error":"#NAME?"}},{"$f":"IF(B65=0,\"wait\",_xll.SNT.StockInst(B65,\"VWAP\"))","v":{"$error":"#NAME?"}},null,{"$f":"IFERROR(INDEX(ヒストリカルデータ取得シート!$F$5:$DA$5, ROW(A60)),\"-\")","v":"-"},"",{"$f":"IFERROR(INDEX(ヒストリカルデータ取得シート!$F$6:$DA$6, ROW(A60)),\"-\")","v":"-"},null,{"$f":"IF(AND(ISNUMBER(M65), M65>1), IFERROR(VLOOKUP(B65, バックテストデータ_5D_5Y!$B$2:$I$1562, 5, FALSE), \"データ無\"), \"\")","v":""},{"$f":"IF(AND(ISNUMBER(M65), M65>1), IFERROR(VLOOKUP(B65, バックテストデータ_5D_5Y!$B$2:$I$1562, 4, FALSE), \"データ無\"), \"\")","v":""},{"$f":"IF(M65<0,IFERROR(VLOOKUP(B65,バックテストデータ_5D_5Y!$B$2:$I$1562,8,FALSE),\"データ無\"),\"\")","v":""},{"$f":"IF(M65<0,IFERROR(VLOOKUP(B65,バックテストデータ_5D_5Y!$B$2:$I$1562,7,FALSE),\"データ無\"),\"\")","v":""}]
[61,7741,{"$f":"IF(B66=0,\"wait\",_xll.SNT.StockInst(B66,\"銘柄名称\"))","v":{"$error":"#NAME?"}},{"$f":"IF(B66=0,\"wait\",_xll.SNT.StockInst(B66,\"上場部\"))","v":{"$error":"#NAME?"}},{"$f":"IF(B66=0,\"wait\",_xll.SNT.StockInst(B66,\"現値\"))","v":{"$error":"#NAME?"}},{"$f":"IF(B66=0,\"wait\",_xll.SNT.StockInst(B66,\"前日終値\"))","v":{"$error":"#NAME?"}},"wait",{"$f":"IF(B66=0,\"wait\",MID(_xll.SNT.StockInst(B66,\"現値日時\"),12,5))","v":{"$error":"#NAME?"}},{"$f":"IF(B66=0,\"wait\",_xll.SNT.StockInst(B66,\"Tick回数\"))","v":{"$error":"#NAME?"}},{"$f":"IF(B66=0,\"wait\",_xll.SNT.StockInst(B66,\"VWAP\"))","v":{"$error":"#NAME?"}},null,{"$f":"IFERROR(INDEX(ヒストリカルデータ取得シート!$F$5:$DA$5, ROW(A61)),\"-\")","v":"-"},"",{"$f":"IFERROR(INDEX(ヒストリカルデータ取得シート!$F$6:$DA$6, ROW(A61)),\"-\")","v":"-"},null,{"$f":"IF(AND(ISNUMBER(M66), M66>1), IFERROR(VLOOKUP(B66, バックテストデータ_5D_5Y!$B$2:$I$1562, 5, FALSE), \"データ無\"), \"\")","v":""},{"$f":"IF(AND(ISNUMBER(M66), M66>1), IFERROR(VLOOKUP(B66, バックテストデータ_5D_5Y!$B$2:$I$1562, 4, FALSE), \"データ無\"), \"\")","v":""},{"$f":"IF(M66<0,IFERROR(VLOOKUP(B66,バックテストデータ_5D_5Y!$B$2:$I$1562,8,FALSE),\"データ無\"),\"\")","v":""},{"$f":"IF(M66<0,IFERROR(VLOOKUP(B66,バックテストデータ_5D_5Y!$B$2:$I$1562,7,FALSE),\"データ無\"),\"\")","v":""}]
[62,7751,{"$f":"IF(B67=0,\"wait\",_xll.SNT.StockInst(B67,\"銘柄名称\"))","v":{"$error":"#NAME?"}},{"$f":"IF(B67=0,\"wait\",_xll.SNT.StockInst(B67,\"上場部\"))","v":{"$error":"#NAME?"}},{"$f":"IF(B67=0,\"wait\",_xll.SNT.StockInst(B67,\"現値\"))","v":{"$error":"#NAME?"}},{"$f":"IF(B67=0,\"wait\",_xll.SNT.StockInst(B67,\"前日終値\"))","v":{"$error":"#NAME?"}},"wait",{"$f":"IF(B67=0,\"wait\",MID(_xll.SNT.StockInst(B67,\"現値日時\"),12,5))","v":{"$error":"#NAME?"}},{"$f":"IF(B67=0,\"wait\",_xll.SNT.StockInst(B67,\"Tick回数\"))","v":{"$error":"#NAME?"}},{"$f":"IF(B67=0,\"wait\",_xll.SNT.StockInst(B67,\"VWAP\"))","v":{"$error":"#NAME?"}},null,{"$f":"IFERROR(INDEX(ヒストリカルデータ取得シート!$F$5:$DA$5, ROW(A62)),\"-\")","v":"-"},"",{"$f":"IFERROR(INDEX(ヒストリカルデータ取得シート!$F$6:$DA$6, ROW(A62)),\"-\")","v":"-"},null,{"$f":"IF(AND(ISNUMBER(M67), M67>1), IFERROR(VLOOKUP(B67, バックテストデータ_5D_5Y!$B$2:$I$1562, 5, FALSE), \"データ無\"), \"\")","v":""},{"$f":"IF(AND(ISNUMBER(M67), M67>1), IFERROR(VLOOKUP(B67, バックテストデータ_5D_5Y!$B$2:$I$1562, 4, FALSE), \"データ無\"), \"\")","v":""},{"$f":"IF(M67<0,IFERROR(VLOOKUP(B67,バックテストデータ_5D_5Y!$B$2:$I$1562,8,FALSE),\"データ無\"),\"\")","v":""},{"$f":"IF(M67<0,IFERROR(VLOOKUP(B67,バックテストデータ_5D_5Y!$B$2:$I$1562,7,FALSE),\"データ無\"),\"\")","v":""}]
[63,7832,{"$f":"IF(B68=0,\"wait\",_xll.SNT.StockInst(B68,\"銘柄名称\"))","v":{"$error":"#NAME?"}},{"$f":"IF(B68=0,\"wait\",_xll.SNT.StockInst(B68,\"上場部\"))","v":{"$error":"#NAME?"}},{"$f":"IF(B68=0,\"wait\",_xll.SNT.StockInst(B68,\"現値\"))","v":{"$error":"#NAME?"}},{"$f":"IF(B68=0,\"wait\",_xll.SNT.StockInst(B68,\"前日終値\"))","v":{"$error":"#NAME?"}},"wait",{"$f":"IF(B68=0,\"wait\",MID(_xll.SNT.StockInst(B68,\"現値日時\"),12,5))","v":{"$error":"#NAME?"}},{"$f":"IF(B68=0,\"wait\",_xll.SNT.StockInst(B68,\"Tick回数\"))","v":{"$error":"#NAME?"}},{"$f":"IF(B68=0,\"wait\",_xll.SNT.StockInst(B68,\"VWAP\"))","v":{"$error":"#NAME?"}},null,{"$f":"IFERROR(INDEX(ヒストリカルデータ取得シート!$F$5:$DA$5, ROW(A63)),\"-\")","v":"-"},"",{"$f":"IFERROR(INDEX(ヒストリカルデータ取得シート!$F$6:$DA$6, ROW(A63)),\"-\")","v":"-"},null,{"$f":"IF(AND(ISNUMBER(M68), M68>1), IFERROR(VLOOKUP(B68, バックテストデータ_5D_5Y!$B$2:$I$1562, 5, FALSE), \"データ無\"), \"\")","v":""},{"$f":"IF(AND(ISNUMBER(M68), M68>1), IFERROR(VLOOKUP(B68, バックテストデータ_5D_5Y!$B$2:$I$1562, 4, FALSE), \"データ無\"), \"\")","v":""},{"$f":"IF(M68<0,IFERROR(VLOOKUP(B68,バックテストデータ_5D_5Y!$B$2:$I$1562,8,FALSE),\"データ無\"),\"\")","v":""},{"$f":"IF(M68<0,IFERROR(VLOOKUP(B68,バックテストデータ_5D_5Y!$B$2:$I$1562,7,FALSE),\"データ無\"),\"\")","v":""}]
[64,7974,{"$f":"IF(B69=0,\"wait\",_xll.SNT.StockInst(B69,\"銘柄名称\"))","v":{"$error":"#NAME?"}},{"$f":"IF(B69=0,\"wait\",_xll.SNT.StockInst(B69,\"上場部\"))","v":{"$error":"#NAME?"}},{"$f":"IF(B69=0,\"wait\",_xll.SNT.StockInst(B69,\"現値\"))","v":{"$error":"#NAME?"}},{"$f":"IF(B69=0,\"wait\",_xll.SNT.StockInst(B69,\"前日終値\"))","v":{"$error":"#NAME?"}},"wait",{"$f":"IF(B69=0,\"wait\",MID(_xll.SNT.StockInst(B69,\"現値日時\"),12,5))","v":{"$error":"#NAME?"}},{"$f":"IF(B69=0,\"wait\",_xll.SNT.StockInst(B69,\"Tick回数\"))","v":{"$error":"#NAME?"}},{"$f":"IF(B69=0,\"wait\",_xll.SNT.StockInst(B69,\"VWAP\"))","v":{"$error":"#NAME?"}},null,{"$f":"IFERROR(INDEX(ヒストリカルデータ取得シート!$F$5:$DA$5, ROW(A64)),\"-\")","v":"-"},"",{"$f":"IFERROR(INDEX(ヒストリカルデータ取得シート!$F$6:$DA$6, ROW(A64)),\"-\")","v":"-"},null,{"$f":"IF(AND(ISNUMBER(M69), M69>1), IFERROR(VLOOKUP(B69, バックテストデータ_5D_5Y!$B$2:$I$1562, 5, FALSE), \"データ無\"), \"\")","v":""},{"$f":"IF(AND(ISNUMBER(M69), M69>1), IFERROR(VLOOKUP(B69, バックテストデータ_5D_5Y!$B$2:$I$1562, 4, FALSE), \"データ無\"), \"\")","v":""},{"$f":"IF(M69<0,IFERROR(VLOOKUP(B69,バックテストデータ_5D_5Y!$B$2:$I$1562,8,FALSE),\"データ無\"),\"\")","v":""},{"$f":"IF(M69<0,IFERROR(VLOOKUP(B69,バックテストデータ_5D_5Y!$B$2:$I$1562,7,FALSE),\"データ無\"),\"\")","v":""}]
[65,8001,{"$f":"IF(B70=0,\"wait\",_xll.SNT.StockInst(B70,\"銘柄名称\"))","v":{"$error":"#NAME?"}},{"$f":"IF(B70=0,\"wait\",_xll.SNT.StockInst(B70,\"上場部\"))","v":{"$error":"#NAME?"}},{"$f":"IF(B70=0,\"wait\",_xll.SNT.StockInst(B70,\"現値\"))","v":{"$error":"#NAME?"}},{"$f":"IF(B70=0,\"wait\",_xll.SNT.StockInst(B70,\"前日終値\"))","v":{"$error":"#NAME?"}},"wait",{"$f":"IF(B70=0,\"wait\",MID(_xll.SNT.StockInst(B70,\"現値日時\"),12,5))","v":{"$error":"#NAME?"}},{"$f":"IF(B70=0,\"wait\",_xll.SNT.StockInst(B70,\"Tick回数\"))","v":{"$error":"#NAME?"}},{"$f":"IF(B70=0,\"wait\",_xll.SNT.StockInst(B70,\"VWAP\"))","v":{"$error":"#NAME?"}},null,{"$f":"IFERROR(INDEX(ヒストリカルデータ取得シート!$F$5:$DA$5, ROW(A65)),\"-\")","v":"-"},"",{"$f":"IFERROR(INDEX(ヒストリカルデータ取得シート!$F$6:$DA$6, ROW(A65)),\"-\")","v":"-"},null,{"$f":"IF(AND(ISNUMBER(M70), M70>1), IFERROR(VLOOKUP(B70, バックテストデータ_5D_5Y!$B$2:$I$1562, 5, FALSE), \"データ無\"), \"\")","v":""},{"$f":"IF(AND(ISNUMBER(M70), M70>1), IFERROR(VLOOKUP(B70, バックテストデータ_5D_5Y!$B$2:$I$1562, 4, FALSE), \"データ無\"), \"\")","v":""},{"$f":"IF(M70<0,IFERROR(VLOOKUP(B70,バックテストデータ_5D_5Y!$B$2:$I$1562,8,FALSE),\"データ無\"),\"\")","v":""},{"$f":"IF(M70<0,IFERROR(VLOOKUP(B70,バックテストデータ_5D_5Y!$B$2:$I$1562,7,FALSE),\"データ無\"),\"\")","v":""}]
[66,8002,{"$f":"IF(B71=0,\"wait\",_xll.SNT.StockInst(B71,\"銘柄名称\"))","v":{"$error":"#NAME?"}},{"$f":"IF(B71=0,\"wait\",_xll.SNT.StockInst(B71,\"上場部\"))","v":{"$error":"#NAME?"}},{"$f":"IF(B71=0,\"wait\",_xll.SNT.StockInst(B71,\"現値\"))","v":{"$error":"#NAME?"}},{"$f":"IF(B71=0,\"wait\",_xll.SNT.StockInst(B71,\"前日終値\"))","v":{"$error":"#NAME?"}},"wait",{"$f":"IF(B71=0,\"wait\",MID(_xll.SNT.StockInst(B71,\"現値日時\"),12,5))","v":{"$error":"#NAME?"}},{"$f":"IF(B71=0,\"wait\",_xll.SNT.StockInst(B71,\"Tick回数\"))","v":{"$error":"#NAME?"}},{"$f":"IF(B71=0,\"wait\",_xll.SNT.StockInst(B71,\"VWAP\"))","v":{"$error":"#NAME?"}},null,{"$f":"IFERROR(INDEX(ヒストリカルデータ取得シート!$F$5:$DA$5, ROW(A66)),\"-\")","v":"-"},{"$f":"IFERROR((E71-N71)/(L71-N71),\"\")","v":""},{"$f":"IFERROR(INDEX(ヒストリカルデータ取得シート!$F$6:$DA$6, ROW(A66)),\"-\")","v":"-"},null,{"$f":"IF(AND(ISNUMBER(M71), M71>1), IFERROR(VLOOKUP(B71, バックテストデータ_5D_5Y!$B$2:$I$1562, 5, FALSE), \"データ無\"), \"\")","v":""},{"$f":"IF(AND(ISNUMBER(M71), M71>1), IFERROR(VLOOKUP(B71, バックテストデータ_5D_5Y!$B$2:$I$1562, 4, FALSE), \"データ無\"), \"\")","v":""},{"$f":"IF(M71<0,IFERROR(VLOOKUP(B71,バックテストデータ_5D_5Y!$B$2:$I$1562,8,FALSE),\"データ無\"),\"\")","v":""},{"$f":"IF(M71<0,IFERROR(VLOOKUP(B71,バックテストデータ_5D_5Y!$B$2:$I$1562,7,FALSE),\"データ無\"),\"\")","v":""}]
[67,8031,{"$f":"IF(B72=0,\"wait\",_xll.SNT.StockInst(B72,\"銘柄名称\"))","v":{"$error":"#NAME?"}},{"$f":"IF(B72=0,\"wait\",_xll.SNT.StockInst(B72,\"上場部\"))","v":{"$error":"#NAME?"}},{"$f":"IF(B72=0,\"wait\",_xll.SNT.StockInst(B72,\"現値\"))","v":{"$error":"#NAME?"}},{"$f":"IF(B72=0,\"wait\",_xll.SNT.StockInst(B72,\"前日終値\"))","v":{"$error":"#NAME?"}},"wait",{"$f":"IF(B72=0,\"wait\",MID(_xll.SNT.StockInst(B72,\"現値日時\"),12,5))","v":{"$error":"#NAME?"}},{"$f":"IF(B72=0,\"wait\",_xll.SNT.StockInst(B72,\"Tick回数\"))","v":{"$error":"#NAME?"}},{"$f":"IF(B72=0,\"wait\",_xll.SNT.StockInst(B72,\"VWAP\"))","v":{"$error":"#NAME?"}},null,{"$f":"IFERROR(INDEX(ヒストリカルデータ取得シート!$F$5:$DA$5, ROW(A67)),\"-\")","v":"-"},"",{"$f":"IFERROR(INDEX(ヒストリカルデータ取得シート!$F$6:$DA$6, ROW(A67)),\"-\")","v":"-"},null,{"$f":"IF(AND(ISNUMBER(M72), M72>1), IFERROR(VLOOKUP(B72, バックテストデータ_5D_5Y!$B$2:$I$1562, 5, FALSE), \"データ無\"), \"\")","v":""},{"$f":"IF(AND(ISNUMBER(M72), M72>1), IFERROR(VLOOKUP(B72, バックテストデータ_5D_5Y!$B$2:$I$1562, 4, FALSE), \"データ無\"), \"\")","v":""},{"$f":"IF(M72<0,IFERROR(VLOOKUP(B72,バックテストデータ_5D_5Y!$B$2:$I$1562,8,FALSE),\"データ無\"),\"\")","v":""},{"$f":"IF(M72<0,IFERROR(VLOOKUP(B72,バックテストデータ_5D_5Y!$B$2:$I$1562,7,FALSE),\"データ無\"),\"\")","v":""}]
[68,8035,{"$f":"IF(B73=0,\"wait\",_xll.SNT.StockInst(B73,\"銘柄名称\"))","v":{"$error":"#NAME?"}},{"$f":"IF(B73=0,\"wait\",_xll.SNT.StockInst(B73,\"上場部\"))","v":{"$error":"#NAME?"}},{"$f":"IF(B73=0,\"wait\",_xll.SNT.StockInst(B73,\"現値\"))","v":{"$error":"#NAME?"}},{"$f":"IF(B73=0,\"wait\",_xll.SNT.StockInst(B73,\"前日終値\"))","v":{"$error":"#NAME?"}},"wait",{"$f":"IF(B73=0,\"wait\",MID(_xll.SNT.StockInst(B73,\"現値日時\"),12,5))","v":{"$error":"#NAME?"}},{"$f":"IF(B73=0,\"wait\",_xll.SNT.StockInst(B73,\"Tick回数\"))","v":{"$error":"#NAME?"}},{"$f":"IF(B73=0,\"wait\",_xll.SNT.StockInst(B73,\"VWAP\"))","v":{"$error":"#NAME?"}},null,{"$f":"IFERROR(INDEX(ヒストリカルデータ取得シート!$F$5:$DA$5, ROW(A68)),\"-\")","v":"-"},"",{"$f":"IFERROR(INDEX(ヒストリカルデータ取得シート!$F$6:$DA$6, ROW(A68)),\"-\")","v":"-"},null,{"$f":"IF(AND(ISNUMBER(M73), M73>1), IFERROR(VLOOKUP(B73, バックテストデータ_5D_5Y!$B$2:$I$1562, 5, FALSE), \"データ無\"), \"\")","v":""},{"$f":"IF(AND(ISNUMBER(M73), M73>1), IFERROR(VLOOKUP(B73, バックテストデータ_5D_5Y!$B$2:$I$1562, 4, FALSE), \"データ無\"), \"\")","v":""},{"$f":"IF(M73<0,IFERROR(VLOOKUP(B73,バックテストデータ_5D_5Y!$B$2:$I$1562,8,FALSE),\"データ無\"),\"\")","v":""},{"$f":"IF(M73<0,IFERROR(VLOOKUP(B73,バックテストデータ_5D_5Y!$B$2:$I$1562,7,FALSE),\"データ無\"),\"\")","v":""}]
[69,8053,{"$f":"IF(B74=0,\"wait\",_xll.SNT.StockInst(B74,\"銘柄名称\"))","v":{"$error":"#NAME?"}},{"$f":"IF(B74=0,\"wait\",_xll.SNT.StockInst(B74,\"上場部\"))","v":{"$error":"#NAME?"}},{"$f":"IF(B74=0,\"wait\",_xll.SNT.StockInst(B74,\"現値\"))","v":{"$error":"#NAME?"}},{"$f":"IF(B74=0,\"wait\",_xll.SNT.StockInst(B74,\"前日終値\"))","v":{"$error":"#NAME?"}},"wait",{"$f":"IF(B74=0,\"wait\",MID(_xll.SNT.StockInst(B74,\"現値日時\"),12,5))","v":{"$error":"#NAME?"}},{"$f":"IF(B74=0,\"wait\",_xll.SNT.StockInst(B74,\"Tick回数\"))","v":{"$error":"#NAME?"}},{"$f":"IF(B74=0,\"wait\",_xll.SNT.StockInst(B74,\"VWAP\"))","v":{"$error":"#NAME?"}},null,{"$f":"IFERROR(INDEX(ヒストリカルデータ取得シート!$F$5:$DA$5, ROW(A69)),\"-\")","v":"-"},"",{"$f":"IFERROR(INDEX(ヒストリカルデータ取得シート!$F$6:$DA$6, ROW(A69)),\"-\")","v":"-"},null,{"$f":"IF(AND(ISNUMBER(M74), M74>1), IFERROR(VLOOKUP(B74, バックテストデータ_5D_5Y!$B$2:$I$1562, 5, FALSE), \"データ無\"), \"\")","v":""},{"$f":"IF(AND(ISNUMBER(M74), M74>1), IFERROR(VLOOKUP(B74, バックテストデータ_5D_5Y!$B$2:$I$1562, 4, FALSE), \"データ無\"), \"\")","v":""},{"$f":"IF(M74<0,IFERROR(VLOOKUP(B74,バックテストデータ_5D_5Y!$B$2:$I$1562,8,FALSE),\"データ無\"),\"\")","v":""},{"$f":"IF(M74<0,IFERROR(VLOOKUP(B74,バックテストデータ_5D_5Y!$B$2:$I$1562,7,FALSE),\"データ無\"),\"\")","v":""}]
[70,8058,{"$f":"IF(B75=0,\"wait\",_xll.SNT.StockInst(B75,\"銘柄名称\"))","v":{"$error":"#NAME?"}},{"$f":"IF(B75=0,\"wait\",_xll.SNT.StockInst(B75,\"上場部\"))","v":{"$error":"#NAME?"}},{"$f":"IF(B75=0,\"wait\",_xll.SNT.StockInst(B75,\"現値\"))","v":{"$error":"#NAME?"}},{"$f":"IF(B75=0,\"wait\",_xll.SNT.StockInst(B75,\"前日終値\"))","v":{"$error":"#NAME?"}},"wait",{"$f":"IF(B75=0,\"wait\",MID(_xll.SNT.StockInst(B75,\"現値日時\"),12,5))","v":{"$error":"#NAME?"}},{"$f":"IF(B75=0,\"wait\",_xll.SNT.StockInst(B75,\"Tick回数\"))","v":{"$error":"#NAME?"}},{"$f":"IF(B75=0,\"wait\",_xll.SNT.StockInst(B75,\"VWAP\"))","v":{"$error":"#NAME?"}},null,{"$f":"IFERROR(INDEX(ヒストリカルデータ取得シート!$F$5:$DA$5, ROW(A70)),\"-\")","v":"-"},"",{"$f":"IFERROR(INDEX(ヒストリカルデータ取得シート!$F$6:$DA$6, ROW(A70)),\"-\")","v":"-"},null,{"$f":"IF(AND(ISNUMBER(M75), M75>1), IFERROR(VLOOKUP(B75, バックテストデータ_5D_5Y!$B$2:$I$1562, 5, FALSE), \"データ無\"), \"\")","v":""},{"$f":"IF(AND(ISNUMBER(M75), M75>1), IFERROR(VLOOKUP(B75, バックテストデータ_5D_5Y!$B$2:$I$1562, 4, FALSE), \"データ無\"), \"\")","v":""},{"$f":"IF(M75<0,IFERROR(VLOOKUP(B75,バックテストデータ_5D_5Y!$B$2:$I$1562,8,FALSE),\"データ無\"),\"\")","v":""},{"$f":"IF(M75<0,IFERROR(VLOOKUP(B75,バックテストデータ_5D_5Y!$B$2:$I$1562,7,FALSE),\"データ無\"),\"\")","v":""}]
[71,8113,{"$f":"IF(B76=0,\"wait\",_xll.SNT.StockInst(B76,\"銘柄名称\"))","v":{"$error":"#NAME?"}},{"$f":"IF(B76=0,\"wait\",_xll.SNT.StockInst(B76,\"上場部\"))","v":{"$error":"#NAME?"}},{"$f":"IF(B76=0,\"wait\",_xll.SNT.StockInst(B76,\"現値\"))","v":{"$error":"#NAME?"}},{"$f":"IF(B76=0,\"wait\",_xll.SNT.StockInst(B76,\"前日終値\"))","v":{"$error":"#NAME?"}},"wait",{"$f":"IF(B76=0,\"wait\",MID(_xll.SNT.StockInst(B76,\"現値日時\"),12,5))","v":{"$error":"#NAME?"}},{"$f":"IF(B76=0,\"wait\",_xll.SNT.StockInst(B76,\"Tick回数\"))","v":{"$error":"#NAME?"}},{"$f":"IF(B76=0,\"wait\",_xll.SNT.StockInst(B76,\"VWAP\"))","v":{"$error":"#NAME?"}},null,{"$f":"IFERROR(INDEX(ヒストリカルデータ取得シート!$F$5:$DA$5, ROW(A71)),\"-\")","v":"-"},"",{"$f":"IFERROR(INDEX(ヒストリカルデータ取得シート!$F$6:$DA$6, ROW(A71)),\"-\")","v":"-"},null,{"$f":"IF(AND(ISNUMBER(M76), M76>1), IFERROR(VLOOKUP(B76, バックテストデータ_5D_5Y!$B$2:$I$1562, 5, FALSE), \"データ無\"), \"\")","v":""},{"$f":"IF(AND(ISNUMBER(M76), M76>1), IFERROR(VLOOKUP(B76, バックテストデータ_5D_5Y!$B$2:$I$1562, 4, FALSE), \"データ無\"), \"\")","v":""},{"$f":"IF(M76<0,IFERROR(VLOOKUP(B76,バックテストデータ_5D_5Y!$B$2:$I$1562,8,FALSE),\"データ無\"),\"\")","v":""},{"$f":"IF(M76<0,IFERROR(VLOOKUP(B76,バックテストデータ_5D_5Y!$B$2:$I$1562,7,FALSE),\"データ無\"),\"\")","v":""}]
[72,8267,{"$f":"IF(B77=0,\"wait\",_xll.SNT.StockInst(B77,\"銘柄名称\"))","v":{"$error":"#NAME?"}},{"$f":"IF(B77=0,\"wait\",_xll.SNT.StockInst(B77,\"上場部\"))","v":{"$error":"#NAME?"}},{"$f":"IF(B77=0,\"wait\",_xll.SNT.StockInst(B77,\"現値\"))","v":{"$error":"#NAME?"}},{"$f":"IF(B77=0,\"wait\",_xll.SNT.StockInst(B77,\"前日終値\"))","v":{"$error":"#NAME?"}},"wait",{"$f":"IF(B77=0,\"wait\",MID(_xll.SNT.StockInst(B77,\"現値日時\"),12,5))","v":{"$error":"#NAME?"}},{"$f":"IF(B77=0,\"wait\",_xll.SNT.StockInst(B77,\"Tick回数\"))","v":{"$error":"#NAME?"}},{"$f":"IF(B77=0,\"wait\",_xll.SNT.StockInst(B77,\"VWAP\"))","v":{"$error":"#NAME?"}},null,{"$f":"IFERROR(INDEX(ヒストリカルデータ取得シート!$F$5:$DA$5, ROW(A72)),\"-\")","v":"-"},"",{"$f":"IFERROR(INDEX(ヒストリカルデータ取得シート!$F$6:$DA$6, ROW(A72)),\"-\")","v":"-"},null,{"$f":"IF(AND(ISNUMBER(M77), M77>1), IFERROR(VLOOKUP(B77, バックテストデータ_5D_5Y!$B$2:$I$1562, 5, FALSE), \"データ無\"), \"\")","v":""},{"$f":"IF(AND(ISNUMBER(M77), M77>1), IFERROR(VLOOKUP(B77, バックテストデータ_5D_5Y!$B$2:$I$1562, 4, FALSE), \"データ無\"), \"\")","v":""},{"$f":"IF(M77<0,IFERROR(VLOOKUP(B77,バックテストデータ_5D_5Y!$B$2:$I$1562,8,FALSE),\"データ無\"),\"\")","v":""},{"$f":"IF(M77<0,IFERROR(VLOOKUP(B77,バックテストデータ_5D_5Y!$B$2:$I$1562,7,FALSE),\"データ無\"),\"\")","v":""}]
[73,8306,{"$f":"IF(B78=0,\"wait\",_xll.SNT.StockInst(B78,\"銘柄名称\"))","v":{"$error":"#NAME?"}},{"$f":"IF(B78=0,\"wait\",_xll.SNT.StockInst(B78,\"上場部\"))","v":{"$error":"#NAME?"}},{"$f":"IF(B78=0,\"wait\",_xll.SNT.StockInst(B78,\"現値\"))","v":{"$error":"#NAME?"}},{"$f":"IF(B78=0,\"wait\",_xll.SNT.StockInst(B78,\"前日終値\"))","v":{"$error":"#NAME?"}},"wait",{"$f":"IF(B78=0,\"wait\",MID(_xll.SNT.StockInst(B78,\"現値日時\"),12,5))","v":{"$error":"#NAME?"}},{"$f":"IF(B78=0,\"wait\",_xll.SNT.StockInst(B78,\"Tick回数\"))","v":{"$error":"#NAME?"}},{"$f":"IF(B78=0,\"wait\",_xll.SNT.StockInst(B78,\"VWAP\"))","v":{"$error":"#NAME?"}},null,{"$f":"IFERROR(INDEX(ヒストリカルデータ取得シート!$F$5:$DA$5, ROW(A73)),\"-\")","v":"-"},"",{"$f":"IFERROR(INDEX(ヒストリカルデータ取得シート!$F$6:$DA$6, ROW(A73)),\"-\")","v":"-"},null,{"$f":"IF(AND(ISNUMBER(M78), M78>1), IFERROR(VLOOKUP(B78, バックテストデータ_5D_5Y!$B$2:$I$1562, 5, FALSE), \"データ無\"), \"\")","v":""},{"$f":"IF(AND(ISNUMBER(M78), M78>1), IFERROR(VLOOKUP(B78, バックテストデータ_5D_5Y!$B$2:$I$1562, 4, FALSE), \"データ無\"), \"\")","v":""},{"$f":"IF(M78<0,IFERROR(VLOOKUP(B78,バックテストデータ_5D_5Y!$B$2:$I$1562,8,FALSE),\"データ無\"),\"\")","v":""},{"$f":"IF(M78<0,IFERROR(VLOOKUP(B78,バックテストデータ_5D_5Y!$B$2:$I$1562,7,FALSE),\"データ無\"),\"\")","v":""}]
[74,8308,{"$f":"IF(B79=0,\"wait\",_xll.SNT.StockInst(B79,\"銘柄名称\"))","v":{"$error":"#NAME?"}},{"$f":"IF(B79=0,\"wait\",_xll.SNT.StockInst(B79,\"上場部\"))","v":{"$error":"#NAME?"}},{"$f":"IF(B79=0,\"wait\",_xll.SNT.StockInst(B79,\"現値\"))","v":{"$error":"#NAME?"}},{"$f":"IF(B79=0,\"wait\",_xll.SNT.StockInst(B79,\"前日終値\"))","v":{"$error":"#NAME?"}},"wait",{"$f":"IF(B79=0,\"wait\",MID(_xll.SNT.StockInst(B79,\"現値日時\"),12,5))","v":{"$error":"#NAME?"}},{"$f":"IF(B79=0,\"wait\",_xll.SNT.StockInst(B79,\"Tick回数\"))","v":{"$error":"#NAME?"}},{"$f":"IF(B79=0,\"wait\",_xll.SNT.StockInst(B79,\"VWAP\"))","v":{"$error":"#NAME?"}},null,{"$f":"IFERROR(INDEX(ヒストリカルデータ取得シート!$F$5:$DA$5, ROW(A74)),\"-\")","v":"-"},"",{"$f":"IFERROR(INDEX(ヒストリカルデータ取得シート!$F$6:$DA$6, ROW(A74)),\"-\")","v":"-"},null,{"$f":"IF(AND(ISNUMBER(M79), M79>1), IFERROR(VLOOKUP(B79, バックテストデータ_5D_5Y!$B$2:$I$1562, 5, FALSE), \"データ無\"), \"\")","v":""},{"$f":"IF(AND(ISNUMBER(M79), M79>1), IFERROR(VLOOKUP(B79, バックテストデータ_5D_5Y!$B$2:$I$1562, 4, FALSE), \"データ無\"), \"\")","v":""},{"$f":"IF(M79<0,IFERROR(VLOOKUP(B79,バックテストデータ_5D_5Y!$B$2:$I$1562,8,FALSE),\"データ無\"),\"\")","v":""},{"$f":"IF(M79<0,IFERROR(VLOOKUP(B79,バックテストデータ_5D_5Y!$B$2:$I$1562,7,FALSE),\"データ無\"),\"\")","v":""}]
[75,8309,{"$f":"IF(B80=0,\"wait\",_xll.SNT.StockInst(B80,\"銘柄名称\"))","v":{"$error":"#NAME?"}},{"$f":"IF(B80=0,\"wait\",_xll.SNT.StockInst(B80,\"上場部\"))","v":{"$error":"#NAME?"}},{"$f":"IF(B80=0,\"wait\",_xll.SNT.StockInst(B80,\"現値\"))","v":{"$error":"#NAME?"}},{"$f":"IF(B80=0,\"wait\",_xll.SNT.StockInst(B80,\"前日終値\"))","v":{"$error":"#NAME?"}},"wait",{"$f":"IF(B80=0,\"wait\",MID(_xll.SNT.StockInst(B80,\"現値日時\"),12,5))","v":{"$error":"#NAME?"}},{"$f":"IF(B80=0,\"wait\",_xll.SNT.StockInst(B80,\"Tick回数\"))","v":{"$error":"#NAME?"}},{"$f":"IF(B80=0,\"wait\",_xll.SNT.StockInst(B80,\"VWAP\"))","v":{"$error":"#NAME?"}},null,{"$f":"IFERROR(INDEX(ヒストリカルデータ取得シート!$F$5:$DA$5, ROW(A75)),\"-\")","v":"-"},"",{"$f":"IFERROR(INDEX(ヒストリカルデータ取得シート!$F$6:$DA$6, ROW(A75)),\"-\")","v":"-"},null,{"$f":"IF(AND(ISNUMBER(M80), M80>1), IFERROR(VLOOKUP(B80, バックテストデータ_5D_5Y!$B$2:$I$1562, 5, FALSE), \"データ無\"), \"\")","v":""},{"$f":"IF(AND(ISNUMBER(M80), M80>1), IFERROR(VLOOKUP(B80, バックテストデータ_5D_5Y!$B$2:$I$1562, 4, FALSE), \"データ無\"), \"\")","v":""},{"$f":"IF(M80<0,IFERROR(VLOOKUP(B80,バックテストデータ_5D_5Y!$B$2:$I$1562,8,FALSE),\"データ無\"),\"\")","v":""},{"$f":"IF(M80<0,IFERROR(VLOOKUP(B80,バックテストデータ_5D_5Y!$B$2:$I$1562,7,FALSE),\"データ無\"),\"\")","v":""}]
[76,8316,{"$f":"IF(B81=0,\"wait\",_xll.SNT.StockInst(B81,\"銘柄名称\"))","v":{"$error":"#NAME?"}},{"$f":"IF(B81=0,\"wait\",_xll.SNT.StockInst(B81,\"上場部\"))","v":{"$error":"#NAME?"}},{"$f":"IF(B81=0,\"wait\",_xll.SNT.StockInst(B81,\"現値\"))","v":{"$error":"#NAME?"}},{"$f":"IF(B81=0,\"wait\",_xll.SNT.StockInst(B81,\"前日終値\"))","v":{"$error":"#NAME?"}},"wait",{"$f":"IF(B81=0,\"wait\",MID(_xll.SNT.StockInst(B81,\"現値日時\"),12,5))","v":{"$error":"#NAME?"}},{"$f":"IF(B81=0,\"wait\",_xll.SNT.StockInst(B81,\"Tick回数\"))","v":{"$error":"#NAME?"}},{"$f":"IF(B81=0,\"wait\",_xll.SNT.StockInst(B81,\"VWAP\"))","v":{"$error":"#NAME?"}},null,{"$f":"IFERROR(INDEX(ヒストリカルデータ取得シート!$F$5:$DA$5, ROW(A76)),\"-\")","v":"-"},"",{"$f":"IFERROR(INDEX(ヒストリカルデータ取得シート!$F$6:$DA$6, ROW(A76)),\"-\")","v":"-"},null,{"$f":"IF(AND(ISNUMBER(M81), M81>1), IFERROR(VLOOKUP(B81, バックテストデータ_5D_5Y!$B$2:$I$1562, 5, FALSE), \"データ無\"), \"\")","v":""},{"$f":"IF(AND(ISNUMBER(M81), M81>1), IFERROR(VLOOKUP(B81, バックテストデータ_5D_5Y!$B$2:$I$1562, 4, FALSE), \"データ無\"), \"\")","v":""},{"$f":"IF(M81<0,IFERROR(VLOOKUP(B81,バックテストデータ_5D_5Y!$B$2:$I$1562,8,FALSE),\"データ無\"),\"\")","v":""},{"$f":"IF(M81<0,IFERROR(VLOOKUP(B81,バックテストデータ_5D_5Y!$B$2:$I$1562,7,FALSE),\"データ無\"),\"\")","v":""}]
[77,8411,{"$f":"IF(B82=0,\"wait\",_xll.SNT.StockInst(B82,\"銘柄名称\"))","v":{"$error":"#NAME?"}},{"$f":"IF(B82=0,\"wait\",_xll.SNT.StockInst(B82,\"上場部\"))","v":{"$error":"#NAME?"}},{"$f":"IF(B82=0,\"wait\",_xll.SNT.StockInst(B82,\"現値\"))","v":{"$error":"#NAME?"}},{"$f":"IF(B82=0,\"wait\",_xll.SNT.StockInst(B82,\"前日終値\"))","v":{"$error":"#NAME?"}},"wait",{"$f":"IF(B82=0,\"wait\",MID(_xll.SNT.StockInst(B82,\"現値日時\"),12,5))","v":{"$error":"#NAME?"}},{"$f":"IF(B82=0,\"wait\",_xll.SNT.StockInst(B82,\"Tick回数\"))","v":{"$error":"#NAME?"}},{"$f":"IF(B82=0,\"wait\",_xll.SNT.StockInst(B82,\"VWAP\"))","v":{"$error":"#NAME?"}},null,{"$f":"IFERROR(INDEX(ヒストリカルデータ取得シート!$F$5:$DA$5, ROW(A77)),\"-\")","v":"-"},"",{"$f":"IFERROR(INDEX(ヒストリカルデータ取得シート!$F$6:$DA$6, ROW(A77)),\"-\")","v":"-"},null,{"$f":"IF(AND(ISNUMBER(M82), M82>1), IFERROR(VLOOKUP(B82, バックテストデータ_5D_5Y!$B$2:$I$1562, 5, FALSE), \"データ無\"), \"\")","v":""},{"$f":"IF(AND(ISNUMBER(M82), M82>1), IFERROR(VLOOKUP(B82, バックテストデータ_5D_5Y!$B$2:$I$1562, 4, FALSE), \"データ無\"), \"\")","v":""},{"$f":"IF(M82<0,IFERROR(VLOOKUP(B82,バックテストデータ_5D_5Y!$B$2:$I$1562,8,FALSE),\"データ無\"),\"\")","v":""},{"$f":"IF(M82<0,IFERROR(VLOOKUP(B82,バックテストデータ_5D_5Y!$B$2:$I$1562,7,FALSE),\"データ無\"),\"\")","v":""}]
[78,8591,{"$f":"IF(B83=0,\"wait\",_xll.SNT.StockInst(B83,\"銘柄名称\"))","v":{"$error":"#NAME?"}},{"$f":"IF(B83=0,\"wait\",_xll.SNT.StockInst(B83,\"上場部\"))","v":{"$error":"#NAME?"}},{"$f":"IF(B83=0,\"wait\",_xll.SNT.StockInst(B83,\"現値\"))","v":{"$error":"#NAME?"}},{"$f":"IF(B83=0,\"wait\",_xll.SNT.StockInst(B83,\"前日終値\"))","v":{"$error":"#NAME?"}},"wait",{"$f":"IF(B83=0,\"wait\",MID(_xll.SNT.StockInst(B83,\"現値日時\"),12,5))","v":{"$error":"#NAME?"}},{"$f":"IF(B83=0,\"wait\",_xll.SNT.StockInst(B83,\"Tick回数\"))","v":{"$error":"#NAME?"}},{"$f":"IF(B83=0,\"wait\",_xll.SNT.StockInst(B83,\"VWAP\"))","v":{"$error":"#NAME?"}},null,{"$f":"IFERROR(INDEX(ヒストリカルデータ取得シート!$F$5:$DA$5, ROW(A78)),\"-\")","v":"-"},"",{"$f":"IFERROR(INDEX(ヒストリカルデータ取得シート!$F$6:$DA$6, ROW(A78)),\"-\")","v":"-"},null,{"$f":"IF(AND(ISNUMBER(M83), M83>1), IFERROR(VLOOKUP(B83, バックテストデータ_5D_5Y!$B$2:$I$1562, 5, FALSE), \"データ無\"), \"\")","v":""},{"$f":"IF(AND(ISNUMBER(M83), M83>1), IFERROR(VLOOKUP(B83, バックテストデータ_5D_5Y!$B$2:$I$1562, 4, FALSE), \"データ無\"), \"\")","v":""},{"$f":"IF(M83<0,IFERROR(VLOOKUP(B83,バックテストデータ_5D_5Y!$B$2:$I$1562,8,FALSE),\"データ無\"),\"\")","v":""},{"$f":"IF(M83<0,IFERROR(VLOOKUP(B83,バックテストデータ_5D_5Y!$B$2:$I$1562,7,FALSE),\"データ無\"),\"\")","v":""}]
[79,8604,{"$f":"IF(B84=0,\"wait\",_xll.SNT.StockInst(B84,\"銘柄名称\"))","v":{"$error":"#NAME?"}},{"$f":"IF(B84=0,\"wait\",_xll.SNT.StockInst(B84,\"上場部\"))","v":{"$error":"#NAME?"}},{"$f":"IF(B84=0,\"wait\",_xll.SNT.StockInst(B84,\"現値\"))","v":{"$error":"#NAME?"}},{"$f":"IF(B84=0,\"wait\",_xll.SNT.StockInst(B84,\"前日終値\"))","v":{"$error":"#NAME?"}},"wait",{"$f":"IF(B84=0,\"wait\",MID(_xll.SNT.StockInst(B84,\"現値日時\"),12,5))","v":{"$error":"#NAME?"}},{"$f":"IF(B84=0,\"wait\",_xll.SNT.StockInst(B84,\"Tick回数\"))","v":{"$error":"#NAME?"}},{"$f":"IF(B84=0,\"wait\",_xll.SNT.StockInst(B84,\"VWAP\"))","v":{"$error":"#NAME?"}},null,{"$f":"IFERROR(INDEX(ヒストリカルデータ取得シート!$F$5:$DA$5, ROW(A79)),\"-\")","v":"-"},"",{"$f":"IFERROR(INDEX(ヒストリカルデータ取得シート!$F$6:$DA$6, ROW(A79)),\"-\")","v":"-"},null,{"$f":"IF(AND(ISNUMBER(M84), M84>1), IFERROR(VLOOKUP(B84, バックテストデータ_5D_5Y!$B$2:$I$1562, 5, FALSE), \"データ無\"), \"\")","v":""},{"$f":"IF(AND(ISNUMBER(M84), M84>1), IFERROR(VLOOKUP(B84, バックテストデータ_5D_5Y!$B$2:$I$1562, 4, FALSE), \"データ無\"), \"\")","v":""},{"$f":"IF(M84<0,IFERROR(VLOOKUP(B84,バックテストデータ_5D_5Y!$B$2:$I$1562,8,FALSE),\"データ無\"),\"\")","v":""},{"$f":"IF(M84<0,IFERROR(VLOOKUP(B84,バックテストデータ_5D_5Y!$B$2:$I$1562,7,FALSE),\"データ無\"),\"\")","v":""}]
[80,8630,{"$f":"IF(B85=0,\"wait\",_xll.SNT.StockInst(B85,\"銘柄名称\"))","v":{"$error":"#NAME?"}},{"$f":"IF(B85=0,\"wait\",_xll.SNT.StockInst(B85,\"上場部\"))","v":{"$error":"#NAME?"}},{"$f":"IF(B85=0,\"wait\",_xll.SNT.StockInst(B85,\"現値\"))","v":{"$error":"#NAME?"}},{"$f":"IF(B85=0,\"wait\",_xll.SNT.StockInst(B85,\"前日終値\"))","v":{"$error":"#NAME?"}},"wait",{"$f":"IF(B85=0,\"wait\",MID(_xll.SNT.StockInst(B85,\"現値日時\"),12,5))","v":{"$error":"#NAME?"}},{"$f":"IF(B85=0,\"wait\",_xll.SNT.StockInst(B85,\"Tick回数\"))","v":{"$error":"#NAME?"}},{"$f":"IF(B85=0,\"wait\",_xll.SNT.StockInst(B85,\"VWAP\"))","v":{"$error":"#NAME?"}},null,{"$f":"IFERROR(INDEX(ヒストリカルデータ取得シート!$F$5:$DA$5, ROW(A80)),\"-\")","v":"-"},"",{"$f":"IFERROR(INDEX(ヒストリカルデータ取得シート!$F$6:$DA$6, ROW(A80)),\"-\")","v":"-"},null,{"$f":"IF(AND(ISNUMBER(M85), M85>1), IFERROR(VLOOKUP(B85, バックテストデータ_5D_5Y!$B$2:$I$1562, 5, FALSE), \"データ無\"), \"\")","v":""},{"$f":"IF(AND(ISNUMBER(M85), M85>1), IFERROR(VLOOKUP(B85, バックテストデータ_5D_5Y!$B$2:$I$1562, 4, FALSE), \"データ無\"), \"\")","v":""},{"$f":"IF(M85<0,IFERROR(VLOOKUP(B85,バックテストデータ_5D_5Y!$B$2:$I$1562,8,FALSE),\"データ無\"),\"\")","v":""},{"$f":"IF(M85<0,IFERROR(VLOOKUP(B85,バックテストデータ_5D_5Y!$B$2:$I$1562,7,FALSE),\"データ無\"),\"\")","v":""}]
[81,8697,{"$f":"IF(B86=0,\"wait\",_xll.SNT.StockInst(B86,\"銘柄名称\"))","v":{"$error":"#NAME?"}},{"$f":"IF(B86=0,\"wait\",_xll.SNT.StockInst(B86,\"上場部\"))","v":{"$error":"#NAME?"}},{"$f":"IF(B86=0,\"wait\",_xll.SNT.StockInst(B86,\"現値\"))","v":{"$error":"#NAME?"}},{"$f":"IF(B86=0,\"wait\",_xll.SNT.StockInst(B86,\"前日終値\"))","v":{"$error":"#NAME?"}},"wait",{"$f":"IF(B86=0,\"wait\",MID(_xll.SNT.StockInst(B86,\"現値日時\"),12,5))","v":{"$error":"#NAME?"}},{"$f":"IF(B86=0,\"wait\",_xll.SNT.StockInst(B86,\"Tick回数\"))","v":{"$error":"#NAME?"}},{"$f":"IF(B86=0,\"wait\",_xll.SNT.StockInst(B86,\"VWAP\"))","v":{"$error":"#NAME?"}},null,{"$f":"IFERROR(INDEX(ヒストリカルデータ取得シート!$F$5:$DA$5, ROW(A81)),\"-\")","v":"-"},"",{"$f":"IFERROR(INDEX(ヒストリカルデータ取得シート!$F$6:$DA$6, ROW(A81)),\"-\")","v":"-"},null,{"$f":"IF(AND(ISNUMBER(M86), M86>1), IFERROR(VLOOKUP(B86, バックテストデータ_5D_5Y!$B$2:$I$1562, 5, FALSE), \"データ無\"), \"\")","v":""},{"$f":"IF(AND(ISNUMBER(M86), M86>1), IFERROR(VLOOKUP(B86, バックテストデータ_5D_5Y!$B$2:$I$1562, 4, FALSE), \"データ無\"), \"\")","v":""},{"$f":"IF(M86<0,IFERROR(VLOOKUP(B86,バックテストデータ_5D_5Y!$B$2:$I$1562,8,FALSE),\"データ無\"),\"\")","v":""},{"$f":"IF(M86<0,IFERROR(VLOOKUP(B86,バックテストデータ_5D_5Y!$B$2:$I$1562,7,FALSE),\"データ無\"),\"\")","v":""}]
[82,8725,{"$f":"IF(B87=0,\"wait\",_xll.SNT.StockInst(B87,\"銘柄名称\"))","v":{"$error":"#NAME?"}},{"$f":"IF(B87=0,\"wait\",_xll.SNT.StockInst(B87,\"上場部\"))","v":{"$error":"#NAME?"}},{"$f":"IF(B87=0,\"wait\",_xll.SNT.StockInst(B87,\"現値\"))","v":{"$error":"#NAME?"}},{"$f":"IF(B87=0,\"wait\",_xll.SNT.StockInst(B87,\"前日終値\"))","v":{"$error":"#NAME?"}},"wait",{"$f":"IF(B87=0,\"wait\",MID(_xll.SNT.StockInst(B87,\"現値日時\"),12,5))","v":{"$error":"#NAME?"}},{"$f":"IF(B87=0,\"wait\",_xll.SNT.StockInst(B87,\"Tick回数\"))","v":{"$error":"#NAME?"}},{"$f":"IF(B87=0,\"wait\",_xll.SNT.StockInst(B87,\"VWAP\"))","v":{"$error":"#NAME?"}},null,{"$f":"IFERROR(INDEX(ヒストリカルデータ取得シート!$F$5:$DA$5, ROW(A82)),\"-\")","v":"-"},"",{"$f":"IFERROR(INDEX(ヒストリカルデータ取得シート!$F$6:$DA$6, ROW(A82)),\"-\")","v":"-"},null,{"$f":"IF(AND(ISNUMBER(M87), M87>1), IFERROR(VLOOKUP(B87, バックテストデータ_5D_5Y!$B$2:$I$1562, 5, FALSE), \"データ無\"), \"\")","v":""},{"$f":"IF(AND(ISNUMBER(M87), M87>1), IFERROR(VLOOKUP(B87, バックテストデータ_5D_5Y!$B$2:$I$1562, 4, FALSE), \"データ無\"), \"\")","v":""},{"$f":"IF(M87<0,IFERROR(VLOOKUP(B87,バックテストデータ_5D_5Y!$B$2:$I$1562,8,FALSE),\"データ無\"),\"\")","v":""},{"$f":"IF(M87<0,IFERROR(VLOOKUP(B87,バックテストデータ_5D_5Y!$B$2:$I$1562,7,FALSE),\"データ無\"),\"\")","v":""}]
[83,8750,{"$f":"IF(B88=0,\"wait\",_xll.SNT.StockInst(B88,\"銘柄名称\"))","v":{"$error":"#NAME?"}},{"$f":"IF(B88=0,\"wait\",_xll.SNT.StockInst(B88,\"上場部\"))","v":{"$error":"#NAME?"}},{"$f":"IF(B88=0,\"wait\",_xll.SNT.StockInst(B88,\"現値\"))","v":{"$error":"#NAME?"}},{"$f":"IF(B88=0,\"wait\",_xll.SNT.StockInst(B88,\"前日終値\"))","v":{"$error":"#NAME?"}},"wait",{"$f":"IF(B88=0,\"wait\",MID(_xll.SNT.StockInst(B88,\"現値日時\"),12,5))","v":{"$error":"#NAME?"}},{"$f":"IF(B88=0,\"wait\",_xll.SNT.StockInst(B88,\"Tick回数\"))","v":{"$error":"#NAME?"}},{"$f":"IF(B88=0,\"wait\",_xll.SNT.StockInst(B88,\"VWAP\"))","v":{"$error":"#NAME?"}},null,{"$f":"IFERROR(INDEX(ヒストリカルデータ取得シート!$F$5:$DA$5, ROW(A83)),\"-\")","v":"-"},"",{"$f":"IFERROR(INDEX(ヒストリカルデータ取得シート!$F$6:$DA$6, ROW(A83)),\"-\")","v":"-"},null,{"$f":"IF(AND(ISNUMBER(M88), M88>1), IFERROR(VLOOKUP(B88, バックテストデータ_5D_5Y!$B$2:$I$1562, 5, FALSE), \"データ無\"), \"\")","v":""},{"$f":"IF(AND(ISNUMBER(M88), M88>1), IFERROR(VLOOKUP(B88, バックテストデータ_5D_5Y!$B$2:$I$1562, 4, FALSE), \"データ無\"), \"\")","v":""},{"$f":"IF(M88<0,IFERROR(VLOOKUP(B88,バックテストデータ_5D_5Y!$B$2:$I$1562,8,FALSE),\"データ無\"),\"\")","v":""},{"$f":"IF(M88<0,IFERROR(VLOOKUP(B88,バックテストデータ_5D_5Y!$B$2:$I$1562,7,FALSE),\"データ無\"),\"\")","v":""}]
[84,8766,{"$f":"IF(B89=0,\"wait\",_xll.SNT.StockInst(B89,\"銘柄名称\"))","v":{"$error":"#NAME?"}},{"$f":"IF(B89=0,\"wait\",_xll.SNT.StockInst(B89,\"上場部\"))","v":{"$error":"#NAME?"}},{"$f":"IF(B89=0,\"wait\",_xll.SNT.StockInst(B89,\"現値\"))","v":{"$error":"#NAME?"}},{"$f":"IF(B89=0,\"wait\",_xll.SNT.StockInst(B89,\"前日終値\"))","v":{"$error":"#NAME?"}},"wait",{"$f":"IF(B89=0,\"wait\",MID(_xll.SNT.StockInst(B89,\"現値日時\"),12,5))","v":{"$error":"#NAME?"}},{"$f":"IF(B89=0,\"wait\",_xll.SNT.StockInst(B89,\"Tick回数\"))","v":{"$error":"#NAME?"}},{"$f":"IF(B89=0,\"wait\",_xll.SNT.StockInst(B89,\"VWAP\"))","v":{"$error":"#NAME?"}},null,{"$f":"IFERROR(INDEX(ヒストリカルデータ取得シート!$F$5:$DA$5, ROW(A84)),\"-\")","v":"-"},"",{"$f":"IFERROR(INDEX(ヒストリカルデータ取得シート!$F$6:$DA$6, ROW(A84)),\"-\")","v":"-"},null,{"$f":"IF(AND(ISNUMBER(M89), M89>1), IFERROR(VLOOKUP(B89, バックテストデータ_5D_5Y!$B$2:$I$1562, 5, FALSE), \"データ無\"), \"\")","v":""},{"$f":"IF(AND(ISNUMBER(M89), M89>1), IFERROR(VLOOKUP(B89, バックテストデータ_5D_5Y!$B$2:$I$1562, 4, FALSE), \"データ無\"), \"\")","v":""},{"$f":"IF(M89<0,IFERROR(VLOOKUP(B89,バックテストデータ_5D_5Y!$B$2:$I$1562,8,FALSE),\"データ無\"),\"\")","v":""},{"$f":"IF(M89<0,IFERROR(VLOOKUP(B89,バックテストデータ_5D_5Y!$B$2:$I$1562,7,FALSE),\"データ無\"),\"\")","v":""}]
[85,8801,{"$f":"IF(B90=0,\"wait\",_xll.SNT.StockInst(B90,\"銘柄名称\"))","v":{"$error":"#NAME?"}},{"$f":"IF(B90=0,\"wait\",_xll.SNT.StockInst(B90,\"上場部\"))","v":{"$error":"#NAME?"}},{"$f":"IF(B90=0,\"wait\",_xll.SNT.StockInst(B90,\"現値\"))","v":{"$error":"#NAME?"}},{"$f":"IF(B90=0,\"wait\",_xll.SNT.StockInst(B90,\"前日終値\"))","v":{"$error":"#NAME?"}},"wait",{"$f":"IF(B90=0,\"wait\",MID(_xll.SNT.StockInst(B90,\"現値日時\"),12,5))","v":{"$error":"#NAME?"}},{"$f":"IF(B90=0,\"wait\",_xll.SNT.StockInst(B90,\"Tick回数\"))","v":{"$error":"#NAME?"}},{"$f":"IF(B90=0,\"wait\",_xll.SNT.StockInst(B90,\"VWAP\"))","v":{"$error":"#NAME?"}},null,{"$f":"IFERROR(INDEX(ヒストリカルデータ取得シート!$F$5:$DA$5, ROW(A85)),\"-\")","v":"-"},"",{"$f":"IFERROR(INDEX(ヒストリカルデータ取得シート!$F$6:$DA$6, ROW(A85)),\"-\")","v":"-"},null,{"$f":"IF(AND(ISNUMBER(M90), M90>1), IFERROR(VLOOKUP(B90, バックテストデータ_5D_5Y!$B$2:$I$1562, 5, FALSE), \"データ無\"), \"\")","v":""},{"$f":"IF(AND(ISNUMBER(M90), M90>1), IFERROR(VLOOKUP(B90, バックテストデータ_5D_5Y!$B$2:$I$1562, 4, FALSE), \"データ無\"), \"\")","v":""},{"$f":"IF(M90<0,IFERROR(VLOOKUP(B90,バックテストデータ_5D_5Y!$B$2:$I$1562,8,FALSE),\"データ無\"),\"\")","v":""},{"$f":"IF(M90<0,IFERROR(VLOOKUP(B90,バックテストデータ_5D_5Y!$B$2:$I$1562,7,FALSE),\"データ無\"),\"\")","v":""}]
[86,8802,{"$f":"IF(B91=0,\"wait\",_xll.SNT.StockInst(B91,\"銘柄名称\"))","v":{"$error":"#NAME?"}},{"$f":"IF(B91=0,\"wait\",_xll.SNT.StockInst(B91,\"上場部\"))","v":{"$error":"#NAME?"}},{"$f":"IF(B91=0,\"wait\",_xll.SNT.StockInst(B91,\"現値\"))","v":{"$error":"#NAME?"}},{"$f":"IF(B91=0,\"wait\",_xll.SNT.StockInst(B91,\"前日終値\"))","v":{"$error":"#NAME?"}},"wait",{"$f":"IF(B91=0,\"wait\",MID(_xll.SNT.StockInst(B91,\"現値日時\"),12,5))","v":{"$error":"#NAME?"}},{"$f":"IF(B91=0,\"wait\",_xll.SNT.StockInst(B91,\"Tick回数\"))","v":{"$error":"#NAME?"}},{"$f":"IF(B91=0,\"wait\",_xll.SNT.StockInst(B91,\"VWAP\"))","v":{"$error":"#NAME?"}},null,{"$f":"IFERROR(INDEX(ヒストリカルデータ取得シート!$F$5:$DA$5, ROW(A86)),\"-\")","v":"-"},"",{"$f":"IFERROR(INDEX(ヒストリカルデータ取得シート!$F$6:$DA$6, ROW(A86)),\"-\")","v":"-"},null,{"$f":"IF(AND(ISNUMBER(M91), M91>1), IFERROR(VLOOKUP(B91, バックテストデータ_5D_5Y!$B$2:$I$1562, 5, FALSE), \"データ無\"), \"\")","v":""},{"$f":"IF(AND(ISNUMBER(M91), M91>1), IFERROR(VLOOKUP(B91, バックテストデータ_5D_5Y!$B$2:$I$1562, 4, FALSE), \"データ無\"), \"\")","v":""},{"$f":"IF(M91<0,IFERROR(VLOOKUP(B91,バックテストデータ_5D_5Y!$B$2:$I$1562,8,FALSE),\"データ無\"),\"\")","v":""},{"$f":"IF(M91<0,IFERROR(VLOOKUP(B91,バックテストデータ_5D_5Y!$B$2:$I$1562,7,FALSE),\"データ無\"),\"\")","v":""}]
[87,8830,{"$f":"IF(B92=0,\"wait\",_xll.SNT.StockInst(B92,\"銘柄名称\"))","v":{"$error":"#NAME?"}},{"$f":"IF(B92=0,\"wait\",_xll.SNT.StockInst(B92,\"上場部\"))","v":{"$error":"#NAME?"}},{"$f":"IF(B92=0,\"wait\",_xll.SNT.StockInst(B92,\"現値\"))","v":{"$error":"#NAME?"}},{"$f":"IF(B92=0,\"wait\",_xll.SNT.StockInst(B92,\"前日終値\"))","v":{"$error":"#NAME?"}},"wait",{"$f":"IF(B92=0,\"wait\",MID(_xll.SNT.StockInst(B92,\"現値日時\"),12,5))","v":{"$error":"#NAME?"}},{"$f":"IF(B92=0,\"wait\",_xll.SNT.StockInst(B92,\"Tick回数\"))","v":{"$error":"#NAME?"}},{"$f":"IF(B92=0,\"wait\",_xll.SNT.StockInst(B92,\"VWAP\"))","v":{"$error":"#NAME?"}},null,{"$f":"IFERROR(INDEX(ヒストリカルデータ取得シート!$F$5:$DA$5, ROW(A87)),\"-\")","v":"-"},"",{"$f":"IFERROR(INDEX(ヒストリカルデータ取得シート!$F$6:$DA$6, ROW(A87)),\"-\")","v":"-"},null,{"$f":"IF(AND(ISNUMBER(M92), M92>1), IFERROR(VLOOKUP(B92, バックテストデータ_5D_5Y!$B$2:$I$1562, 5, FALSE), \"データ無\"), \"\")","v":""},{"$f":"IF(AND(ISNUMBER(M92), M92>1), IFERROR(VLOOKUP(B92, バックテストデータ_5D_5Y!$B$2:$I$1562, 4, FALSE), \"データ無\"), \"\")","v":""},{"$f":"IF(M92<0,IFERROR(VLOOKUP(B92,バックテストデータ_5D_5Y!$B$2:$I$1562,8,FALSE),\"データ無\"),\"\")","v":""},{"$f":"IF(M92<0,IFERROR(VLOOKUP(B92,バックテストデータ_5D_5Y!$B$2:$I$1562,7,FALSE),\"データ無\"),\"\")","v":""}]
[88,9020,{"$f":"IF(B93=0,\"wait\",_xll.SNT.StockInst(B93,\"銘柄名称\"))","v":{"$error":"#NAME?"}},{"$f":"IF(B93=0,\"wait\",_xll.SNT.StockInst(B93,\"上場部\"))","v":{"$error":"#NAME?"}},{"$f":"IF(B93=0,\"wait\",_xll.SNT.StockInst(B93,\"現値\"))","v":{"$error":"#NAME?"}},{"$f":"IF(B93=0,\"wait\",_xll.SNT.StockInst(B93,\"前日終値\"))","v":{"$error":"#NAME?"}},"wait",{"$f":"IF(B93=0,\"wait\",MID(_xll.SNT.StockInst(B93,\"現値日時\"),12,5))","v":{"$error":"#NAME?"}},{"$f":"IF(B93=0,\"wait\",_xll.SNT.StockInst(B93,\"Tick回数\"))","v":{"$error":"#NAME?"}},{"$f":"IF(B93=0,\"wait\",_xll.SNT.StockInst(B93,\"VWAP\"))","v":{"$error":"#NAME?"}},null,{"$f":"IFERROR(INDEX(ヒストリカルデータ取得シート!$F$5:$DA$5, ROW(A88)),\"-\")","v":"-"},"",{"$f":"IFERROR(INDEX(ヒストリカルデータ取得シート!$F$6:$DA$6, ROW(A88)),\"-\")","v":"-"},null,{"$f":"IF(AND(ISNUMBER(M93), M93>1), IFERROR(VLOOKUP(B93, バックテストデータ_5D_5Y!$B$2:$I$1562, 5, FALSE), \"データ無\"), \"\")","v":""},{"$f":"IF(AND(ISNUMBER(M93), M93>1), IFERROR(VLOOKUP(B93, バックテストデータ_5D_5Y!$B$2:$I$1562, 4, FALSE), \"データ無\"), \"\")","v":""},{"$f":"IF(M93<0,IFERROR(VLOOKUP(B93,バックテストデータ_5D_5Y!$B$2:$I$1562,8,FALSE),\"データ無\"),\"\")","v":""},{"$f":"IF(M93<0,IFERROR(VLOOKUP(B93,バックテストデータ_5D_5Y!$B$2:$I$1562,7,FALSE),\"データ無\"),\"\")","v":""}]
[89,9021,{"$f":"IF(B94=0,\"wait\",_xll.SNT.StockInst(B94,\"銘柄名称\"))","v":{"$error":"#NAME?"}},{"$f":"IF(B94=0,\"wait\",_xll.SNT.StockInst(B94,\"上場部\"))","v":{"$error":"#NAME?"}},{"$f":"IF(B94=0,\"wait\",_xll.SNT.StockInst(B94,\"現値\"))","v":{"$error":"#NAME?"}},{"$f":"IF(B94=0,\"wait\",_xll.SNT.StockInst(B94,\"前日終値\"))","v":{"$error":"#NAME?"}},"wait",{"$f":"IF(B94=0,\"wait\",MID(_xll.SNT.StockInst(B94,\"現値日時\"),12,5))","v":{"$error":"#NAME?"}},{"$f":"IF(B94=0,\"wait\",_xll.SNT.StockInst(B94,\"Tick回数\"))","v":{"$error":"#NAME?"}},{"$f":"IF(B94=0,\"wait\",_xll.SNT.StockInst(B94,\"VWAP\"))","v":{"$error":"#NAME?"}},null,{"$f":"IFERROR(INDEX(ヒストリカルデータ取得シート!$F$5:$DA$5, ROW(A89)),\"-\")","v":"-"},"",{"$f":"IFERROR(INDEX(ヒストリカルデータ取得シート!$F$6:$DA$6, ROW(A89)),\"-\")","v":"-"},null,{"$f":"IF(AND(ISNUMBER(M94), M94>1), IFERROR(VLOOKUP(B94, バックテストデータ_5D_5Y!$B$2:$I$1562, 5, FALSE), \"データ無\"), \"\")","v":""},{"$f":"IF(AND(ISNUMBER(M94), M94>1), IFERROR(VLOOKUP(B94, バックテストデータ_5D_5Y!$B$2:$I$1562, 4, FALSE), \"データ無\"), \"\")","v":""},{"$f":"IF(M94<0,IFERROR(VLOOKUP(B94,バックテストデータ_5D_5Y!$B$2:$I$1562,8,FALSE),\"データ無\"),\"\")","v":""},{"$f":"IF(M94<0,IFERROR(VLOOKUP(B94,バックテストデータ_5D_5Y!$B$2:$I$1562,7,FALSE),\"データ無\"),\"\")","v":""}]
[90,9022,{"$f":"IF(B95=0,\"wait\",_xll.SNT.StockInst(B95,\"銘柄名称\"))","v":{"$error":"#NAME?"}},{"$f":"IF(B95=0,\"wait\",_xll.SNT.StockInst(B95,\"上場部\"))","v":{"$error":"#NAME?"}},{"$f":"IF(B95=0,\"wait\",_xll.SNT.StockInst(B95,\"現値\"))","v":{"$error":"#NAME?"}},{"$f":"IF(B95=0,\"wait\",_xll.SNT.StockInst(B95,\"前日終値\"))","v":{"$error":"#NAME?"}},"wait",{"$f":"IF(B95=0,\"wait\",MID(_xll.SNT.StockInst(B95,\"現値日時\"),12,5))","v":{"$error":"#NAME?"}},{"$f":"IF(B95=0,\"wait\",_xll.SNT.StockInst(B95,\"Tick回数\"))","v":{"$error":"#NAME?"}},{"$f":"IF(B95=0,\"wait\",_xll.SNT.StockInst(B95,\"VWAP\"))","v":{"$error":"#NAME?"}},null,{"$f":"IFERROR(INDEX(ヒストリカルデータ取得シート!$F$5:$DA$5, ROW(A90)),\"-\")","v":"-"},"",{"$f":"IFERROR(INDEX(ヒストリカルデータ取得シート!$F$6:$DA$6, ROW(A90)),\"-\")","v":"-"},null,{"$f":"IF(AND(ISNUMBER(M95), M95>1), IFERROR(VLOOKUP(B95, バックテストデータ_5D_5Y!$B$2:$I$1562, 5, FALSE), \"データ無\"), \"\")","v":""},{"$f":"IF(AND(ISNUMBER(M95), M95>1), IFERROR(VLOOKUP(B95, バックテストデータ_5D_5Y!$B$2:$I$1562, 4, FALSE), \"データ無\"), \"\")","v":""},{"$f":"IF(M95<0,IFERROR(VLOOKUP(B95,バックテストデータ_5D_5Y!$B$2:$I$1562,8,FALSE),\"データ無\"),\"\")","v":""},{"$f":"IF(M95<0,IFERROR(VLOOKUP(B95,バックテストデータ_5D_5Y!$B$2:$I$1562,7,FALSE),\"データ無\"),\"\")","v":""}]
[91,9101,{"$f":"IF(B96=0,\"wait\",_xll.SNT.StockInst(B96,\"銘柄名称\"))","v":{"$error":"#NAME?"}},{"$f":"IF(B96=0,\"wait\",_xll.SNT.StockInst(B96,\"上場部\"))","v":{"$error":"#NAME?"}},{"$f":"IF(B96=0,\"wait\",_xll.SNT.StockInst(B96,\"現値\"))","v":{"$error":"#NAME?"}},{"$f":"IF(B96=0,\"wait\",_xll.SNT.StockInst(B96,\"前日終値\"))","v":{"$error":"#NAME?"}},"wait",{"$f":"IF(B96=0,\"wait\",MID(_xll.SNT.StockInst(B96,\"現値日時\"),12,5))","v":{"$error":"#NAME?"}},{"$f":"IF(B96=0,\"wait\",_xll.SNT.StockInst(B96,\"Tick回数\"))","v":{"$error":"#NAME?"}},{"$f":"IF(B96=0,\"wait\",_xll.SNT.StockInst(B96,\"VWAP\"))","v":{"$error":"#NAME?"}},null,{"$f":"IFERROR(INDEX(ヒストリカルデータ取得シート!$F$5:$DA$5, ROW(A91)),\"-\")","v":"-"},"",{"$f":"IFERROR(INDEX(ヒストリカルデータ取得シート!$F$6:$DA$6, ROW(A91)),\"-\")","v":"-"},null,{"$f":"IF(AND(ISNUMBER(M96), M96>1), IFERROR(VLOOKUP(B96, バックテストデータ_5D_5Y!$B$2:$I$1562, 5, FALSE), \"データ無\"), \"\")","v":""},{"$f":"IF(AND(ISNUMBER(M96), M96>1), IFERROR(VLOOKUP(B96, バックテストデータ_5D_5Y!$B$2:$I$1562, 4, FALSE), \"データ無\"), \"\")","v":""},{"$f":"IF(M96<0,IFERROR(VLOOKUP(B96,バックテストデータ_5D_5Y!$B$2:$I$1562,8,FALSE),\"データ無\"),\"\")","v":""},{"$f":"IF(M96<0,IFERROR(VLOOKUP(B96,バックテストデータ_5D_5Y!$B$2:$I$1562,7,FALSE),\"データ無\"),\"\")","v":""}]
[92,9202,{"$f":"IF(B97=0,\"wait\",_xll.SNT.StockInst(B97,\"銘柄名称\"))","v":{"$error":"#NAME?"}},{"$f":"IF(B97=0,\"wait\",_xll.SNT.StockInst(B97,\"上場部\"))","v":{"$error":"#NAME?"}},{"$f":"IF(B97=0,\"wait\",_xll.SNT.StockInst(B97,\"現値\"))","v":{"$error":"#NAME?"}},{"$f":"IF(B97=0,\"wait\",_xll.SNT.StockInst(B97,\"前日終値\"))","v":{"$error":"#NAME?"}},"wait",{"$f":"IF(B97=0,\"wait\",MID(_xll.SNT.StockInst(B97,\"現値日時\"),12,5))","v":{"$error":"#NAME?"}},{"$f":"IF(B97=0,\"wait\",_xll.SNT.StockInst(B97,\"Tick回数\"))","v":{"$error":"#NAME?"}},{"$f":"IF(B97=0,\"wait\",_xll.SNT.StockInst(B97,\"VWAP\"))","v":{"$error":"#NAME?"}},null,{"$f":"IFERROR(INDEX(ヒストリカルデータ取得シート!$F$5:$DA$5, ROW(A92)),\"-\")","v":"-"},"",{"$f":"IFERROR(INDEX(ヒストリカルデータ取得シート!$F$6:$DA$6, ROW(A92)),\"-\")","v":"-"},null,{"$f":"IF(AND(ISNUMBER(M97), M97>1), IFERROR(VLOOKUP(B97, バックテストデータ_5D_5Y!$B$2:$I$1562, 5, FALSE), \"データ無\"), \"\")","v":""},{"$f":"IF(AND(ISNUMBER(M97), M97>1), IFERROR(VLOOKUP(B97, バックテストデータ_5D_5Y!$B$2:$I$1562, 4, FALSE), \"データ無\"), \"\")","v":""},{"$f":"IF(M97<0,IFERROR(VLOOKUP(B97,バックテストデータ_5D_5Y!$B$2:$I$1562,8,FALSE),\"データ無\"),\"\")","v":""},{"$f":"IF(M97<0,IFERROR(VLOOKUP(B97,バックテストデータ_5D_5Y!$B$2:$I$1562,7,FALSE),\"データ無\"),\"\")","v":""}]
[93,9432,{"$f":"IF(B98=0,\"wait\",_xll.SNT.StockInst(B98,\"銘柄名称\"))","v":{"$error":"#NAME?"}},{"$f":"IF(B98=0,\"wait\",_xll.SNT.StockInst(B98,\"上場部\"))","v":{"$error":"#NAME?"}},{"$f":"IF(B98=0,\"wait\",_xll.SNT.StockInst(B98,\"現値\"))","v":{"$error":"#NAME?"}},{"$f":"IF(B98=0,\"wait\",_xll.SNT.StockInst(B98,\"前日終値\"))","v":{"$error":"#NAME?"}},"wait",{"$f":"IF(B98=0,\"wait\",MID(_xll.SNT.StockInst(B98,\"現値日時\"),12,5))","v":{"$error":"#NAME?"}},{"$f":"IF(B98=0,\"wait\",_xll.SNT.StockInst(B98,\"Tick回数\"))","v":{"$error":"#NAME?"}},{"$f":"IF(B98=0,\"wait\",_xll.SNT.StockInst(B98,\"VWAP\"))","v":{"$error":"#NAME?"}},null,{"$f":"IFERROR(INDEX(ヒストリカルデータ取得シート!$F$5:$DA$5, ROW(A93)),\"-\")","v":"-"},"",{"$f":"IFERROR(INDEX(ヒストリカルデータ取得シート!$F$6:$DA$6, ROW(A93)),\"-\")","v":"-"},null,{"$f":"IF(AND(ISNUMBER(M98), M98>1), IFERROR(VLOOKUP(B98, バックテストデータ_5D_5Y!$B$2:$I$1562, 5, FALSE), \"データ無\"), \"\")","v":""},{"$f":"IF(AND(ISNUMBER(M98), M98>1), IFERROR(VLOOKUP(B98, バックテストデータ_5D_5Y!$B$2:$I$1562, 4, FALSE), \"データ無\"), \"\")","v":""},{"$f":"IF(M98<0,IFERROR(VLOOKUP(B98,バックテストデータ_5D_5Y!$B$2:$I$1562,8,FALSE),\"データ無\"),\"\")","v":""},{"$f":"IF(M98<0,IFERROR(VLOOKUP(B98,バックテストデータ_5D_5Y!$B$2:$I$1562,7,FALSE),\"データ無\"),\"\")","v":""}]
[94,9433,{"$f":"IF(B99=0,\"wait\",_xll.SNT.StockInst(B99,\"銘柄名称\"))","v":{"$error":"#NAME?"}},{"$f":"IF(B99=0,\"wait\",_xll.SNT.StockInst(B99,\"上場部\"))","v":{"$error":"#NAME?"}},{"$f":"IF(B99=0,\"wait\",_xll.SNT.StockInst(B99,\"現値\"))","v":{"$error":"#NAME?"}},{"$f":"IF(B99=0,\"wait\",_xll.SNT.StockInst(B99,\"前日終値\"))","v":{"$error":"#NAME?"}},"wait",{"$f":"IF(B99=0,\"wait\",MID(_xll.SNT.StockInst(B99,\"現値日時\"),12,5))","v":{"$error":"#NAME?"}},{"$f":"IF(B99=0,\"wait\",_xll.SNT.StockInst(B99,\"Tick回数\"))","v":{"$error":"#NAME?"}},{"$f":"IF(B99=0,\"wait\",_xll.SNT.StockInst(B99,\"VWAP\"))","v":{"$error":"#NAME?"}},null,{"$f":"IFERROR(INDEX(ヒストリカルデータ取得シート!$F$5:$DA$5, ROW(A94)),\"-\")","v":"-"},"",{"$f":"IFERROR(INDEX(ヒストリカルデータ取得シート!$F$6:$DA$6, ROW(A94)),\"-\")","v":"-"},null,{"$f":"IF(AND(ISNUMBER(M99), M99>1), IFERROR(VLOOKUP(B99, バックテストデータ_5D_5Y!$B$2:$I$1562, 5, FALSE), \"データ無\"), \"\")","v":""},{"$f":"IF(AND(ISNUMBER(M99), M99>1), IFERROR(VLOOKUP(B99, バックテストデータ_5D_5Y!$B$2:$I$1562, 4, FALSE), \"データ無\"), \"\")","v":""},{"$f":"IF(M99<0,IFERROR(VLOOKUP(B99,バックテストデータ_5D_5Y!$B$2:$I$1562,8,FALSE),\"データ無\"),\"\")","v":""},{"$f":"IF(M99<0,IFERROR(VLOOKUP(B99,バックテストデータ_5D_5Y!$B$2:$I$1562,7,FALSE),\"データ無\"),\"\")","v":""}]
[95,9434,{"$f":"IF(B100=0,\"wait\",_xll.SNT.StockInst(B100,\"銘柄名称\"))","v":{"$error":"#NAME?"}},{"$f":"IF(B100=0,\"wait\",_xll.SNT.StockInst(B100,\"上場部\"))","v":{"$error":"#NAME?"}},{"$f":"IF(B100=0,\"wait\",_xll.SNT.StockInst(B100,\"現値\"))","v":{"$error":"#NAME?"}},{"$f":"IF(B100=0,\"wait\",_xll.SNT.StockInst(B100,\"前日終値\"))","v":{"$error":"#NAME?"}},"wait",{"$f":"IF(B100=0,\"wait\",MID(_xll.SNT.StockInst(B100,\"現値日時\"),12,5))","v":{"$error":"#NAME?"}},{"$f":"IF(B100=0,\"wait\",_xll.SNT.StockInst(B100,\"Tick回数\"))","v":{"$error":"#NAME?"}},{"$f":"IF(B100=0,\"wait\",_xll.SNT.StockInst(B100,\"VWAP\"))","v":{"$error":"#NAME?"}},null,{"$f":"IFERROR(INDEX(ヒストリカルデータ取得シート!$F$5:$DA$5, ROW(A95)),\"-\")","v":"-"},"",{"$f":"IFERROR(INDEX(ヒストリカルデータ取得シート!$F$6:$DA$6, ROW(A95)),\"-\")","v":"-"},null,{"$f":"IF(AND(ISNUMBER(M100), M100>1), IFERROR(VLOOKUP(B100, バックテストデータ_5D_5Y!$B$2:$I$1562, 5, FALSE), \"データ無\"), \"\")","v":""},{"$f":"IF(AND(ISNUMBER(M100), M100>1), IFERROR(VLOOKUP(B100, バックテストデータ_5D_5Y!$B$2:$I$1562, 4, FALSE), \"データ無\"), \"\")","v":""},{"$f":"IF(M100<0,IFERROR(VLOOKUP(B100,バックテストデータ_5D_5Y!$B$2:$I$1562,8,FALSE),\"データ無\"),\"\")","v":""},{"$f":"IF(M100<0,IFERROR(VLOOKUP(B100,バックテストデータ_5D_5Y!$B$2:$I$1562,7,FALSE),\"データ無\"),\"\")","v":""}]
[96,9735,{"$f":"IF(B101=0,\"wait\",_xll.SNT.StockInst(B101,\"銘柄名称\"))","v":{"$error":"#NAME?"}},{"$f":"IF(B101=0,\"wait\",_xll.SNT.StockInst(B101,\"上場部\"))","v":{"$error":"#NAME?"}},{"$f":"IF(B101=0,\"wait\",_xll.SNT.StockInst(B101,\"現値\"))","v":{"$error":"#NAME?"}},{"$f":"IF(B101=0,\"wait\",_xll.SNT.StockInst(B101,\"前日終値\"))","v":{"$error":"#NAME?"}},"wait",{"$f":"IF(B101=0,\"wait\",MID(_xll.SNT.StockInst(B101,\"現値日時\"),12,5))","v":{"$error":"#NAME?"}},{"$f":"IF(B101=0,\"wait\",_xll.SNT.StockInst(B101,\"Tick回数\"))","v":{"$error":"#NAME?"}},{"$f":"IF(B101=0,\"wait\",_xll.SNT.StockInst(B101,\"VWAP\"))","v":{"$error":"#NAME?"}},null,{"$f":"IFERROR(INDEX(ヒストリカルデータ取得シート!$F$5:$DA$5, ROW(A96)),\"-\")","v":"-"},"",{"$f":"IFERROR(INDEX(ヒストリカルデータ取得シート!$F$6:$DA$6, ROW(A96)),\"-\")","v":"-"},null,{"$f":"IF(AND(ISNUMBER(M101), M101>1), IFERROR(VLOOKUP(B101, バックテストデータ_5D_5Y!$B$2:$I$1562, 5, FALSE), \"データ無\"), \"\")","v":""},{"$f":"IF(AND(ISNUMBER(M101), M101>1), IFERROR(VLOOKUP(B101, バックテストデータ_5D_5Y!$B$2:$I$1562, 4, FALSE), \"データ無\"), \"\")","v":""},{"$f":"IF(M101<0,IFERROR(VLOOKUP(B101,バックテストデータ_5D_5Y!$B$2:$I$1562,8,FALSE),\"データ無\"),\"\")","v":""},{"$f":"IF(M101<0,IFERROR(VLOOKUP(B101,バックテストデータ_5D_5Y!$B$2:$I$1562,7,FALSE),\"データ無\"),\"\")","v":""}]
[97,9843,{"$f":"IF(B102=0,\"wait\",_xll.SNT.StockInst(B102,\"銘柄名称\"))","v":{"$error":"#NAME?"}},{"$f":"IF(B102=0,\"wait\",_xll.SNT.StockInst(B102,\"上場部\"))","v":{"$error":"#NAME?"}},{"$f":"IF(B102=0,\"wait\",_xll.SNT.StockInst(B102,\"現値\"))","v":{"$error":"#NAME?"}},{"$f":"IF(B102=0,\"wait\",_xll.SNT.StockInst(B102,\"前日終値\"))","v":{"$error":"#NAME?"}},"wait",{"$f":"IF(B102=0,\"wait\",MID(_xll.SNT.StockInst(B102,\"現値日時\"),12,5))","v":{"$error":"#NAME?"}},{"$f":"IF(B102=0,\"wait\",_xll.SNT.StockInst(B102,\"Tick回数\"))","v":{"$error":"#NAME?"}},{"$f":"IF(B102=0,\"wait\",_xll.SNT.StockInst(B102,\"VWAP\"))","v":{"$error":"#NAME?"}},null,{"$f":"IFERROR(INDEX(ヒストリカルデータ取得シート!$F$5:$DA$5, ROW(A97)),\"-\")","v":"-"},"",{"$f":"IFERROR(INDEX(ヒストリカルデータ取得シート!$F$6:$DA$6, ROW(A97)),\"-\")","v":"-"},null,{"$f":"IF(AND(ISNUMBER(M102), M102>1), IFERROR(VLOOKUP(B102, バックテストデータ_5D_5Y!$B$2:$I$1562, 5, FALSE), \"データ無\"), \"\")","v":""},{"$f":"IF(AND(ISNUMBER(M102), M102>1), IFERROR(VLOOKUP(B102, バックテストデータ_5D_5Y!$B$2:$I$1562, 4, FALSE), \"データ無\"), \"\")","v":""},{"$f":"IF(M102<0,IFERROR(VLOOKUP(B102,バックテストデータ_5D_5Y!$B$2:$I$1562,8,FALSE),\"データ無\"),\"\")","v":""},{"$f":"IF(M102<0,IFERROR(VLOOKUP(B102,バックテストデータ_5D_5Y!$B$2:$I$1562,7,FALSE),\"データ無\"),\"\")","v":""}]
[98,9983,{"$f":"IF(B103=0,\"wait\",_xll.SNT.StockInst(B103,\"銘柄名称\"))","v":{"$error":"#NAME?"}},{"$f":"IF(B103=0,\"wait\",_xll.SNT.StockInst(B103,\"上場部\"))","v":{"$error":"#NAME?"}},{"$f":"IF(B103=0,\"wait\",_xll.SNT.StockInst(B103,\"現値\"))","v":{"$error":"#NAME?"}},{"$f":"IF(B103=0,\"wait\",_xll.SNT.StockInst(B103,\"前日終値\"))","v":{"$error":"#NAME?"}},"wait",{"$f":"IF(B103=0,\"wait\",MID(_xll.SNT.StockInst(B103,\"現値日時\"),12,5))","v":{"$error":"#NAME?"}},{"$f":"IF(B103=0,\"wait\",_xll.SNT.StockInst(B103,\"Tick回数\"))","v":{"$error":"#NAME?"}},{"$f":"IF(B103=0,\"wait\",_xll.SNT.StockInst(B103,\"VWAP\"))","v":{"$error":"#NAME?"}},null,{"$f":"IFERROR(INDEX(ヒストリカルデータ取得シート!$F$5:$DA$5, ROW(A98)),\"-\")","v":"-"},"",{"$f":"IFERROR(INDEX(ヒストリカルデータ取得シート!$F$6:$DA$6, ROW(A98)),\"-\")","v":"-"},null,{"$f":"IF(AND(ISNUMBER(M103), M103>1), IFERROR(VLOOKUP(B103, バックテストデータ_5D_5Y!$B$2:$I$1562, 5, FALSE), \"データ無\"), \"\")","v":""},{"$f":"IF(AND(ISNUMBER(M103), M103>1), IFERROR(VLOOKUP(B103, バックテストデータ_5D_5Y!$B$2:$I$1562, 4, FALSE), \"データ無\"), \"\")","v":""},{"$f":"IF(M103<0,IFERROR(VLOOKUP(B103,バックテストデータ_5D_5Y!$B$2:$I$1562,8,FALSE),\"データ無\"),\"\")","v":""},{"$f":"IF(M103<0,IFERROR(VLOOKUP(B103,バックテストデータ_5D_5Y!$B$2:$I$1562,7,FALSE),\"データ無\"),\"\")","v":""}]
[99,9984,{"$f":"IF(B104=0,\"wait\",_xll.SNT.StockInst(B104,\"銘柄名称\"))","v":{"$error":"#NAME?"}},{"$f":"IF(B104=0,\"wait\",_xll.SNT.StockInst(B104,\"上場部\"))","v":{"$error":"#NAME?"}},{"$f":"IF(B104=0,\"wait\",_xll.SNT.StockInst(B104,\"現値\"))","v":{"$error":"#NAME?"}},{"$f":"IF(B104=0,\"wait\",_xll.SNT.StockInst(B104,\"前日終値\"))","v":{"$error":"#NAME?"}},"wait",{"$f":"IF(B104=0,\"wait\",MID(_xll.SNT.StockInst(B104,\"現値日時\"),12,5))","v":{"$error":"#NAME?"}},{"$f":"IF(B104=0,\"wait\",_xll.SNT.StockInst(B104,\"Tick回数\"))","v":{"$error":"#NAME?"}},{"$f":"IF(B104=0,\"wait\",_xll.SNT.StockInst(B104,\"VWAP\"))","v":{"$error":"#NAME?"}},null,{"$f":"IFERROR(INDEX(ヒストリカルデータ取得シート!$F$5:$DA$5, ROW(A99)),\"-\")","v":"-"},"",{"$f":"IFERROR(INDEX(ヒストリカルデータ取得シート!$F$6:$DA$6, ROW(A99)),\"-\")","v":"-"},null,{"$f":"IF(AND(ISNUMBER(M104), M104>1), IFERROR(VLOOKUP(B104, バックテストデータ_5D_5Y!$B$2:$I$1562, 5, FALSE), \"データ無\"), \"\")","v":""},{"$f":"IF(AND(ISNUMBER(M104), M104>1), IFERROR(VLOOKUP(B104, バックテストデータ_5D_5Y!$B$2:$I$1562, 4, FALSE), \"データ無\"), \"\")","v":""},{"$f":"IF(M104<0,IFERROR(VLOOKUP(B104,バックテストデータ_5D_5Y!$B$2:$I$1562,8,FALSE),\"データ無\"),\"\")","v":""},{"$f":"IF(M104<0,IFERROR(VLOOKUP(B104,バックテストデータ_5D_5Y!$B$2:$I$1562,7,FALSE),\"データ無\"),\"\")","v":""}]
[100,null,{"$f":"IF(B105=0,\"wait\",_xll.SNT.StockInst(B105,\"銘柄名称\"))","v":"wait"},{"$f":"IF(B105=0,\"wait\",_xll.SNT.StockInst(B105,\"上場部\"))","v":"wait"},{"$f":"IF(B105=0,\"wait\",_xll.SNT.StockInst(B105,\"現値\"))","v":"wait"},{"$f":"IF(B105=0,\"wait\",_xll.SNT.StockInst(B105,\"前日終値\"))","v":"wait"},"wait",{"$f":"IF(B105=0,\"wait\",MID(_xll.SNT.StockInst(B105,\"現値日時\"),12,5))","v":"wait"},{"$f":"IF(B105=0,\"wait\",_xll.SNT.StockInst(B105,\"Tick回数\"))","v":"wait"},{"$f":"IF(B105=0,\"wait\",_xll.SNT.StockInst(B105,\"VWAP\"))","v":"wait"},null,{"$f":"IFERROR(INDEX(ヒストリカルデータ取得シート!$F$5:$DA$5, ROW(A100)),\"-\")","v":"wait"},"",{"$f":"IFERROR(INDEX(ヒストリカルデータ取得シート!$F$6:$DA$6, ROW(A100)),\"-\")","v":"wait"},null,{"$f":"IF(AND(ISNUMBER(M105), M105>1), IFERROR(VLOOKUP(B105, バックテストデータ_5D_5Y!$B$2:$I$1562, 5, FALSE), \"データ無\"), \"\")","v":""},{"$f":"IF(AND(ISNUMBER(M105), M105>1), IFERROR(VLOOKUP(B105, バックテストデータ_5D_5Y!$B$2:$I$1562, 4, FALSE), \"データ無\"), \"\")","v":""},{"$f":"IF(M105<0,IFERROR(VLOOKUP(B105,バックテストデータ_5D_5Y!$B$2:$I$1562,8,FALSE),\"データ無\"),\"\")","v":""},{"$f":"IF(M105<0,IFERROR(VLOOKUP(B105,バックテストデータ_5D_5Y!$B$2:$I$1562,7,FALSE),\"データ無\"),\"\")","v":""}]

{"sheet":"ヒストリカルデータ取得シート","index":1,"n_rows":39,"n_cols":105,"rows_kept":39,"cut":false,"hidden":false,"merged":[]}
[]
["更新日時 2025/03/04 09:27:56"]
[null,null,null,null,"＃",1,2,3,4,5,6,7,8,9,10,11,12,13,14,15,16,17,18,19,20,21,22,23,24,25,26,27,28,29,30,31,32,33,34,35,36,37,38,39,40,41,42,43,44,45,46,47,48,49,50,51,52,53,54,55,56,57,58,59,60,61,62,63,64,65,66,67,68,69,70,71,72,73,74,75,76,77,78,79,80,81,82,83,84,85,86,87,88,89,90,91,92,93,94,95,96,97,98,99,100]
[null,null,null,null,"銘柄コード",{"$f":"銘柄一覧シート!B6","v":1925},{"$f":"銘柄一覧シート!B7","v":1928},{"$f":"銘柄一覧シート!B8","v":2413},{"$f":"銘柄一覧シート!B9","v":2502},{"$f":"銘柄一覧シート!B10","v":2503},{"$f":"銘柄一覧シート!B11","v":2802},{"$f":"銘柄一覧シート!B12","v":2914},{"$f":"銘柄一覧シート!B13","v":3382},{"$f":"銘柄一覧シート!B14","v":3402},{"$f":"銘柄一覧シート!B15","v":3407},{"$f":"銘柄一覧シート!B16","v":4063},{"$f":"銘柄一覧シート!B17","v":4188},{"$f":"銘柄一覧シート!B18","v":4452},{"$f":"銘柄一覧シート!B19","v":4502},{"$f":"銘柄一覧シート!B20","v":4503},{"$f":"銘柄一覧シート!B21","v":4507},{"$f":"銘柄一覧シート!B22","v":4519},{"$f":"銘柄一覧シート!B23","v":4523},{"$f":"銘柄一覧シート!B24","v":4528},{"$f":"銘柄一覧シート!B25","v":4543},{"$f":"銘柄一覧シート!B26","v":4568},{"$f":"銘柄一覧シート!B27","v":4578},{"$f":"銘柄一覧シート!B28","v":4661},{"$f":"銘柄一覧シート!B29","v":4689},{"$f":"銘柄一覧シート!B30","v":4901},{"$f":"銘柄一覧シート!B31","v":4911},{"$f":"銘柄一覧シート!B32","v":5020},{"$f":"銘柄一覧シート!B33","v":5108},{"$f":"銘柄一覧シート!B34","v":5401},{"$f":"銘柄一覧シート!B35","v":5713},{"$f":"銘柄一覧シート!B36","v":5802},{"$f":"銘柄一覧シート!B37","v":6098},{"$f":"銘柄一覧シート!B38","v":6178},{"$f":"銘柄一覧シート!B39","v":6273},{"$f":"銘柄一覧シート!B40","v":6301},{"$f":"銘柄一覧シート!B41","v":6326},{"$f":"銘柄一覧シート!B42","v":6367},{"$f":"銘柄一覧シート!B43","v":6501},{"$f":"銘柄一覧シート!B44","v":6503},{"$f":"銘柄一覧シート!B45","v":6586},{"$f":"銘柄一覧シート!B46","v":6594},{"$f":"銘柄一覧シート!B47","v":6645},{"$f":"銘柄一覧シート!B48","v":6702},{"$f":"銘柄一覧シート!B49","v":6752},{"$f":"銘柄一覧シート!B50","v":6758},{"$f":"銘柄一覧シート!B51","v":6861},{"$f":"銘柄一覧シート!B52","v":6869},{"$f":"銘柄一覧シート!B53","v":6902},{"$f":"銘柄一覧シート!B54","v":6920},{"$f":"銘柄一覧シート!B55","v":6954},{"$f":"銘柄一覧シート!B56","v":6971},{"$f":"銘柄一覧シート!B57","v":6981},{"$f":"銘柄一覧シート!B58","v":7011},{"$f":"銘柄一覧シート!B59","v":7201},{"$f":"銘柄一覧シート!B60","v":7203},{"$f":"銘柄一覧シート!B61","v":7267},{"$f":"銘柄一覧シート!B62","v":7269},{"$f":"銘柄一覧シート!B63","v":7270},{"$f":"銘柄一覧シート!B64","v":7309},{"$f":"銘柄一覧シート!B65","v":7733},{"$f":"銘柄一覧シート!B66","v":7741},{"$f":"銘柄一覧シート!B67","v":7751},{"$f":"銘柄一覧シート!B68","v":7832},{"$f":"銘柄一覧シート!B69","v":7974},{"$f":"銘柄一覧シート!B70","v":8001},{"$f":"銘柄一覧シート!B71","v":8002},{"$f":"銘柄一覧シート!B72","v":8031},{"$f":"銘柄一覧シート!B73","v":8035},{"$f":"銘柄一覧シート!B74","v":8053},{"$f":"銘柄一覧シート!B75","v":8058},{"$f":"銘柄一覧シート!B76","v":8113},{"$f":"銘柄一覧シート!B77","v":8267},{"$f":"銘柄一覧シート!B78","v":8306},{"$f":"銘柄一覧シート!B79","v":8308},{"$f":"銘柄一覧シート!B80","v":8309},{"$f":"銘柄一覧シート!B81","v":8316},{"$f":"銘柄一覧シート!B82","v":8411},{"$f":"銘柄一覧シート!B83","v":8591},{"$f":"銘柄一覧シート!B84","v":8604},{"$f":"銘柄一覧シート!B85","v":8630},{"$f":"銘柄一覧シート!B86","v":8697},{"$f":"銘柄一覧シート!B87","v":8725},{"$f":"銘柄一覧シート!B88","v":8750},{"$f":"銘柄一覧シート!B89","v":8766},{"$f":"銘柄一覧シート!B90","v":8801},{"$f":"銘柄一覧シート!B91","v":8802},{"$f":"銘柄一覧シート!B92","v":8830},{"$f":"銘柄一覧シート!B93","v":9020},{"$f":"銘柄一覧シート!B94","v":9021},{"$f":"銘柄一覧シート!B95","v":9022},{"$f":"銘柄一覧シート!B96","v":9101},{"$f":"銘柄一覧シート!B97","v":9202},{"$f":"銘柄一覧シート!B98","v":9432},{"$f":"銘柄一覧シート!B99","v":9433},{"$f":"銘柄一覧シート!B100","v":9434},{"$f":"銘柄一覧シート!B101","v":9735},{"$f":"銘柄一覧シート!B102","v":9843},{"$f":"銘柄一覧シート!B103","v":9983},{"$f":"銘柄一覧シート!B104","v":9984},{"$f":"銘柄一覧シート!B105","v":0}]
[null,null,null,null,"上限バンド（＋２σ）",{"$f":"IF(F4=0,\"wait\",AVERAGE(F$20:F$39)+2*_xlfn.STDEV.S(F$20:F$39))","v":{"$error":"#DIV/0!"}},{"$error":"#DIV/0!"},{"$error":"#DIV/0!"},{"$error":"#DIV/0!"},{"$error":"#DIV/0!"},{"$error":"#DIV/0!"},{"$error":"#DIV/0!"},{"$error":"#DIV/0!"},{"$error":"#DIV/0!"},{"$error":"#DIV/0!"},{"$error":"#DIV/0!"},{"$error":"#DIV/0!"},{"$error":"#DIV/0!"},{"$error":"#DIV/0!"},{"$error":"#DIV/0!"},{"$error":"#DIV/0!"},{"$error":"#DIV/0!"},{"$error":"#DIV/0!"},{"$error":"#DIV/0!"},{"$error":"#DIV/0!"},{"$error":"#DIV/0!"},{"$error":"#DIV/0!"},{"$error":"#DIV/0!"},{"$error":"#DIV/0!"},{"$error":"#DIV/0!"},{"$error":"#DIV/0!"},{"$error":"#DIV/0!"},{"$error":"#DIV/0!"},{"$error":"#DIV/0!"},{"$error":"#DIV/0!"},{"$error":"#DIV/0!"},{"$error":"#DIV/0!"},{"$f":"IF(AL4=0,\"wait\",AVERAGE(AL$20:AL$39)+2*_xlfn.STDEV.S(AL$20:AL$39))","v":{"$error":"#DIV/0!"}},{"$error":"#DIV/0!"},{"$error":"#DIV/0!"},{"$error":"#DIV/0!"},{"$error":"#DIV/0!"},{"$error":"#DIV/0!"},{"$error":"#DIV/0!"},{"$error":"#DIV/0!"},{"$error":"#DIV/0!"},{"$error":"#DIV/0!"},{"$error":"#DIV/0!"},{"$error":"#DIV/0!"},{"$error":"#DIV/0!"},{"$error":"#DIV/0!"},{"$error":"#DIV/0!"},{"$error":"#DIV/0!"},{"$error":"#DIV/0!"},{"$error":"#DIV/0!"},{"$error":"#DIV/0!"},{"$error":"#DIV/0!"},{"$error":"#DIV/0!"},{"$error":"#DIV/0!"},{"$error":"#DIV/0!"},{"$error":"#DIV/0!"},{"$error":"#DIV/0!"},{"$error":"#DIV/0!"},{"$error":"#DIV/0!"},{"$error":"#DIV/0!"},{"$error":"#DIV/0!"},{"$error":"#DIV/0!"},{"$error":"#DIV/0!"},{"$error":"#DIV/0!"},{"$f":"IF(BR4=0,\"wait\",AVERAGE(BR$20:BR$39)+2*_xlfn.STDEV.S(BR$20:BR$39))","v":{"$error":"#DIV/0!"}},{"$error":"#DIV/0!"},{"$error":"#DIV/0!"},{"$error":"#DIV/0!"},{"$error":"#DIV/0!"},{"$error":"#DIV/0!"},{"$error":"#DIV/0!"},{"$error":"#DIV/0!"},{"$error":"#DIV/0!"},{"$error":"#DIV/0!"},{"$error":"#DIV/0!"},{"$error":"#DIV/0!"},{"$error":"#DIV/0!"},{"$error":"#DIV/0!"},{"$error":"#DIV/0!"},{"$error":"#DIV/0!"},{"$error":"#DIV/0!"},{"$error":"#DIV/0!"},{"$error":"#DIV/0!"},{"$error":"#DIV/0!"},{"$error":"#DIV/0!"},{"$error":"#DIV/0!"},{"$error":"#DIV/0!"},{"$error":"#DIV/0!"},{"$error":"#DIV/0!"},{"$error":"#DIV/0!"},{"$error":"#DIV/0!"},{"$error":"#DIV/0!"},{"$error":"#DIV/0!"},{"$error":"#DIV/0!"},{"$error":"#DIV/0!"},{"$error":"#DIV/0!"},{"$f":"IF(CX4=0,\"wait\",AVERAGE(CX$20:CX$39)+2*_xlfn.STDEV.S(CX$20:CX$39))","v":{"$error":"#DIV/0!"}},{"$error":"#DIV/0!"},{"$error":"#DIV/0!"},"wait"]
[null,null,null,null,"下限バンド（－２σ）",{"$f":"IF(F4=0,\"wait\",AVERAGE(F$20:F$39)-2*_xlfn.STDEV.S(F$20:F$39))","v":{"$error":"#DIV/0!"}},{"$error":"#DIV/0!"},{"$error":"#DIV/0!"},{"$error":"#DIV/0!"},{"$error":"#DIV/0!"},{"$error":"#DIV/0!"},{"$error":"#DIV/0!"},{"$error":"#DIV/0!"},{"$error":"#DIV/0!"},{"$error":"#DIV/0!"},{"$error":"#DIV/0!"},{"$error":"#DIV/0!"},{"$error":"#DIV/0!"},{"$error":"#DIV/0!"},{"$error":"#DIV/0!"},{"$error":"#DIV/0!"},{"$error":"#DIV/0!"},{"$error":"#DIV/0!"},{"$error":"#DIV/0!"},{"$error":"#DIV/0!"},{"$error":"#DIV/0!"},{"$error":"#DIV/0!"},{"$error":"#DIV/0!"},{"$error":"#DIV/0!"},{"$error":"#DIV/0!"},{"$error":"#DIV/0!"},{"$error":"#DIV/0!"},{"$error":"#DIV/0!"},{"$error":"#DIV/0!"},{"$error":"#DIV/0!"},{"$error":"#DIV/0!"},{"$error":"#DIV/0!"},{"$f":"IF(AL4=0,\"wait\",AVERAGE(AL$20:AL$39)-2*_xlfn.STDEV.S(AL$20:AL$39))","v":{"$error":"#DIV/0!"}},{"$error":"#DIV/0!"},{"$error":"#DIV/0!"},{"$error":"#DIV/0!"},{"$error":"#DIV/0!"},{"$error":"#DIV/0!"},{"$error":"#DIV/0!"},{"$error":"#DIV/0!"},{"$error":"#DIV/0!"},{"$error":"#DIV/0!"},{"$error":"#DIV/0!"},{"$error":"#DIV/0!"},{"$error":"#DIV/0!"},{"$error":"#DIV/0!"},{"$error":"#DIV/0!"},{"$error":"#DIV/0!"},{"$error":"#DIV/0!"},{"$error":"#DIV/0!"},{"$error":"#DIV/0!"},{"$error":"#DIV/0!"},{"$error":"#DIV/0!"},{"$error":"#DIV/0!"},{"$error":"#DIV/0!"},{"$error":"#DIV/0!"},{"$error":"#DIV/0!"},{"$error":"#DIV/0!"},{"$error":"#DIV/0!"},{"$error":"#DIV/0!"},{"$error":"#DIV/0!"},{"$error":"#DIV/0!"},{"$error":"#DIV/0!"},{"$error":"#DIV/0!"},{"$f":"IF(BR4=0,\"wait\",AVERAGE(BR$20:BR$39)-2*_xlfn.STDEV.S(BR$20:BR$39))","v":{"$error":"#DIV/0!"}},{"$error":"#DIV/0!"},{"$error":"#DIV/0!"},{"$error":"#DIV/0!"},{"$error":"#DIV/0!"},{"$error":"#DIV/0!"},{"$error":"#DIV/0!"},{"$error":"#DIV/0!"},{"$error":"#DIV/0!"},{"$error":"#DIV/0!"},{"$error":"#DIV/0!"},{"$error":"#DIV/0!"},{"$error":"#DIV/0!"},{"$error":"#DIV/0!"},{"$error":"#DIV/0!"},{"$error":"#DIV/0!"},{"$error":"#DIV/0!"},{"$error":"#DIV/0!"},{"$error":"#DIV/0!"},{"$error":"#DIV/0!"},{"$error":"#DIV/0!"},{"$error":"#DIV/0!"},{"$error":"#DIV/0!"},{"$error":"#DIV/0!"},{"$error":"#DIV/0!"},{"$error":"#DIV/0!"},{"$error":"#DIV/0!"},{"$error":"#DIV/0!"},{"$error":"#DIV/0!"},{"$error":"#DIV/0!"},{"$error":"#DIV/0!"},{"$error":"#DIV/0!"},{"$error":"#DIV/0!"},{"$error":"#DIV/0!"},{"$error":"#DIV/0!"},"wait"]
["起動フラグ　（１以外は停止）"]
[0,null,null,null,{"$f":"IF($A$8=1,_xll.SNT.StockHist(TRUE,F4,\"1D\",30,\"日時@終値\"),\"wait\")","v":"wait"}]
[null,null,null,"日数","日時","終値",{"$f":"IF($A$8=1,_xll.SNT.StockHist(FALSE,INDEX($G$4:$ZZ$4,,COLUMN()-COLUMN($G$9)+1),\"1D\",30,\"終値\"),\"wait\")","v":"wait"},{"$f":"IF($A$8=1,_xll.SNT.StockHist(FALSE,INDEX($G$4:$ZZ$4,,COLUMN()-COLUMN($G$9)+1),\"1D\",30,\"終値\"),\"wait\")","v":"wait"},{"$f":"IF($A$8=1,_xll.SNT.StockHist(FALSE,INDEX($G$4:$ZZ$4,,COLUMN()-COLUMN($G$9)+1),\"1D\",30,\"終値\"),\"wait\")","v":"wait"},{"$f":"IF($A$8=1,_xll.SNT.StockHist(FALSE,INDEX($G$4:$ZZ$4,,COLUMN()-COLUMN($G$9)+1),\"1D\",30,\"終値\"),\"wait\")","v":"wait"},{"$f":"IF($A$8=1,_xll.SNT.StockHist(FALSE,INDEX($G$4:$ZZ$4,,COLUMN()-COLUMN($G$9)+1),\"1D\",30,\"終値\"),\"wait\")","v":"wait"},{"$f":"IF($A$8=1,_xll.SNT.StockHist(FALSE,INDEX($G$4:$ZZ$4,,COLUMN()-COLUMN($G$9)+1),\"1D\",30,\"終値\"),\"wait\")","v":"wait"},{"$f":"IF($A$8=1,_xll.SNT.StockHist(FALSE,INDEX($G$4:$ZZ$4,,COLUMN()-COLUMN($G$9)+1),\"1D\",30,\"終値\"),\"wait\")","v":"wait"},{"$f":"IF($A$8=1,_xll.SNT.StockHist(FALSE,INDEX($G$4:$ZZ$4,,COLUMN()-COLUMN($G$9)+1),\"1D\",30,\"終値\"),\"wait\")","v":"wait"},{"$f":"IF($A$8=1,_xll.SNT.StockHist(FALSE,INDEX($G$4:$ZZ$4,,COLUMN()-COLUMN($G$9)+1),\"1D\",30,\"終値\"),\"wait\")","v":"wait"},{"$f":"IF($A$8=1,_xll.SNT.StockHist(FALSE,INDEX($G$4:$ZZ$4,,COLUMN()-COLUMN($G$9)+1),\"1D\",30,\"終値\"),\"wait\")","v":"wait"},{"$f":"IF($A$8=1,_xll.SNT.StockHist(FALSE,INDEX($G$4:$ZZ$4,,COLUMN()-COLUMN($G$9)+1),\"1D\",30,\"終値\"),\"wait\")","v":"wait"},{"$f":"IF($A$8=1,_xll.SNT.StockHist(FALSE,INDEX($G$4:$ZZ$4,,COLUMN()-COLUMN($G$9)+1),\"1D\",30,\"終値\"),\"wait\")","v":"wait"},{"$f":"IF($A$8=1,_xll.SNT.StockHist(FALSE,INDEX($G$4:$ZZ$4,,COLUMN()-COLUMN($G$9)+1),\"1D\",30,\"終値\"),\"wait\")","v":"wait"},{"$f":"IF($A$8=1,_xll.SNT.StockHist(FALSE,INDEX($G$4:$ZZ$4,,COLUMN()-COLUMN($G$9)+1),\"1D\",30,\"終値\"),\"wait\")","v":"wait"},{"$f":"IF($A$8=1,_xll.SNT.StockHist(FALSE,INDEX($G$4:$ZZ$4,,COLUMN()-COLUMN($G$9)+1),\"1D\",30,\"終値\"),\"wait\")","v":"wait"},{"$f":"IF($A$8=1,_xll.SNT.StockHist(FALSE,INDEX($G$4:$ZZ$4,,COLUMN()-COLUMN($G$9)+1),\"1D\",30,\"終値\"),\"wait\")","v":"wait"},{"$f":"IF($A$8=1,_xll.SNT.StockHist(FALSE,INDEX($G$4:$ZZ$4,,COLUMN()-COLUMN($G$9)+1),\"1D\",30,\"終値\"),\"wait\")","v":"wait"},{"$f":"IF($A$8=1,_xll.SNT.StockHist(FALSE,INDEX($G$4:$ZZ$4,,COLUMN()-COLUMN($G$9)+1),\"1D\",30,\"終値\"),\"wait\")","v":"wait"},{"$f":"IF($A$8=1,_xll.SNT.StockHist(FALSE,INDEX($G$4:$ZZ$4,,COLUMN()-COLUMN($G$9)+1),\"1D\",30,\"終値\"),\"wait\")","v":"wait"},{"$f":"IF($A$8=1,_xll.SNT.StockHist(FALSE,INDEX($G$4:$ZZ$4,,COLUMN()-COLUMN($G$9)+1),\"1D\",30,\"終値\"),\"wait\")","v":"wait"},{"$f":"IF($A$8=1,_xll.SNT.StockHist(FALSE,INDEX($G$4:$ZZ$4,,COLUMN()-COLUMN($G$9)+1),\"1D\",30,\"終値\"),\"wait\")","v":"wait"},{"$f":"IF($A$8=1,_xll.SNT.StockHist(FALSE,INDEX($G$4:$ZZ$4,,COLUMN()-COLUMN($G$9)+1),\"1D\",30,\"終値\"),\"wait\")","v":"wait"},{"$f":"IF($A$8=1,_xll.SNT.StockHist(FALSE,INDEX($G$4:$ZZ$4,,COLUMN()-COLUMN($G$9)+1),\"1D\",30,\"終値\"),\"wait\")","v":"wait"},{"$f":"IF($A$8=1,_xll.SNT.StockHist(FALSE,INDEX($G$4:$ZZ$4,,COLUMN()-COLUMN($G$9)+1),\"1D\",30,\"終値\"),\"wait\")","v":"wait"},{"$f":"IF($A$8=1,_xll.SNT.StockHist(FALSE,INDEX($G$4:$ZZ$4,,COLUMN()-COLUMN($G$9)+1),\"1D\",30,\"終値\"),\"wait\")","v":"wait"},{"$f":"IF($A$8=1,_xll.SNT.StockHist(FALSE,INDEX($G$4:$ZZ$4,,COLUMN()-COLUMN($G$9)+1),\"1D\",30,\"終値\"),\"wait\")","v":"wait"},{"$f":"IF($A$8=1,_xll.SNT.StockHist(FALSE,INDEX($G$4:$ZZ$4,,COLUMN()-COLUMN($G$9)+1),\"1D\",30,\"終値\"),\"wait\")","v":"wait"},{"$f":"IF($A$8=1,_xll.SNT.StockHist(FALSE,INDEX($G$4:$ZZ$4,,COLUMN()-COLUMN($G$9)+1),\"1D\",30,\"終値\"),\"wait\")","v":"wait"},{"$f":"IF($A$8=1,_xll.SNT.StockHist(FALSE,INDEX($G$4:$ZZ$4,,COLUMN()-COLUMN($G$9)+1),\"1D\",30,\"終値\"),\"wait\")","v":"wait"},{"$f":"IF($A$8=1,_xll.SNT.StockHist(FALSE,INDEX($G$4:$ZZ$4,,COLUMN()-COLUMN($G$9)+1),\"1D\",30,\"終値\"),\"wait\")","v":"wait"},{"$f":"IF($A$8=1,_xll.SNT.StockHist(FALSE,INDEX($G$4:$ZZ$4,,COLUMN()-COLUMN($G$9)+1),\"1D\",30,\"終値\"),\"wait\")","v":"wait"},{"$f":"IF($A$8=1,_xll.SNT.StockHist(FALSE,INDEX($G$4:$ZZ$4,,COLUMN()-COLUMN($G$9)+1),\"1D\",30,\"終値\"),\"wait\")","v":"wait"},{"$f":"IF($A$8=1,_xll.SNT.StockHist(FALSE,INDEX($G$4:$ZZ$4,,COLUMN()-COLUMN($G$9)+1),\"1D\",30,\"終値\"),\"wait\")","v":"wait"},{"$f":"IF($A$8=1,_xll.SNT.StockHist(FALSE,INDEX($G$4:$ZZ$4,,COLUMN()-COLUMN($G$9)+1),\"1D\",30,\"終値\"),\"wait\")","v":"wait"},{"$f":"IF($A$8=1,_xll.SNT.StockHist(FALSE,INDEX($G$4:$ZZ$4,,COLUMN()-COLUMN($G$9)+1),\"1D\",30,\"終値\"),\"wait\")","v":"wait"},{"$f":"IF($A$8=1,_xll.SNT.StockHist(FALSE,INDEX($G$4:$ZZ$4,,COLUMN()-COLUMN($G$9)+1),\"1D\",30,\"終値\"),\"wait\")","v":"wait"},{"$f":"IF($A$8=1,_xll.SNT.StockHist(FALSE,INDEX($G$4:$ZZ$4,,COLUMN()-COLUMN($G$9)+1),\"1D\",30,\"終値\"),\"wait\")","v":"wait"},{"$f":"IF($A$8=1,_xll.SNT.StockHist(FALSE,INDEX($G$4:$ZZ$4,,COLUMN()-COLUMN($G$9)+1),\"1D\",30,\"終値\"),\"wait\")","v":"wait"},{"$f":"IF($A$8=1,_xll.SNT.StockHist(FALSE,INDEX($G$4:$ZZ$4,,COLUMN()-COLUMN($G$9)+1),\"1D\",30,\"終値\"),\"wait\")","v":"wait"},{"$f":"IF($A$8=1,_xll.SNT.StockHist(FALSE,INDEX($G$4:$ZZ$4,,COLUMN()-COLUMN($G$9)+1),\"1D\",30,\"終値\"),\"wait\")","v":"wait"},{"$f":"IF($A$8=1,_xll.SNT.StockHist(FALSE,INDEX($G$4:$ZZ$4,,COLUMN()-COLUMN($G$9)+1),\"1D\",30,\"終値\"),\"wait\")","v":"wait"},{"$f":"IF($A$8=1,_xll.SNT.StockHist(FALSE,INDEX($G$4:$ZZ$4,,COLUMN()-COLUMN($G$9)+1),\"1D\",30,\"終値\"),\"wait\")","v":"wait"},{"$f":"IF($A$8=1,_xll.SNT.StockHist(FALSE,INDEX($G$4:$ZZ$4,,COLUMN()-COLUMN($G$9)+1),\"1D\",30,\"終値\"),\"wait\")","v":"wait"},{"$f":"IF($A$8=1,_xll.SNT.StockHist(FALSE,INDEX($G$4:$ZZ$4,,COLUMN()-COLUMN($G$9)+1),\"1D\",30,\"終値\"),\"wait\")","v":"wait"},{"$f":"IF($A$8=1,_xll.SNT.StockHist(FALSE,INDEX($G$4:$ZZ$4,,COLUMN()-COLUMN($G$9)+1),\"1D\",30,\"終値\"),\"wait\")","v":"wait"},{"$f":"IF($A$8=1,_xll.SNT.StockHist(FALSE,INDEX($G$4:$ZZ$4,,COLUMN()-COLUMN($G$9)+1),\"1D\",30,\"終値\"),\"wait\")","v":"wait"},{"$f":"IF($A$8=1,_xll.SNT.StockHist(FALSE,INDEX($G$4:$ZZ$4,,COLUMN()-COLUMN($G$9)+1),\"1D\",30,\"終値\"),\"wait\")","v":"wait"},{"$f":"IF($A$8=1,_xll.SNT.StockHist(FALSE,INDEX($G$4:$ZZ$4,,COLUMN()-COLUMN($G$9)+1),\"1D\",30,\"終値\"),\"wait\")","v":"wait"},{"$f":"IF($A$8=1,_xll.SNT.StockHist(FALSE,INDEX($G$4:$ZZ$4,,COLUMN()-COLUMN($G$9)+1),\"1D\",30,\"終値\"),\"wait\")","v":"wait"},{"$f":"IF($A$8=1,_xll.SNT.StockHist(FALSE,INDEX($G$4:$ZZ$4,,COLUMN()-COLUMN($G$9)+1),\"1D\",30,\"終値\"),\"wait\")","v":"wait"},{"$f":"IF($A$8=1,_xll.SNT.StockHist(FALSE,INDEX($G$4:$ZZ$4,,COLUMN()-COLUMN($G$9)+1),\"1D\",30,\"終値\"),\"wait\")","v":"wait"},{"$f":"IF($A$8=1,_xll.SNT.StockHist(FALSE,INDEX($G$4:$ZZ$4,,COLUMN()-COLUMN($G$9)+1),\"1D\",30,\"終値\"),\"wait\")","v":"wait"},{"$f":"IF($A$8=1,_xll.SNT.StockHist(FALSE,INDEX($G$4:$ZZ$4,,COLUMN()-COLUMN($G$9)+1),\"1D\",30,\"終値\"),\"wait\")","v":"wait"},{"$f":"IF($A$8=1,_xll.SNT.StockHist(FALSE,INDEX($G$4:$ZZ$4,,COLUMN()-COLUMN($G$9)+1),\"1D\",30,\"終値\"),\"wait\")","v":"wait"},{"$f":"IF($A$8=1,_xll.SNT.StockHist(FALSE,INDEX($G$4:$ZZ$4,,COLUMN()-COLUMN($G$9)+1),\"1D\",30,\"終値\"),\"wait\")","v":"wait"},{"$f":"IF($A$8=1,_xll.SNT.StockHist(FALSE,INDEX($G$4:$ZZ$4,,COLUMN()-COLUMN($G$9)+1),\"1D\",30,\"終値\"),\"wait\")","v":"wait"},{"$f":"IF($A$8=1,_xll.SNT.StockHist(FALSE,INDEX($G$4:$ZZ$4,,COLUMN()-COLUMN($G$9)+1),\"1D\",30,\"終値\"),\"wait\")","v":"wait"},{"$f":"IF($A$8=1,_xll.SNT.StockHist(FALSE,INDEX($G$4:$ZZ$4,,COLUMN()-COLUMN($G$9)+1),\"1D\",30,\"終値\"),\"wait\")","v":"wait"},{"$f":"IF($A$8=1,_xll.SNT.StockHist(FALSE,INDEX($G$4:$ZZ$4,,COLUMN()-COLUMN($G$9)+1),\"1D\",30,\"終値\"),\"wait\")","v":"wait"},{"$f":"IF($A$8=1,_xll.SNT.StockHist(FALSE,INDEX($G$4:$ZZ$4,,COLUMN()-COLUMN($G$9)+1),\"1D\",30,\"終値\"),\"wait\")","v":"wait"},{"$f":"IF($A$8=1,_xll.SNT.StockHist(FALSE,INDEX($G$4:$ZZ$4,,COLUMN()-COLUMN($G$9)+1),\"1D\",30,\"終値\"),\"wait\")","v":"wait"},{"$f":"IF($A$8=1,_xll.SNT.StockHist(FALSE,INDEX($G$4:$ZZ$4,,COLUMN()-COLUMN($G$9)+1),\"1D\",30,\"終値\"),\"wait\")","v":"wait"},{"$f":"IF($A$8=1,_xll.SNT.StockHist(FALSE,INDEX($G$4:$ZZ$4,,COLUMN()-COLUMN($G$9)+1),\"1D\",30,\"終値\"),\"wait\")","v":"wait"},{"$f":"IF($A$8=1,_xll.SNT.StockHist(FALSE,INDEX($G$4:$ZZ$4,,COLUMN()-COLUMN($G$9)+1),\"1D\",30,\"終値\"),\"wait\")","v":"wait"},{"$f":"IF($A$8=1,_xll.SNT.StockHist(FALSE,INDEX($G$4:$ZZ$4,,COLUMN()-COLUMN($G$9)+1),\"1D\",30,\"終値\"),\"wait\")","v":"wait"},{"$f":"IF($A$8=1,_xll.SNT.StockHist(FALSE,INDEX($G$4:$ZZ$4,,COLUMN()-COLUMN($G$9)+1),\"1D\",30,\"終値\"),\"wait\")","v":"wait"},{"$f":"IF($A$8=1,_xll.SNT.StockHist(FALSE,INDEX($G$4:$ZZ$4,,COLUMN()-COLUMN($G$9)+1),\"1D\",30,\"終値\"),\"wait\")","v":"wait"},{"$f":"IF($A$8=1,_xll.SNT.StockHist(FALSE,INDEX($G$4:$ZZ$4,,COLUMN()-COLUMN($G$9)+1),\"1D\",30,\"終値\"),\"wait\")","v":"wait"},{"$f":"IF($A$8=1,_xll.SNT.StockHist(FALSE,INDEX($G$4:$ZZ$4,,COLUMN()-COLUMN($G$9)+1),\"1D\",30,\"終値\"),\"wait\")","v":"wait"},{"$f":"IF($A$8=1,_xll.SNT.StockHist(FALSE,INDEX($G$4:$ZZ$4,,COLUMN()-COLUMN($G$9)+1),\"1D\",30,\"終値\"),\"wait\")","v":"wait"},{"$f":"IF($A$8=1,_xll.SNT.StockHist(FALSE,INDEX($G$4:$ZZ$4,,COLUMN()-COLUMN($G$9)+1),\"1D\",30,\"終値\"),\"wait\")","v":"wait"},{"$f":"IF($A$8=1,_xll.SNT.StockHist(FALSE,INDEX($G$4:$ZZ$4,,COLUMN()-COLUMN($G$9)+1),\"1D\",30,\"終値\"),\"wait\")","v":"wait"},{"$f":"IF($A$8=1,_xll.SNT.StockHist(FALSE,INDEX($G$4:$ZZ$4,,COLUMN()-COLUMN($G$9)+1),\"1D\",30,\"終値\"),\"wait\")","v":"wait"},{"$f":"IF($A$8=1,_xll.SNT.StockHist(FALSE,INDEX($G$4:$ZZ$4,,COLUMN()-COLUMN($G$9)+1),\"1D\",30,\"終値\"),\"wait\")","v":"wait"},{"$f":"IF($A$8=1,_xll.SNT.StockHist(FALSE,INDEX($G$4:$ZZ$4,,COLUMN()-COLUMN($G$9)+1),\"1D\",30,\"終値\"),\"wait\")","v":"wait"},{"$f":"IF($A$8=1,_xll.SNT.StockHist(FALSE,INDEX($G$4:$ZZ$4,,COLUMN()-COLUMN($G$9)+1),\"1D\",30,\"終値\"),\"wait\")","v":"wait"},{"$f":"IF($A$8=1,_xll.SNT.StockHist(FALSE,INDEX($G$4:$ZZ$4,,COLUMN()-COLUMN($G$9)+1),\"1D\",30,\"終値\"),\"wait\")","v":"wait"},{"$f":"IF($A$8=1,_xll.SNT.StockHist(FALSE,INDEX($G$4:$ZZ$4,,COLUMN()-COLUMN($G$9)+1),\"1D\",30,\"終値\"),\"wait\")","v":"wait"},{"$f":"IF($A$8=1,_xll.SNT.StockHist(FALSE,INDEX($G$4:$ZZ$4,,COLUMN()-COLUMN($G$9)+1),\"1D\",30,\"終値\"),\"wait\")","v":"wait"},{"$f":"IF($A$8=1,_xll.SNT.StockHist(FALSE,INDEX($G$4:$ZZ$4,,COLUMN()-COLUMN($G$9)+1),\"1D\",30,\"終値\"),\"wait\")","v":"wait"},{"$f":"IF($A$8=1,_xll.SNT.StockHist(FALSE,INDEX($G$4:$ZZ$4,,COLUMN()-COLUMN($G$9)+1),\"1D\",30,\"終値\"),\"wait\")","v":"wait"},{"$f":"IF($A$8=1,_xll.SNT.StockHist(FALSE,INDEX($G$4:$ZZ$4,,COLUMN()-COLUMN($G$9)+1),\"1D\",30,\"終値\"),\"wait\")","v":"wait"},{"$f":"IF($A$8=1,_xll.SNT.StockHist(FALSE,INDEX($G$4:$ZZ$4,,COLUMN()-COLUMN($G$9)+1),\"1D\",30,\"終値\"),\"wait\")","v":"wait"},{"$f":"IF($A$8=1,_xll.SNT.StockHist(FALSE,INDEX($G$4:$ZZ$4,,COLUMN()-COLUMN($G$9)+1),\"1D\",30,\"終値\"),\"wait\")","v":"wait"},{"$f":"IF($A$8=1,_xll.SNT.StockHist(FALSE,INDEX($G$4:$ZZ$4,,COLUMN()-COLUMN($G$9)+1),\"1D\",30,\"終値\"),\"wait\")","v":"wait"},{"$f":"IF($A$8=1,_xll.SNT.StockHist(FALSE,INDEX($G$4:$ZZ$4,,COLUMN()-COLUMN($G$9)+1),\"1D\",30,\"終値\"),\"wait\")","v":"wait"},{"$f":"IF($A$8=1,_xll.SNT.StockHist(FALSE,INDEX($G$4:$ZZ$4,,COLUMN()-COLUMN($G$9)+1),\"1D\",30,\"終値\"),\"wait\")","v":"wait"},{"$f":"IF($A$8=1,_xll.SNT.StockHist(FALSE,INDEX($G$4:$ZZ$4,,COLUMN()-COLUMN($G$9)+1),\"1D\",30,\"終値\"),\"wait\")","v":"wait"},{"$f":"IF($A$8=1,_xll.SNT.StockHist(FALSE,INDEX($G$4:$ZZ$4,,COLUMN()-COLUMN($G$9)+1),\"1D\",30,\"終値\"),\"wait\")","v":"wait"},{"$f":"IF($A$8=1,_xll.SNT.StockHist(FALSE,INDEX($G$4:$ZZ$4,,COLUMN()-COLUMN($G$9)+1),\"1D\",30,\"終値\"),\"wait\")","v":"wait"},{"$f":"IF($A$8=1,_xll.SNT.StockHist(FALSE,INDEX($G$4:$ZZ$4,,COLUMN()-COLUMN($G$9)+1),\"1D\",30,\"終値\"),\"wait\")","v":"wait"},{"$f":"IF($A$8=1,_xll.SNT.StockHist(FALSE,INDEX($G$4:$ZZ$4,,COLUMN()-COLUMN($G$9)+1),\"1D\",30,\"終値\"),\"wait\")","v":"wait"},{"$f":"IF($A$8=1,_xll.SNT.StockHist(FALSE,INDEX($G$4:$ZZ$4,,COLUMN()-COLUMN($G$9)+1),\"1D\",30,\"終値\"),\"wait\")","v":"wait"},{"$f":"IF($A$8=1,_xll.SNT.StockHist(FALSE,INDEX($G$4:$ZZ$4,,COLUMN()-COLUMN($G$9)+1),\"1D\",30,\"終値\"),\"wait\")","v":"wait"},{"$f":"IF($A$8=1,_xll.SNT.StockHist(FALSE,INDEX($G$4:$ZZ$4,,COLUMN()-COLUMN($G$9)+1),\"1D\",30,\"終値\"),\"wait\")","v":"wait"},{"$f":"IF($A$8=1,_xll.SNT.StockHist(FALSE,INDEX($G$4:$ZZ$4,,COLUMN()-COLUMN($G$9)+1),\"1D\",30,\"終値\"),\"wait\")","v":"wait"},{"$f":"IF($A$8=1,_xll.SNT.StockHist(FALSE,INDEX($G$4:$ZZ$4,,COLUMN()-COLUMN($G$9)+1),\"1D\",30,\"終値\"),\"wait\")","v":"wait"},{"$f":"IF($A$8=1,_xll.SNT.StockHist(FALSE,INDEX($G$4:$ZZ$4,,COLUMN()-COLUMN($G$9)+1),\"1D\",30,\"終値\"),\"wait\")","v":"wait"},{"$f":"IF($A$8=1,_xll.SNT.StockHist(FALSE,INDEX($G$4:$ZZ$4,,COLUMN()-COLUMN($G$9)+1),\"1D\",30,\"終値\"),\"wait\")","v":"wait"}]
[null,null,null,30]
[null,null,null,29]
[null,null,null,28]
[null,null,null,27]
[null,null,null,26]
[null,null,null,25]
[null,null,null,24]
[null,null,null,23]
[null,null,null,22]
[null,null,null,21]
[null,null,null,20]
[null,null,null,19]
[null,null,null,18]
[null,null,null,17]
[null,null,null,16]
[null,null,null,15]
[null,null,null,14]
[null,null,null,13]
[null,null,null,12]
[null,null,null,11]
[null,null,null,10]
[null,null,null,9]
[null,null,null,8]
[null,null,null,7]
[null,null,null,6]
[null,null,null,5]
[null,null,null,4]
[null,null,null,3]
[null,null,null,2]
[null,null,null,1]

{"sheet":"バックテストデータ_5D_5Y","index":2,"n_rows":1562,"n_cols":9,"rows_kept":1562,"cut":false,"hidden":false,"merged":[]}
[]
["＃","銘柄コード","銘柄名","BB＋2σ 勝率","BB＋2σ 平均変化率","BB＋2σ 勝敗","BB-2σ 勝率","BB-2σ 平均変化率","BB-2σ 勝敗"]
[{"$f":"ROW()-2","v":1},1301,"極洋",0.5393,-2.18E-2,"48勝41敗",0.65710000000000002,2.6800000000000001E-2,"23勝12敗"]
[{"$f":"ROW()-2","v":2},1332,"ニッスイ",0.54790000000000005,-2.8000000000000001E-2,"40勝33敗",0.56520000000000004,3.3000000000000002E-2,"26勝20敗"]
[3,1333,"マルハニチロ",0.57579999999999998,-1.6199999999999999E-2,"38勝28敗",0.61019999999999996,2.4E-2,"36勝23敗"]
[4,1377,"サカタのタネ",0.65,-2.7900000000000001E-2,"39勝21敗",0.45610000000000001,4.0899999999999999E-2,"26勝31敗"]
[5,1379,"ホクト",0.60709999999999997,-1.44E-2,"34勝22敗",0.47539999999999999,1.47E-2,"29勝32敗"]
[6,1414,"ショーボンドホールディングス",0.55220000000000002,-2.1700000000000001E-2,"37勝30敗",0.4839,2.2499999999999999E-2,"30勝32敗"]
[7,1417,"ミライト・ワン",0.47189999999999999,-2.12E-2,"42勝47敗",0.5484,2.6499999999999999E-2,"34勝28敗"]
[8,1419,"タマホーム",0.54120000000000001,-4.6699999999999998E-2,"46勝39敗",0.48980000000000001,3.0099999999999998E-2,"24勝25敗"]
[9,1429,"日本アクア",0.5,-4.3900000000000002E-2,"30勝30敗",0.61819999999999997,3.5000000000000003E-2,"34勝21敗"]
[10,1433,"ベステラ",0.63929999999999998,-4.9700000000000001E-2,"39勝22敗",0.52310000000000001,5.3499999999999999E-2,"34勝31敗"]
[11,1515,"日鉄鉱業",0.6,-4.1799999999999997E-2,"45勝30敗",0.52380000000000004,3.5700000000000003E-2,"33勝30敗"]
[12,1518,"三井松島ホールディングス",0.49330000000000002,-5.33E-2,"37勝38敗",0.48330000000000001,5.74E-2,"29勝31敗"]
[13,1605,"ＩＮＰＥＸ",0.5595,-3.8399999999999997E-2,"47勝37敗",0.56920000000000004,3.8699999999999998E-2,"37勝28敗"]
[14,1662,"石油資源開発",0.45779999999999998,-3.0700000000000002E-2,"38勝45敗",0.49120000000000003,0.04,"28勝29敗"]
[15,1663,"Ｋ＆Ｏエナジーグループ",0.62649999999999995,-3.8300000000000001E-2,"52勝31敗",0.45240000000000002,4.24E-2,"19勝23敗"]
[16,1719,"安藤・間",0.45069999999999999,-2.6800000000000001E-2,"32勝39敗",0.64149999999999996,3.6799999999999999E-2,"34勝19敗"]
[17,1720,"東急建設",0.45979999999999999,-2.58E-2,"40勝47敗",0.57410000000000005,2.0799999999999999E-2,"31勝23敗"]
[18,1721,"コムシスホールディングス",0.55710000000000004,-2.3400000000000001E-2,"39勝31敗",0.57689999999999997,3.4200000000000001E-2,"30勝22敗"]
[19,1726,"ビーアールホールディングス",0.44619999999999999,-2.7300000000000001E-2,"29勝36敗",0.51470000000000005,3.6700000000000003E-2,"35勝33敗"]
[20,1762,"高松コンストラクショングループ",0.57889999999999997,-2.2700000000000001E-2,"44勝32敗",0.44900000000000001,2.6100000000000002E-2,"22勝27敗"]
[21,1766,"東建コーポレーション",0.40699999999999997,-1.8700000000000001E-2,"35勝51敗",0.52939999999999998,3.5999999999999997E-2,"27勝24敗"]
[22,1780,"ヤマウラ",0.45650000000000002,-1.66E-2,"42勝50敗",0.60780000000000001,2.58E-2,"31勝20敗"]
[23,1801,"大成建設",0.52170000000000005,-3.0200000000000001E-2,"36勝33敗",0.7077,3.3099999999999997E-2,"46勝19敗"]
[24,1802,"大林組",0.4667,-2.41E-2,"35勝40敗",0.59089999999999998,2.7699999999999999E-2,"26勝18敗"]
[25,1803,"清水建設",0.64859999999999995,-3.2599999999999997E-2,"48勝26敗",0.50880000000000003,2.5499999999999998E-2,"29勝28敗"]
[26,1808,"長谷工コーポレーション",0.47060000000000002,-1.95E-2,"32勝36敗",0.69389999999999996,3.1300000000000001E-2,"34勝15敗"]
[27,1812,"鹿島建設",0.45069999999999999,-2.3800000000000002E-2,"32勝39敗",0.64810000000000001,3.5700000000000003E-2,"35勝19敗"]
[28,1813,"不動テトラ",0.40629999999999999,-2.4299999999999999E-2,"26勝38敗",0.52829999999999999,2.23E-2,"28勝25敗"]
[29,1814,"大末建設",0.37680000000000002,-1.9199999999999998E-2,"26勝43敗",0.47270000000000001,2.7699999999999999E-2,"26勝29敗"]
[30,1815,"鉄建建設",0.49280000000000002,-1.9300000000000001E-2,"34勝35敗",0.57999999999999996,2.8799999999999999E-2,"29勝21敗"]
[31,1820,"西松建設",0.4819,-2.5399999999999999E-2,"40勝43敗",0.60419999999999996,2.52E-2,"29勝19敗"]
[32,1821,"三井住友建設",0.62690000000000001,-2.47E-2,"42勝25敗",0.52170000000000005,2.47E-2,"24勝22敗"]
[33,1833,"奥村組",0.52700000000000002,-0.02,"39勝35敗",0.52270000000000005,1.9300000000000001E-2,"23勝21敗"]
[34,1835,"東鉄工業",0.7,-2.1899999999999999E-2,"42勝18敗",0.54900000000000004,3.0200000000000001E-2,"28勝23敗"]
[35,1852,"淺沼組",0.3977,-2.06E-2,"35勝53敗",0.61109999999999998,2.3699999999999999E-2,"33勝21敗"]
[36,1860,"戸田建設",0.4783,-2.1399999999999999E-2,"33勝36敗",0.52270000000000005,4.6600000000000003E-2,"23勝21敗"]
[37,1861,"熊谷組",0.52939999999999998,-2.3300000000000001E-2,"36勝32敗",0.63270000000000004,2.41E-2,"31勝18敗"]
[38,1870,"矢作建設工業",0.57969999999999999,-3.0099999999999998E-2,"40勝29敗",0.51019999999999999,4.5199999999999997E-2,"25勝24敗"]
[39,1871,"ピーエス・コンストラクション",0.44740000000000002,-2.2100000000000002E-2,"34勝42敗",0.63039999999999996,2.18E-2,"29勝17敗"]
[40,1873,"日本ハウスホールディングス",0.58460000000000001,-2.86E-2,"38勝27敗",0.54759999999999998,3.9899999999999998E-2,"46勝38敗"]
[41,1878,"大東建託",0.56759999999999999,-2.87E-2,"42勝32敗",0.40910000000000002,2.7300000000000001E-2,"18勝26敗"]
[42,1879,"新日本建設",0.56940000000000002,-3.49E-2,"41勝31敗",0.63829999999999998,3.56E-2,"30勝17敗"]
[43,1882,"東亜道路工業",0.37930000000000003,-2.3599999999999999E-2,"33勝54敗",0.47220000000000001,5.3499999999999999E-2,"17勝19敗"]
[44,1884,"日本道路",0.51949999999999996,-3.0599999999999999E-2,"40勝37敗",0.5,3.73E-2,"35勝35敗"]
[45,1885,"東亜建設工業",0.5464,-2.4799999999999999E-2,"53勝44敗",0.65849999999999997,4.0800000000000003E-2,"27勝14敗"]
[46,1887,"日本国土開発",0.49230000000000002,-3.0099999999999998E-2,"32勝33敗",0.59419999999999995,2.3599999999999999E-2,"41勝28敗"]
[47,1888,"若築建設",0.5,-3.6700000000000003E-2,"51勝51敗",0.53659999999999997,3.5200000000000002E-2,"22勝19敗"]
[48,1890,"東洋建設",0.3947,-2.4500000000000001E-2,"30勝46敗",0.55100000000000005,3.1E-2,"27勝22敗"]
[49,1893,"五洋建設",0.47370000000000001,-3.2599999999999997E-2,"36勝40敗",0.52859999999999996,2.9899999999999999E-2,"37勝33敗"]
[50,1898,"世紀東急工業",0.46250000000000002,-2.0199999999999999E-2,"37勝43敗",0.6724,2.9499999999999998E-2,"39勝19敗"]
[51,1899,"福田組",0.63080000000000003,-3.2000000000000001E-2,"41勝24敗",0.57630000000000003,2.8400000000000002E-2,"34勝25敗"]
[52,1911,"住友林業",0.39079999999999998,-2.6200000000000001E-2,"34勝53敗",0.61429999999999996,3.7900000000000003E-2,"43勝27敗"]
[53,1925,"大和ハウス工業",0.55379999999999996,-3.0300000000000001E-2,"36勝29敗",0.6512,3.3399999999999999E-2,"28勝15敗"]
[54,1926,"ライト工業",0.54169999999999996,-2.1700000000000001E-2,"39勝33敗",0.56520000000000004,2.18E-2,"26勝20敗"]
[55,1928,"積水ハウス",0.52629999999999999,-2.1299999999999999E-2,"40勝36敗",0.51849999999999996,3.5200000000000002E-2,"28勝26敗"]
[56,1929,"日特建設",0.4783,-2.1399999999999999E-2,"33勝36敗",0.63270000000000004,2.0199999999999999E-2,"31勝18敗"]
[57,1930,"北陸電気工事",0.61970000000000003,-3.9699999999999999E-2,"44勝27敗",0.5333,2.76E-2,"24勝21敗"]
[58,1934,"ユアテック",0.625,-3.9600000000000003E-2,"45勝27敗",0.65,3.39E-2,"26勝14敗"]
[59,1938,"日本リーテック",0.55559999999999998,-4.5100000000000001E-2,"35勝28敗",0.62119999999999997,4.5699999999999998E-2,"41勝25敗"]
[60,1939,"四電工",0.41589999999999999,-2.5899999999999999E-2,"47勝66敗",0.62,3.4799999999999998E-2,"31勝19敗"]
[61,1941,"中電工",0.59550000000000003,-2.46E-2,"53勝36敗",0.55259999999999998,2.3099999999999999E-2,"21勝17敗"]
[62,1942,"関電工",0.55130000000000001,-2.7400000000000001E-2,"43勝35敗",0.41860000000000003,2.9100000000000001E-2,"18勝25敗"]
[63,1944,"きんでん",0.47499999999999998,-2.0299999999999999E-2,"38勝42敗",0.5,2.5999999999999999E-2,"29勝29敗"]
[64,1945,"東京エネシス",0.67159999999999997,-4.1200000000000001E-2,"45勝22敗",0.6522,3.9699999999999999E-2,"30勝16敗"]
[65,1946,"トーエネック",0.52780000000000005,-3.73E-2,"38勝34敗",0.52539999999999998,3.3300000000000003E-2,"31勝28敗"]
[{"$f":"ROW()-2","v":66},1949,"住友電設",0.41889999999999999,-3.27E-2,"31勝43敗",0.47370000000000001,3.6799999999999999E-2,"27勝30敗"]
[67,1950,"日本電設工業",0.6,-2.8000000000000001E-2,"45勝30敗",0.50880000000000003,2.92E-2,"29勝28敗"]
[68,1951,"エクシオグループ",0.62670000000000003,-2.1000000000000001E-2,"47勝28敗",0.66100000000000003,2.5999999999999999E-2,"39勝20敗"]
[69,1952,"新日本空調",0.4778,-3.2300000000000002E-2,"43勝47敗",0.55320000000000003,4.1200000000000001E-2,"26勝21敗"]
[70,1959,"九電工",0.54690000000000005,-3.1300000000000001E-2,"35勝29敗",0.56759999999999999,4.3900000000000002E-2,"21勝16敗"]
[71,1961,"三機工業",0.52690000000000003,-1.6E-2,"49勝44敗",0.70830000000000004,2.5999999999999999E-2,"34勝14敗"]
[72,1963,"日揮ホールディングス",0.623,-3.6799999999999999E-2,"38勝23敗",0.59379999999999999,3.5200000000000002E-2,"38勝26敗"]
[73,1964,"中外炉工業",0.49430000000000002,-3.7499999999999999E-2,"43勝44敗",0.57450000000000001,4.4999999999999998E-2,"27勝20敗"]
[74,1968,"太平電業",0.49380000000000002,-2.9899999999999999E-2,"40勝41敗",0.6,4.3299999999999998E-2,"21勝14敗"]
[75,1969,"高砂熱学工業",0.33329999999999999,-2.1700000000000001E-2,"35勝70敗",0.5,2.9700000000000001E-2,"19勝19敗"]
[76,1975,"朝日工業社",0.4667,-3.85E-2,"35勝40敗",0.53520000000000001,3.7400000000000003E-2,"38勝33敗"]
[77,1976,"明星工業",0.64039999999999997,-3.1899999999999998E-2,"57勝32敗",0.47499999999999998,2.9499999999999998E-2,"19勝21敗"]
[78,1979,"大気社",0.6774,-3.1E-2,"42勝20敗",0.55169999999999997,3.5700000000000003E-2,"16勝13敗"]
[79,1980,"ダイダン",0.46150000000000002,-2.7E-2,"36勝42敗",0.66039999999999999,4.0500000000000001E-2,"35勝18敗"]
[80,1982,"日比谷総合設備",0.6119,-3.1899999999999998E-2,"41勝26敗",0.52629999999999999,2.7300000000000001E-2,"20勝18敗"]
[81,2001,"ニップン",0.57140000000000002,-1.7899999999999999E-2,"36勝27敗",0.52380000000000004,2.4899999999999999E-2,"22勝20敗"]
[82,2002,"日清製粉グループ本社",0.58460000000000001,-2.41E-2,"38勝27敗",0.47299999999999998,1.66E-2,"35勝39敗"]
[83,2004,"昭和産業",0.64180000000000004,-1.6899999999999998E-2,"43勝24敗",0.60319999999999996,1.9800000000000002E-2,"38勝25敗"]
[84,2053,"中部飼料",0.56859999999999999,-2.7900000000000001E-2,"29勝22敗",0.53569999999999995,3.73E-2,"30勝26敗"]
[85,2060,"フィード・ワン",0.58930000000000005,-2.8500000000000001E-2,"33勝23敗",0.66069999999999995,2.69E-2,"37勝19敗"]
[86,2108,"日本甜菜製糖",0.58440000000000003,-2.7699999999999999E-2,"45勝32敗",0.57779999999999998,3.4799999999999998E-2,"26勝19敗"]
[87,2109,"ＤＭ三井製糖ホールディングス",0.47760000000000002,-1.9099999999999999E-2,"32勝35敗",0.46550000000000002,1.9599999999999999E-2,"27勝31敗"]
[88,2117,"ウェルネオシュガー",0.45710000000000001,-2.0799999999999999E-2,"32勝38敗",0.71109999999999995,2.98E-2,"32勝13敗"]
[89,2120,"ＬＩＦＵＬＬ",0.37740000000000001,-5.8599999999999999E-2,"20勝33敗",0.55879999999999996,3.8600000000000002E-2,"38勝30敗"]
[90,2121,"ＭＩＸＩ",0.5181,-3.2899999999999999E-2,"43勝40敗",0.49230000000000002,4.7199999999999999E-2,"32勝33敗"]
[91,2124,"ジェイエイシーリクルートメント",0.43330000000000002,-3.5499999999999997E-2,"26勝34敗",0.57889999999999997,3.1300000000000001E-2,"44勝32敗"]
[92,2127,"日本Ｍ＆Ａセンターホールディングス",0.50770000000000004,-6.9699999999999998E-2,"33勝32敗",0.58899999999999997,5.5899999999999998E-2,"43勝30敗"]
[93,2130,"メンバーズ",0.56899999999999995,-4.9299999999999997E-2,"33勝25敗",0.52170000000000005,8.1100000000000005E-2,"36勝33敗"]
[94,2146,"ＵＴグループ",0.58819999999999995,-4.2799999999999998E-2,"30勝21敗",0.52,7.6799999999999993E-2,"39勝36敗"]
[95,2148,"アイティメディア",0.5645,-4.4900000000000002E-2,"35勝27敗",0.56720000000000004,3.49E-2,"38勝29敗"]
[96,2150,"ケアネット",0.53620000000000001,-6.2399999999999997E-2,"37勝32敗",0.4909,9.8500000000000004E-2,"27勝28敗"]
[97,2153,"Ｅ・Ｊホールディングス",0.47060000000000002,-3.0099999999999998E-2,"32勝36敗",0.57499999999999996,2.3900000000000001E-2,"23勝17敗"]
[98,2154,"オープンアップグループ",0.4783,-4.9099999999999998E-2,"33勝36敗",0.6744,4.48E-2,"29勝14敗"]
[99,2157,"コシダカホールディングス",0.55289999999999995,-4.8500000000000001E-2,"47勝38敗",0.58699999999999997,5.5599999999999997E-2,"27勝19敗"]
[100,2163,"アルトナー",0.4556,-3.6299999999999999E-2,"41勝49敗",0.58179999999999998,3.6299999999999999E-2,"32勝23敗"]
[101,2168,"パソナグループ",0.45,-2.5999999999999999E-2,"27勝33敗",0.41789999999999999,3.04E-2,"28勝39敗"]
[102,2170,"リンクアンドモチベーション",0.41110000000000002,-5.4699999999999999E-2,"37勝53敗",0.5806,6.3399999999999998E-2,"36勝26敗"]
[103,2175,"エス・エム・エス",0.54759999999999998,-4.1099999999999998E-2,"23勝19敗",0.51249999999999996,4.2299999999999997E-2,"41勝39敗"]
[104,2181,"パーソルホールディングス",0.6119,-4.1599999999999998E-2,"41勝26敗",0.61429999999999996,4.8899999999999999E-2,"43勝27敗"]
[105,2198,"アイ・ケイ・ケイホールディングス",0.5,-2.3199999999999998E-2,"34勝34敗",0.60609999999999997,3.8899999999999997E-2,"40勝26敗"]
[106,2201,"森永製菓",0.38569999999999999,-2.29E-2,"27勝43敗",0.69810000000000005,2.86E-2,"37勝16敗"]
[107,2206,"江崎グリコ",0.625,-2.1600000000000001E-2,"40勝24敗",0.60780000000000001,3.6400000000000002E-2,"31勝20敗"]
[108,2207,"名糖産業",0.52380000000000004,-1.44E-2,"44勝40敗",0.61819999999999997,2.6700000000000002E-2,"34勝21敗"]
[109,2209,"井村屋グループ",0.7581,-0.02,"47勝15敗",0.66,2.1600000000000001E-2,"33勝17敗"]
[110,2211,"不二家",0.5,-1.5599999999999999E-2,"32勝32敗",0.67269999999999996,1.7000000000000001E-2,"37勝18敗"]
[111,2212,"山崎製パン",0.47499999999999998,-3.3099999999999997E-2,"38勝42敗",0.59379999999999999,3.9E-2,"38勝26敗"]
[112,2217,"モロゾフ",0.51849999999999996,-2.1000000000000001E-2,"42勝39敗",0.53569999999999995,2.35E-2,"30勝26敗"]
[113,2220,"亀田製菓",0.66669999999999996,-2.0199999999999999E-2,"36勝18敗",0.67800000000000005,2.2100000000000002E-2,"40勝19敗"]
[114,2222,"寿スピリッツ",0.53029999999999999,-3.8800000000000001E-2,"35勝31敗",0.5091,4.3499999999999997E-2,"28勝27敗"]
[115,2229,"カルビー",0.5373,-2.7300000000000001E-2,"36勝31敗",0.61699999999999999,1.9699999999999999E-2,"29勝18敗"]
[116,2264,"森永乳業",0.5181,-5.5599999999999997E-2,"43勝40敗",0.56140000000000001,2.7400000000000001E-2,"32勝25敗"]
[117,2266,"六甲バター",0.54900000000000004,-2.1600000000000001E-2,"28勝23敗",0.58930000000000005,2.9000000000000001E-2,"33勝23敗"]
[118,2267,"ヤクルト本社",0.63490000000000002,-3.32E-2,"40勝23敗",0.69489999999999996,3.2399999999999998E-2,"41勝18敗"]
[119,2269,"明治ホールディングス",0.47060000000000002,-2.3800000000000002E-2,"24勝27敗",0.67859999999999998,1.77E-2,"38勝18敗"]
[120,2270,"雪印メグミルク",0.56059999999999999,-2.6599999999999999E-2,"37勝29敗",0.46879999999999999,1.9900000000000001E-2,"30勝34敗"]
[121,2281,"プリマハム",0.55130000000000001,-4.7300000000000002E-2,"43勝35敗",0.51429999999999998,3.4700000000000002E-2,"36勝34敗"]
[122,2282,"日本ハム",0.42420000000000002,-2.0199999999999999E-2,"28勝38敗",0.63490000000000002,2.63E-2,"40勝23敗"]
[123,2288,"丸大食品",0.5333,-2.9399999999999999E-2,"32勝28敗",0.36730000000000002,3.1899999999999998E-2,"18勝31敗"]
[124,2292,"エスフーズ",0.59460000000000002,-3.3099999999999997E-2,"44勝30敗",0.46300000000000002,2.5000000000000001E-2,"25勝29敗"]
[125,2294,"柿安本店",0.46839999999999998,-1.9E-2,"37勝42敗",0.45829999999999999,1.7999999999999999E-2,"22勝26敗"]
[126,2296,"伊藤ハム米久ホールディングス",0.6,-3.8800000000000001E-2,"54勝36敗",0.53059999999999996,2.35E-2,"26勝23敗"]
[127,2301,"学情",0.48280000000000001,-3.1300000000000001E-2,"42勝45敗",0.52829999999999999,3.2000000000000001E-2,"28勝25敗"]
[128,2305,"スタジオアリス",0.57889999999999997,-2.0199999999999999E-2,"33勝24敗",0.57140000000000002,2.6100000000000002E-2,"32勝24敗"]
[129,2307,"クロスキャット",0.60489999999999999,-6.1400000000000003E-2,"49勝32敗",0.44440000000000002,3.3099999999999997E-2,"16勝20敗"]
[{"$f":"ROW()-2","v":130},2317,"システナ",0.44869999999999999,-2.4799999999999999E-2,"35勝43敗",0.46379999999999999,3.2800000000000003E-2,"32勝37敗"]
[131,2325,"ＮＪＳ",0.46910000000000002,-2.6499999999999999E-2,"38勝43敗",0.6,3.9100000000000003E-2,"39勝26敗"]
[132,2326,"デジタルアーツ",0.5,-3.1800000000000002E-2,"27勝27敗",0.41889999999999999,7.2300000000000003E-2,"31勝43敗"]
[133,2327,"日鉄ソリューションズ",0.39760000000000001,-2.8199999999999999E-2,"33勝50敗",0.42309999999999998,4.6800000000000001E-2,"22勝30敗"]
[134,2331,"綜合警備保障",0.62,-2.8400000000000002E-2,"31勝19敗",0.53849999999999998,3.9600000000000003E-2,"28勝24敗"]
[135,2335,"キューブシステム",0.64290000000000003,-3.1899999999999998E-2,"45勝25敗",0.62709999999999999,3.09E-2,"37勝22敗"]
[136,2337,"いちご",0.51670000000000005,-3.4700000000000002E-2,"31勝29敗",0.50670000000000004,4.6300000000000001E-2,"38勝37敗"]
[137,2353,"日本駐車場開発",0.41789999999999999,-3.6200000000000003E-2,"28勝39敗",0.61639999999999995,4.3900000000000002E-2,"45勝28敗"]
[138,2359,"コア",0.62319999999999998,-2.3199999999999998E-2,"43勝26敗",0.8125,3.5000000000000003E-2,"39勝9敗"]
[139,2371,"カカクコム",0.5161,-4.7899999999999998E-2,"32勝30敗",0.55559999999999998,6.0699999999999997E-2,"40勝32敗"]
[140,2374,"セントケア・ホールディング",0.59699999999999998,-3.9E-2,"40勝27敗",0.41070000000000001,3.1800000000000002E-2,"23勝33敗"]
[141,2378,"ルネサンス",0.55320000000000003,-3.8600000000000002E-2,"26勝21敗",0.58209999999999995,4.0800000000000003E-2,"39勝28敗"]
[142,2379,"ディップ",0.6552,-3.4299999999999997E-2,"38勝20敗",0.55559999999999998,4.8399999999999999E-2,"40勝32敗"]
[143,2384,"ＳＢＳホールディングス",0.5806,-5.5300000000000002E-2,"36勝26敗",0.53420000000000001,3.5499999999999997E-2,"39勝34敗"]
[144,2389,"デジタルホールディングス",0.52380000000000004,-3.4500000000000003E-2,"33勝30敗",0.46970000000000001,3.6299999999999999E-2,"31勝35敗"]
[145,2395,"新日本科学",0.50600000000000001,-6.1400000000000003E-2,"42勝41敗",0.56410000000000005,4.4699999999999997E-2,"22勝17敗"]
[146,2410,"キャリアデザインセンター",0.58750000000000002,-4.7800000000000002E-2,"47勝33敗",0.54549999999999998,4.58E-2,"30勝25敗"]
[147,2413,"エムスリー",0.52,-0.04,"26勝24敗",0.34179999999999999,4.4699999999999997E-2,"27勝52敗"]
[148,2429,"ワールドホールディングス",0.47460000000000002,-2.8799999999999999E-2,"28勝31敗",0.42859999999999998,3.4099999999999998E-2,"30勝40敗"]
[149,2432,"ディー・エヌ・エー",0.52729999999999999,-3.9100000000000003E-2,"29勝26敗",0.55740000000000001,5.5899999999999998E-2,"34勝27敗"]
[150,2433,"博報堂ＤＹホールディングス",0.4667,-2.6200000000000001E-2,"28勝32敗",0.44,3.5200000000000002E-2,"33勝42敗"]
[151,2440,"ぐるなび",0.63460000000000005,-5.1299999999999998E-2,"33勝19敗",0.53090000000000004,4.2900000000000001E-2,"43勝38敗"]
[152,2445,"タカミヤ",0.52380000000000004,-3.9600000000000003E-2,"33勝30敗",0.54549999999999998,3.3700000000000001E-2,"30勝25敗"]
[153,2461,"ファンコミュニケーションズ",0.6,-2.4400000000000002E-2,"33勝22敗",0.60660000000000003,1.9E-2,"37勝24敗"]
[154,2462,"ライク",0.7167,-4.2299999999999997E-2,"43勝17敗",0.4098,3.5000000000000003E-2,"25勝36敗"]
[155,2471,"エスプール",0.45,-4.24E-2,"27勝33敗",0.4844,3.9E-2,"31勝33敗"]
[156,2475,"ＷＤＢホールディングス",0.52080000000000004,-3.0700000000000002E-2,"25勝23敗",0.5484,3.1300000000000001E-2,"34勝28敗"]
[157,2489,"アドウェイズ",0.72409999999999997,-7.2300000000000003E-2,"42勝16敗",0.66,6.7900000000000002E-2,"33勝17敗"]
[158,2491,"バリューコマース",0.45450000000000002,-4.87E-2,"25勝30敗",0.47949999999999998,4.19E-2,"35勝38敗"]
[159,2492,"インフォマート",0.4375,-4.0599999999999997E-2,"28勝36敗",0.39129999999999998,4.8500000000000001E-2,"27勝42敗"]
[160,2501,"サッポロホールディングス",0.37109999999999999,-3.3099999999999997E-2,"36勝61敗",0.53700000000000003,3.1300000000000001E-2,"29勝25敗"]
[161,2502,"アサヒグループホールディングス",0.58109999999999995,-2.7099999999999999E-2,"43勝31敗",0.623,2.98E-2,"38勝23敗"]
[162,2503,"キリンホールディングス",0.33329999999999999,-2.23E-2,"22勝44敗",0.53129999999999999,2.6800000000000001E-2,"34勝30敗"]
[163,2531,"宝ホールディングス",0.37840000000000001,-2.4299999999999999E-2,"28勝46敗",0.53849999999999998,4.1399999999999999E-2,"28勝24敗"]
[164,2533,"オエノンホールディングス",0.52629999999999999,-3.2599999999999997E-2,"30勝27敗",0.56669999999999998,3.1099999999999999E-2,"34勝26敗"]
[165,2540,"養命酒製造",0.46300000000000002,-1.7500000000000002E-2,"25勝29敗",0.5333,0.02,"32勝28敗"]
[166,2579,"コカ・コーラ　ボトラーズジャパンホールディングス",0.375,-2.8299999999999999E-2,"27勝45敗",0.45329999999999998,2.8400000000000002E-2,"34勝41敗"]
[167,2587,"サントリー食品インターナショナル",0.60709999999999997,-2.24E-2,"34勝22敗",0.55740000000000001,2.9000000000000001E-2,"34勝27敗"]
[168,2590,"ダイドーグループホールディングス",0.43280000000000002,-2.3900000000000001E-2,"29勝38敗",0.44290000000000002,3.0300000000000001E-2,"31勝39敗"]
[169,2593,"伊藤園",0.40739999999999998,-3.3799999999999997E-2,"22勝32敗",0.4783,3.5200000000000002E-2,"44勝48敗"]
[170,2594,"キーコーヒー",0.47460000000000002,-1.0500000000000001E-2,"28勝31敗",0.47060000000000002,1.38E-2,"24勝27敗"]
[171,2602,"日清オイリオグループ",0.54549999999999998,-2.64E-2,"36勝30敗",0.61670000000000003,1.3599999999999999E-2,"37勝23敗"]
[172,2607,"不二製油グループ本社",0.47949999999999998,-2.2800000000000001E-2,"35勝38敗",0.63490000000000002,3.3099999999999997E-2,"40勝23敗"]
[173,2613,"Ｊ－オイルミルズ",0.55000000000000004,-3.3799999999999997E-2,"33勝27敗",0.47170000000000001,2.0400000000000001E-2,"25勝28敗"]
[174,2659,"サンエー",0.56820000000000004,-2.5100000000000001E-2,"50勝38敗",0.58140000000000003,1.7500000000000002E-2,"25勝18敗"]
[175,2664,"カワチ薬品",0.56759999999999999,-2.2499999999999999E-2,"42勝32敗",0.59650000000000003,4.8800000000000003E-2,"34勝23敗"]
[176,2670,"エービーシー・マート",0.53569999999999995,-2.3900000000000001E-2,"45勝39敗",0.55000000000000004,2.7699999999999999E-2,"33勝27敗"]
[177,2674,"ハードオフコーポレーション",0.44790000000000002,-3.1E-2,"43勝53敗",0.52380000000000004,3.3700000000000001E-2,"22勝20敗"]
[178,2676,"高千穂交易",0.3654,-3.1800000000000002E-2,"38勝66敗",0.67569999999999997,3.5999999999999997E-2,"25勝12敗"]
[179,2678,"アスクル",0.5645,-6.2399999999999997E-2,"35勝27敗",0.50600000000000001,4.5600000000000002E-2,"42勝41敗"]
[180,2681,"ゲオホールディングス",0.51559999999999995,-3.7100000000000001E-2,"33勝31敗",0.61109999999999998,3.6299999999999999E-2,"33勝21敗"]
[181,2685,"アダストリア",0.47499999999999998,-3.32E-2,"38勝42敗",0.49149999999999999,4.3900000000000002E-2,"29勝30敗"]
[182,2692,"伊藤忠食品",0.56920000000000004,-2.87E-2,"37勝28敗",0.5,2.8000000000000001E-2,"29勝29敗"]
[183,2695,"くら寿司",0.40739999999999998,-3.0200000000000001E-2,"33勝48敗",0.54690000000000005,3.9899999999999998E-2,"35勝29敗"]
[184,2726,"パルグループホールディングス",0.50680000000000003,-2.6200000000000001E-2,"37勝36敗",0.56359999999999999,6.2600000000000003E-2,"31勝24敗"]
[185,2730,"エディオン",0.51090000000000002,-1.5900000000000001E-2,"47勝45敗",0.45610000000000001,1.5699999999999999E-2,"26勝31敗"]
[186,2733,"あらた",0.64410000000000001,-2.4299999999999999E-2,"38勝21敗",0.60340000000000005,4.0099999999999997E-2,"35勝23敗"]
[187,2734,"サーラコーポレーション",0.55379999999999996,-2.7099999999999999E-2,"36勝29敗",0.5625,2.92E-2,"27勝21敗"]
[188,2737,"トーメンデバイス",0.54649999999999999,-3.3300000000000003E-2,"47勝39敗",0.66,3.4799999999999998E-2,"33勝17敗"]
[189,2742,"ハローズ",0.69569999999999999,-3.3099999999999997E-2,"48勝21敗",0.6,4.48E-2,"27勝18敗"]
[190,2749,"ＪＰホールディングス",0.57579999999999998,-3.6600000000000001E-2,"38勝28敗",0.52829999999999999,4.5100000000000001E-2,"28勝25敗"]
[191,2752,"フジオフードグループ本社",0.52629999999999999,-2.3599999999999999E-2,"30勝27敗",0.62860000000000005,2.93E-2,"44勝26敗"]
[192,2753,"あみやき亭",0.45590000000000003,-2.7099999999999999E-2,"31勝37敗",0.58620000000000005,3.04E-2,"34勝24敗"]
[193,2760,"東京エレクトロン　デバイス",0.54549999999999998,-4.0599999999999997E-2,"54勝45敗",0.54720000000000002,3.9800000000000002E-2,"29勝24敗"]
[{"$f":"ROW()-2","v":194},2767,"円谷フィールズホールディングス",0.5625,-6.59E-2,"54勝42敗",0.31480000000000002,7.3999999999999996E-2,"17勝37敗"]
[195,2768,"双日",0.43819999999999998,-3.0800000000000001E-2,"39勝50敗",0.5,3.15E-2,"28勝28敗"]
[196,2784,"アルフレッサ　ホールディングス",0.54930000000000001,-2.0199999999999999E-2,"39勝32敗",0.66039999999999999,2.2800000000000001E-2,"35勝18敗"]
[197,2791,"大黒天物産",0.34649999999999997,-2.8400000000000002E-2,"35勝66敗",0.4,3.8800000000000001E-2,"26勝39敗"]
[198,2792,"ハニーズホールディングス",0.56979999999999997,-2.7099999999999999E-2,"49勝37敗",0.50980000000000003,2.58E-2,"26勝25敗"]
[199,2801,"キッコーマン",0.43659999999999999,-2.24E-2,"31勝40敗",0.63460000000000005,3.3300000000000003E-2,"33勝19敗"]
[200,2802,"味の素",0.46739999999999998,-4.1599999999999998E-2,"43勝49敗",0.59179999999999999,3.4099999999999998E-2,"29勝20敗"]
[201,2804,"ブルドックソース",0.51849999999999996,-3.3000000000000002E-2,"56勝52敗",0.54759999999999998,1.9099999999999999E-2,"23勝19敗"]
[202,2809,"キユーピー",0.50680000000000003,-3.1899999999999998E-2,"37勝36敗",0.50819999999999999,2.3E-2,"31勝30敗"]
[203,2810,"ハウス食品グループ本社",0.55359999999999998,-2.52E-2,"31勝25敗",0.58460000000000001,2.9700000000000001E-2,"38勝27敗"]
[204,2811,"カゴメ",0.49299999999999999,-4.9200000000000001E-2,"35勝36敗",0.59209999999999996,2.52E-2,"45勝31敗"]
[205,2815,"アリアケジャパン",0.53969999999999996,-2.8799999999999999E-2,"34勝29敗",0.56920000000000004,3.4799999999999998E-2,"37勝28敗"]
[206,2871,"ニチレイ",0.51470000000000005,-2.0899999999999998E-2,"35勝33敗",0.5968,2.2800000000000001E-2,"37勝25敗"]
[207,2874,"横浜冷凍",0.44159999999999999,-2.69E-2,"34勝43敗",0.52310000000000001,2.1899999999999999E-2,"34勝31敗"]
[208,2875,"東洋水産",0.4103,-3.2099999999999997E-2,"32勝46敗",0.6,3.0700000000000002E-2,"36勝24敗"]
[209,2882,"イートアンドホールディングス",0.47760000000000002,-1.83E-2,"32勝35敗",0.45590000000000003,2.24E-2,"31勝37敗"]
[210,2884,"ヨシムラ・フード・ホールディングス",0.43840000000000001,-5.16E-2,"32勝41敗",0.56669999999999998,6.4000000000000001E-2,"34勝26敗"]
[211,2897,"日清食品ホールディングス",0.40539999999999998,-2.87E-2,"30勝44敗",0.53849999999999998,2.9899999999999999E-2,"28勝24敗"]
[212,2908,"フジッコ",0.7429,-1.8100000000000002E-2,"26勝9敗",0.52780000000000005,2.7799999999999998E-2,"38勝34敗"]
[213,2910,"ロック・フィールド",0.35589999999999999,-2.3E-2,"21勝38敗",0.66180000000000005,3.3799999999999997E-2,"45勝23敗"]
[214,2914,"日本たばこ産業",0.33800000000000002,-1.95E-2,"24勝47敗",0.50880000000000003,2.4400000000000002E-2,"29勝28敗"]
[215,2915,"ケンコーマヨネーズ",0.58330000000000004,-2.8000000000000001E-2,"42勝30敗",0.4259,3.1899999999999998E-2,"23勝31敗"]
[216,2918,"わらべや日洋ホールディングス",0.52310000000000001,-2.7199999999999998E-2,"34勝31敗",0.57630000000000003,3.1899999999999998E-2,"34勝25敗"]
[217,2922,"なとり",0.54239999999999999,-1.6199999999999999E-2,"32勝27敗",0.5,1.7100000000000001E-2,"17勝17敗"]
[218,2929,"ファーマフーズ",0.39360000000000001,-6.0900000000000003E-2,"37勝57敗",0.65380000000000005,6.4500000000000002E-2,"34勝18敗"]
[219,2930,"北の達人コーポレーション",0.66669999999999996,-5.4300000000000001E-2,"36勝18敗",0.4,3.61E-2,"34勝51敗"]
[220,2931,"ユーグレナ",0.70589999999999997,-4.4600000000000001E-2,"36勝15敗",0.66069999999999995,5.11E-2,"37勝19敗"]
[221,2975,"スター・マイカ・ホールディングス",0.65710000000000002,-4.02E-2,"46勝24敗",0.67859999999999998,3.8800000000000001E-2,"38勝18敗"]
[222,3002,"グンゼ",0.52780000000000005,-2.46E-2,"38勝34敗",0.57630000000000003,1.9800000000000002E-2,"34勝25敗"]
[223,3003,"ヒューリック",0.59089999999999998,-2.4500000000000001E-2,"39勝27敗",0.63160000000000005,3.5200000000000002E-2,"36勝21敗"]
[224,3028,"アルペン",0.55169999999999997,-2.3699999999999999E-2,"32勝26敗",0.48480000000000001,2.69E-2,"32勝34敗"]
[225,3031,"ラクーンホールディングス",0.51719999999999999,-7.4099999999999999E-2,"30勝28敗",0.55710000000000004,5.5899999999999998E-2,"39勝31敗"]
[226,3034,"クオールホールディングス",0.47170000000000001,-3.8800000000000001E-2,"25勝28敗",0.54410000000000003,4.1099999999999998E-2,"37勝31敗"]
[227,3036,"アルコニックス",0.54169999999999996,-3.9300000000000002E-2,"39勝33敗",0.55559999999999998,2.7699999999999999E-2,"30勝24敗"]
[228,3038,"神戸物産",0.5696,-3.49E-2,"45勝34敗",0.43480000000000002,4.7500000000000001E-2,"20勝26敗"]
[229,3040,"ソリトンシステムズ",0.57969999999999999,-3.5700000000000003E-2,"40勝29敗",0.43080000000000002,3.3700000000000001E-2,"28勝37敗"]
[230,3046,"ジンズホールディングス",0.43209999999999998,-3.2800000000000003E-2,"35勝46敗",0.3836,4.2900000000000001E-2,"28勝45敗"]
[231,3048,"ビックカメラ",0.65669999999999995,-2.7300000000000001E-2,"44勝23敗",0.5,2.58E-2,"26勝26敗"]
[232,3050,"ＤＣＭホールディングス",0.52049999999999996,-4.99E-2,"38勝35敗",0.65149999999999997,2.7699999999999999E-2,"43勝23敗"]
[233,3064,"ＭｏｎｏｔａＲＯ",0.55559999999999998,-6.3799999999999996E-2,"45勝36敗",0.51719999999999999,3.5099999999999999E-2,"30勝28敗"]
[234,3073,"ＤＤグループ",0.47370000000000001,-5.3600000000000002E-2,"36勝40敗",0.44779999999999998,6.0100000000000001E-2,"30勝37敗"]
[235,3076,"あい　ホールディングス",0.46300000000000002,-3.0599999999999999E-2,"25勝29敗",0.59150000000000003,2.7900000000000001E-2,"42勝29敗"]
[236,3086,"Ｊ．フロント　リテイリング",0.5,-3.4299999999999997E-2,"45勝45敗",0.44900000000000001,5.3499999999999999E-2,"22勝27敗"]
[237,3087,"ドトール・日レスホールディングス",0.5625,-1.6400000000000001E-2,"45勝35敗",0.51719999999999999,2.1299999999999999E-2,"30勝28敗"]
[238,3088,"マツキヨココカラ＆カンパニー",0.52859999999999996,-3.6299999999999999E-2,"37勝33敗",0.5625,3.8399999999999997E-2,"36勝28敗"]
[239,3091,"ブロンコビリー",0.5,-1.9E-2,"37勝37敗",0.54290000000000005,2.86E-2,"38勝32敗"]
[240,3092,"ＺＯＺＯ",0.46379999999999999,-3.2399999999999998E-2,"32勝37敗",0.50939999999999996,4.4299999999999999E-2,"27勝26敗"]
[241,3093,"トレジャー・ファクトリー",0.63529999999999998,-5.2699999999999997E-2,"54勝31敗",0.52939999999999998,6.9699999999999998E-2,"27勝24敗"]
[242,3097,"物語コーポレーション",0.41670000000000001,-3.5799999999999998E-2,"40勝56敗",0.57140000000000002,3.9199999999999999E-2,"36勝27敗"]
[243,3099,"三越伊勢丹ホールディングス",0.48809999999999998,-2.8899999999999999E-2,"41勝43敗",0.48149999999999998,5.21E-2,"26勝28敗"]
[244,3101,"東洋紡",0.58730000000000004,-2.8299999999999999E-2,"37勝26敗",0.57889999999999997,2.1499999999999998E-2,"33勝24敗"]
[245,3103,"ユニチカ",0.77080000000000004,-6.1400000000000003E-2,"37勝11敗",0.51319999999999999,4.4400000000000002E-2,"39勝37敗"]
[246,3104,"富士紡ホールディングス",0.4783,-3.5299999999999998E-2,"33勝36敗",0.53449999999999998,3.6600000000000001E-2,"31勝27敗"]
[247,3105,"日清紡ホールディングス",0.5,-3.6999999999999998E-2,"33勝33敗",0.47170000000000001,2.7E-2,"25勝28敗"]
[248,3106,"倉敷紡績",0.5625,-2.9399999999999999E-2,"45勝35敗",0.60340000000000005,4.1200000000000001E-2,"35勝23敗"]
[249,3107,"ダイワボウホールディングス",0.53249999999999997,-2.76E-2,"41勝36敗",0.62260000000000004,3.0700000000000002E-2,"33勝20敗"]
[250,3109,"シキボウ",0.47539999999999999,-2.6800000000000001E-2,"29勝32敗",0.5,1.3599999999999999E-2,"23勝23敗"]
[251,3110,"日東紡績",0.40300000000000002,-4.7600000000000003E-2,"27勝40敗",0.44619999999999999,4.3499999999999997E-2,"29勝36敗"]
[252,3116,"トヨタ紡織",0.52310000000000001,-2.3E-2,"34勝31敗",0.54290000000000005,3.6499999999999998E-2,"38勝32敗"]
[253,3132,"マクニカホールディングス",0.5857,-3.2000000000000001E-2,"41勝29敗",0.58620000000000005,4.2000000000000003E-2,"34勝24敗"]
[254,3135,"マーケットエンタープライズ",0.57809999999999995,-7.2999999999999995E-2,"37勝27敗",0.48330000000000001,5.5300000000000002E-2,"29勝31敗"]
[255,3139,"ラクト・ジャパン",0.4,-3.39E-2,"22勝33敗",0.50770000000000004,3.5799999999999998E-2,"33勝32敗"]
[256,3141,"ウエルシアホールディングス",0.61819999999999997,-3.5000000000000003E-2,"34勝21敗",0.61329999999999996,2.8899999999999999E-2,"46勝29敗"]
[257,3148,"クリエイトＳＤホールディングス",0.51519999999999999,-2.63E-2,"34勝32敗",0.52170000000000005,2.5399999999999999E-2,"36勝33敗"]
[{"$f":"ROW()-2","v":258},3150,"グリムス",0.52170000000000005,-4.8099999999999997E-2,"36勝33敗",0.64410000000000001,6.08E-2,"38勝21敗"]
[259,3151,"バイタルケーエスケー・ホールディングス",0.43059999999999998,-3.5400000000000001E-2,"31勝41敗",0.61819999999999997,3.8300000000000001E-2,"34勝21敗"]
[260,3153,"八洲電機",0.61040000000000005,-3.5700000000000003E-2,"47勝30敗",0.6875,3.5700000000000003E-2,"33勝15敗"]
[261,3154,"メディアスホールディングス",0.68330000000000002,-3.4099999999999998E-2,"41勝19敗",0.55379999999999996,4.6699999999999998E-2,"36勝29敗"]
[262,3156,"レスター",0.53520000000000001,-2.87E-2,"38勝33敗",0.63239999999999996,2.5499999999999998E-2,"43勝25敗"]
[263,3167,"ＴＯＫＡＩホールディングス",0.61670000000000003,-2.1700000000000001E-2,"37勝23敗",0.56920000000000004,1.66E-2,"37勝28敗"]
[264,3176,"三洋貿易",0.67649999999999999,-3.4599999999999999E-2,"46勝22敗",0.55320000000000003,2.6800000000000001E-2,"26勝21敗"]
[265,3179,"シュッピン",0.73680000000000001,-4.6399999999999997E-2,"42勝15敗",0.59319999999999995,5.8099999999999999E-2,"35勝24敗"]
[266,3180,"ビューティガレージ",0.49349999999999999,-4.5600000000000002E-2,"38勝39敗",0.63270000000000004,5.1799999999999999E-2,"31勝18敗"]
[267,3182,"オイシックス・ラ・大地",0.53090000000000004,-5.0900000000000001E-2,"43勝38敗",0.375,8.9800000000000005E-2,"24勝40敗"]
[268,3183,"ウイン・パートナーズ",0.61429999999999996,-2.53E-2,"43勝27敗",0.57140000000000002,3.15E-2,"32勝24敗"]
[269,3186,"ネクステージ",0.42680000000000001,-4.3299999999999998E-2,"35勝47敗",0.55379999999999996,6.4699999999999994E-2,"36勝29敗"]
[270,3191,"ジョイフル本田",0.52700000000000002,-4.99E-2,"39勝35敗",0.46939999999999998,2.46E-2,"23勝26敗"]
[271,3193,"エターナルホスピタリティグループ",0.40789999999999998,-3.5700000000000003E-2,"31勝45敗",0.51790000000000003,8.3599999999999994E-2,"29勝27敗"]
[272,3196,"ホットランド",0.49249999999999999,-2.1700000000000001E-2,"33勝34敗",0.54049999999999998,3.0099999999999998E-2,"40勝34敗"]
[273,3197,"すかいらーくホールディングス",0.61019999999999996,-2.8799999999999999E-2,"36勝23敗",0.68420000000000003,2.0299999999999999E-2,"52勝24敗"]
[274,3198,"ＳＦＰホールディングス",0.53849999999999998,-2.6599999999999999E-2,"42勝36敗",0.44440000000000002,3.56E-2,"32勝40敗"]
[275,3199,"綿半ホールディングス",0.51249999999999996,-2.4E-2,"41勝39敗",0.61699999999999999,2.3199999999999998E-2,"29勝18敗"]
[276,3201,"日本毛織",0.48149999999999998,-2.1399999999999999E-2,"26勝28敗",0.57350000000000001,2.87E-2,"39勝29敗"]
[277,3221,"ヨシックスホールディングス",0.57140000000000002,-3.1699999999999999E-2,"40勝30敗",0.61819999999999997,4.2900000000000001E-2,"34勝21敗"]
[278,3231,"野村不動産ホールディングス",0.49380000000000002,-2.9700000000000001E-2,"40勝41敗",0.57999999999999996,4.6300000000000001E-2,"29勝21敗"]
[279,3232,"三重交通グループホールディングス",0.60660000000000003,-2.75E-2,"37勝24敗",0.66,2.52E-2,"33勝17敗"]
[280,3245,"ディア・ライフ",0.38890000000000002,-4.4400000000000002E-2,"35勝55敗",0.47620000000000001,4.5900000000000003E-2,"20勝22敗"]
[281,3252,"地主",0.43480000000000002,-2.3099999999999999E-2,"30勝39敗",0.5645,3.0099999999999998E-2,"35勝27敗"]
[282,3276,"ＪＰＭＣ",0.55069999999999997,-1.83E-2,"38勝31敗",0.58179999999999998,2.8799999999999999E-2,"32勝23敗"]
[283,3284,"フージャースホールディングス",0.375,-2.1100000000000001E-2,"24勝40敗",0.59319999999999995,3.2500000000000001E-2,"35勝24敗"]
[284,3288,"オープンハウスグループ",0.56140000000000001,-2.7E-2,"32勝25敗",0.54790000000000005,4.4900000000000002E-2,"40勝33敗"]
[285,3289,"東急不動産ホールディングス",0.43940000000000001,-3.3700000000000001E-2,"29勝37敗",0.60289999999999999,5.0299999999999997E-2,"41勝27敗"]
[286,3291,"飯田グループホールディングス",0.45900000000000002,-2.3099999999999999E-2,"28勝33敗",0.64439999999999997,3.6400000000000002E-2,"29勝16敗"]
[287,3302,"帝国繊維",0.44,-3.7499999999999999E-2,"33勝42敗",0.51849999999999996,3.1800000000000002E-2,"28勝26敗"]
[288,3315,"日本コークス工業",0.61429999999999996,-5.5300000000000002E-2,"43勝27敗",0.5,3.2399999999999998E-2,"23勝23敗"]
[289,3319,"ゴルフダイジェスト・オンライン",0.48570000000000002,-5.7799999999999997E-2,"34勝36敗",0.51949999999999996,4.4400000000000002E-2,"40勝37敗"]
[290,3328,"ＢＥＥＮＯＳ",0.4,-4.2700000000000002E-2,"30勝45敗",0.50939999999999996,0.10589999999999999,"27勝26敗"]
[291,3333,"あさひ",0.4521,-2.47E-2,"33勝40敗",0.63490000000000002,2.0799999999999999E-2,"40勝23敗"]
[292,3341,"日本調剤",0.54549999999999998,-6.1899999999999997E-2,"42勝35敗",0.49280000000000002,3.1899999999999998E-2,"34勝35敗"]
[293,3349,"コスモス薬品",0.55700000000000005,-2.5600000000000001E-2,"44勝35敗",0.5484,2.86E-2,"34勝28敗"]
[294,3360,"シップヘルスケアホールディングス",0.50770000000000004,-1.9900000000000001E-2,"33勝32敗",0.6119,3.7499999999999999E-2,"41勝26敗"]
[295,3371,"ソフトクリエイトホールディングス",0.53949999999999998,-6.7199999999999996E-2,"41勝35敗",0.46429999999999999,5.11E-2,"26勝30敗"]
[296,3382,"セブン＆アイ・ホールディングス",0.60529999999999995,-2.29E-2,"46勝30敗",0.66100000000000003,3.2399999999999998E-2,"39勝20敗"]
[297,3387,"クリエイト・レストランツ・ホールディングス",0.50649999999999995,-4.1399999999999999E-2,"39勝38敗",0.5,3.5499999999999997E-2,"26勝26敗"]
[298,3388,"明治電機工業",0.51900000000000002,-2.8299999999999999E-2,"41勝38敗",0.55740000000000001,2.29E-2,"34勝27敗"]
[299,3391,"ツルハホールディングス",0.64859999999999995,-2.9899999999999999E-2,"48勝26敗",0.5323,3.9300000000000002E-2,"33勝29敗"]
[300,3393,"スターティアホールディングス",0.4304,-7.2900000000000006E-2,"34勝45敗",0.4375,5.6300000000000003E-2,"28勝36敗"]
[301,3395,"サンマルクホールディングス",0.43240000000000001,-2.07E-2,"32勝42敗",0.49059999999999998,2.6599999999999999E-2,"26勝27敗"]
[302,3397,"トリドールホールディングス",0.5,-3.9699999999999999E-2,"36勝36敗",0.67349999999999999,3.9800000000000002E-2,"33勝16敗"]
[303,3401,"帝人",0.54549999999999998,-2.5000000000000001E-2,"30勝25敗",0.66669999999999996,3.2899999999999999E-2,"52勝26敗"]
[304,3402,"東レ",0.58750000000000002,-2.69E-2,"47勝33敗",0.57889999999999997,3.5499999999999997E-2,"33勝24敗"]
[305,3405,"クラレ",0.45569999999999999,-3.0099999999999998E-2,"36勝43敗",0.69810000000000005,3.56E-2,"37勝16敗"]
[306,3407,"旭化成",0.52700000000000002,-2.4500000000000001E-2,"39勝35敗",0.55769999999999997,3.5999999999999997E-2,"29勝23敗"]
[307,3415,"ＴＯＫＹＯ　ＢＡＳＥ",0.5,-6.0600000000000001E-2,"35勝35敗",0.45119999999999999,6.4500000000000002E-2,"37勝45敗"]
[308,3431,"宮地エンジニアリンググループ",0.50539999999999996,-2.4E-2,"47勝46敗",0.5897,2.8400000000000002E-2,"23勝16敗"]
[309,3433,"トーカロ",0.61040000000000005,-2.87E-2,"47勝30敗",0.5091,3.4099999999999998E-2,"28勝27敗"]
[310,3436,"ＳＵＭＣＯ",0.52170000000000005,-3.49E-2,"36勝33敗",0.5161,4.1599999999999998E-2,"32勝30敗"]
[311,3443,"川田テクノロジーズ",0.5,-2.8299999999999999E-2,"36勝36敗",0.6,3.9199999999999999E-2,"33勝22敗"]
[312,3445,"ＲＳ　Ｔｅｃｈｎｏｌｏｇｉｅｓ",0.48480000000000001,-3.8100000000000002E-2,"32勝34敗",0.48,5.8599999999999999E-2,"36勝39敗"]
[313,3446,"ジェイテックコーポレーション",0.69120000000000004,-9.3799999999999994E-2,"47勝21敗",0.55220000000000002,6.2300000000000001E-2,"37勝30敗"]
[314,3457,"Ａｎｄ　Ｄｏホールディングス",0.48209999999999997,-2.6200000000000001E-2,"27勝29敗",0.55169999999999997,3.9699999999999999E-2,"48勝39敗"]
[315,3458,"シーアールイー",0.5333,-3.8399999999999997E-2,"40勝35敗",0.44290000000000002,3.95E-2,"31勝39敗"]
[316,3465,"ケイアイスター不動産",0.55879999999999996,-4.2700000000000002E-2,"38勝30敗",0.46379999999999999,4.9399999999999999E-2,"32勝37敗"]
[317,3475,"グッドコムアセット",0.3977,-5.2699999999999997E-2,"35勝53敗",0.61109999999999998,7.5300000000000006E-2,"33勝21敗"]
[318,3480,"ジェイ・エス・ビー",0.50629999999999997,-3.1099999999999999E-2,"40勝39敗",0.6875,4.2799999999999998E-2,"33勝15敗"]
[319,3482,"ロードスターキャピタル",0.57140000000000002,-5.8000000000000003E-2,"48勝36敗",0.69089999999999996,6.2799999999999995E-2,"38勝17敗"]
[320,3484,"イノベーションホールディングス",0.58460000000000001,-3.3000000000000002E-2,"38勝27敗",0.52380000000000004,5.8999999999999997E-2,"22勝20敗"]
[321,3486,"グローバル・リンク・マネジメント",0.42859999999999998,-4.3099999999999999E-2,"45勝60敗",0.6,5.1299999999999998E-2,"24勝16敗"]
[{"$f":"ROW()-2","v":322},3498,"霞ヶ関キャピタル",0.51039999999999996,-5.9799999999999999E-2,"49勝47敗",0.7,7.4800000000000005E-2,"21勝9敗"]
[323,3501,"住江織物",0.40849999999999997,-2.5100000000000001E-2,"29勝42敗",0.44,3.0300000000000001E-2,"33勝42敗"]
[324,3539,"ＪＭホールディングス",0.5373,-3.3300000000000003E-2,"36勝31敗",0.5,2.93E-2,"26勝26敗"]
[325,3543,"コメダホールディングス",0.53010000000000002,-1.6400000000000001E-2,"44勝39敗",0.65380000000000005,2.4899999999999999E-2,"34勝18敗"]
[326,3546,"アレンザホールディングス",0.51949999999999996,-3.27E-2,"40勝37敗",0.48149999999999998,2.2700000000000001E-2,"26勝28敗"]
[327,3548,"バロックジャパンリミテッド",0.55879999999999996,-2.1399999999999999E-2,"38勝30敗",0.53700000000000003,2.0500000000000001E-2,"29勝25敗"]
[328,3549,"クスリのアオキホールディングス",0.42859999999999998,-3.04E-2,"27勝36敗",0.64059999999999995,3.0499999999999999E-2,"41勝23敗"]
[329,3561,"力の源ホールディングス",0.50629999999999997,-4.53E-2,"40勝39敗",0.51670000000000005,5.5100000000000003E-2,"31勝29敗"]
[330,3563,"ＦＯＯＤ　＆　ＬＩＦＥ　ＣＯＭＰＡＮＩＥＳ",0.5,-3.2099999999999997E-2,"28勝28敗",0.65380000000000005,5.8599999999999999E-2,"34勝18敗"]
[331,3569,"セーレン",0.42420000000000002,-3.4799999999999998E-2,"28勝38敗",0.44640000000000002,3.6999999999999998E-2,"25勝31敗"]
[332,3580,"小松マテーレ",0.53520000000000001,-3.1E-2,"38勝33敗",0.5333,2.93E-2,"32勝28敗"]
[333,3591,"ワコールホールディングス",0.47220000000000001,-2.3E-2,"34勝38敗",0.61899999999999999,3.6299999999999999E-2,"39勝24敗"]
[334,3593,"ホギメディカル",0.42309999999999998,-3.27E-2,"33勝45敗",0.61399999999999999,2.9600000000000001E-2,"35勝22敗"]
[335,3608,"ＴＳＩホールディングス",0.45950000000000002,-4.4499999999999998E-2,"34勝40敗",0.65310000000000001,4.2299999999999997E-2,"32勝17敗"]
[336,3612,"ワールド",0.53849999999999998,-3.56E-2,"42勝36敗",0.54549999999999998,4.4299999999999999E-2,"24勝20敗"]
[337,3626,"ＴＩＳ",0.44590000000000002,-2.0199999999999999E-2,"33勝41敗",0.54239999999999999,4.0500000000000001E-2,"32勝27敗"]
[338,3632,"グリー",0.6875,-3.4500000000000003E-2,"55勝25敗",0.52310000000000001,3.7400000000000003E-2,"34勝31敗"]
[339,3635,"コーエーテクモホールディングス",0.52170000000000005,-3.0700000000000002E-2,"36勝33敗",0.53969999999999996,4.7399999999999998E-2,"34勝29敗"]
[340,3636,"三菱総合研究所",0.55840000000000001,-2.6200000000000001E-2,"43勝34敗",0.56100000000000005,3.61E-2,"23勝18敗"]
[341,3649,"ファインデックス",0.63639999999999997,-4.5199999999999997E-2,"42勝24敗",0.52539999999999998,4.3999999999999997E-2,"31勝28敗"]
[342,3655,"ブレインパッド",0.54549999999999998,-5.2400000000000002E-2,"36勝30敗",0.59619999999999995,6.0999999999999999E-2,"31勝21敗"]
[343,3656,"ＫＬａｂ",0.61109999999999998,-6.9599999999999995E-2,"22勝14敗",0.64290000000000003,6.83E-2,"54勝30敗"]
[344,3657,"ポールトゥウィンホールディングス",0.54390000000000005,-4.87E-2,"31勝26敗",0.37290000000000001,3.2000000000000001E-2,"22勝37敗"]
[345,3659,"ネクソン",0.39660000000000001,-5.2499999999999998E-2,"23勝35敗",0.55069999999999997,0.05,"38勝31敗"]
[346,3660,"アイスタイル",0.50719999999999998,-7.0999999999999994E-2,"35勝34敗",0.34039999999999998,7.4800000000000005E-2,"16勝31敗"]
[347,3661,"エムアップホールディングス",0.57330000000000003,-4.48E-2,"43勝32敗",0.54759999999999998,5.8200000000000002E-2,"23勝19敗"]
[348,3662,"エイチーム",0.60809999999999997,-5.3600000000000002E-2,"45勝29敗",0.47060000000000002,4.1599999999999998E-2,"32勝36敗"]
[349,3663,"セルシス",0.45879999999999999,-7.9000000000000001E-2,"39勝46敗",0.41460000000000002,7.5899999999999995E-2,"17勝24敗"]
[350,3665,"エニグモ",0.59179999999999999,-3.9800000000000002E-2,"29勝20敗",0.4194,7.1099999999999997E-2,"26勝36敗"]
[351,3668,"コロプラ",0.62960000000000005,-4.1500000000000002E-2,"34勝20敗",0.53620000000000001,3.04E-2,"37勝32敗"]
[352,3673,"ブロードリーフ",0.45450000000000002,-3.4799999999999998E-2,"30勝36敗",0.55559999999999998,6.08E-2,"30勝24敗"]
[353,3675,"クロス・マーケティンググループ",0.5373,-4.9099999999999998E-2,"36勝31敗",0.58330000000000004,7.0599999999999996E-2,"35勝25敗"]
[354,3676,"デジタルハーツホールディングス",0.6,-4.07E-2,"36勝24敗",0.5,3.8100000000000002E-2,"25勝25敗"]
[355,3678,"メディアドゥ",0.49020000000000002,-2.53E-2,"25勝26敗",0.61970000000000003,6.7400000000000002E-2,"44勝27敗"]
[356,3679,"じげん",0.59650000000000003,-4.53E-2,"34勝23敗",0.64180000000000004,4.9599999999999998E-2,"43勝24敗"]
[357,3681,"ブイキューブ",0.5333,-9.7500000000000003E-2,"32勝28敗",0.55410000000000004,8.0799999999999997E-2,"41勝33敗"]
[358,3687,"フィックスターズ",0.56899999999999995,-5.7599999999999998E-2,"33勝25敗",0.66669999999999996,5.28E-2,"44勝22敗"]
[359,3688,"ＣＡＲＴＡ　ＨＯＬＤＩＮＧＳ",0.58930000000000005,-0.04,"33勝23敗",0.55559999999999998,0.04,"35勝28敗"]
[360,3694,"オプティム",0.42420000000000002,-5.4199999999999998E-2,"28勝38敗",0.45590000000000003,3.7999999999999999E-2,"31勝37敗"]
[361,3696,"セレス",0.46910000000000002,-5.7500000000000002E-2,"38勝43敗",0.45279999999999998,6.6600000000000006E-2,"24勝29敗"]
[362,3697,"ＳＨＩＦＴ",0.62790000000000001,-7.8299999999999995E-2,"54勝32敗",0.46150000000000002,4.6600000000000003E-2,"24勝28敗"]
[363,3708,"特種東海製紙",0.65480000000000005,-2.4799999999999999E-2,"55勝29敗",0.36359999999999998,1.7999999999999999E-2,"12勝21敗"]
[364,3741,"セック",0.625,-3.4299999999999997E-2,"40勝24敗",0.56059999999999999,4.3900000000000002E-2,"37勝29敗"]
[365,3762,"テクマトリックス",0.59089999999999998,-3.3399999999999999E-2,"39勝27敗",0.47270000000000001,2.8899999999999999E-2,"26勝29敗"]
[366,3763,"プロシップ",0.52310000000000001,-4.3400000000000001E-2,"34勝31敗",0.64149999999999996,2.5399999999999999E-2,"34勝19敗"]
[367,3765,"ガンホー・オンライン・エンターテイメント",0.54290000000000005,-4.4900000000000002E-2,"38勝32敗",0.56920000000000004,3.7100000000000001E-2,"37勝28敗"]
[368,3769,"ＧＭＯペイメントゲートウェイ",0.57630000000000003,-0.04,"34勝25敗",0.54220000000000002,6.1899999999999997E-2,"45勝38敗"]
[369,3771,"システムリサーチ",0.66249999999999998,-3.6999999999999998E-2,"53勝27敗",0.54,4.1300000000000003E-2,"27勝23敗"]
[370,3774,"インターネットイニシアティブ",0.5,-3.2000000000000001E-2,"40勝40敗",0.74360000000000004,0.06,"29勝10敗"]
[371,3778,"さくらインターネット",0.42030000000000001,-0.108,"29勝40敗",0.50749999999999995,3.5499999999999997E-2,"34勝33敗"]
[372,3788,"ＧＭＯグローバルサイン・ホールディングス",0.38,-7.5999999999999998E-2,"19勝31敗",0.59379999999999999,5.2699999999999997E-2,"38勝26敗"]
[373,3817,"ＳＲＡホールディングス",0.61729999999999996,-3.9199999999999999E-2,"50勝31敗",0.72089999999999999,3.1600000000000003E-2,"31勝12敗"]
[374,3834,"朝日ネット",0.63080000000000003,-2.5899999999999999E-2,"41勝24敗",0.57140000000000002,3.1600000000000003E-2,"40勝30敗"]
[375,3835,"ｅＢＡＳＥ",0.5857,-3.85E-2,"41勝29敗",0.49020000000000002,4.2200000000000001E-2,"25勝26敗"]
[376,3836,"アバントグループ",0.443,-3.9300000000000002E-2,"35勝44敗",0.53190000000000004,6.5000000000000002E-2,"25勝22敗"]
[377,3837,"アドソル日進",0.56159999999999999,-5.2999999999999999E-2,"41勝32敗",0.6,3.8300000000000001E-2,"36勝24敗"]
[378,3843,"フリービット",0.43659999999999999,-5.6800000000000003E-2,"31勝40敗",0.4909,5.1900000000000002E-2,"27勝28敗"]
[379,3844,"コムチュア",0.60709999999999997,-3.3300000000000003E-2,"34勝22敗",0.64059999999999995,6.5799999999999997E-2,"41勝23敗"]
[380,3853,"アステリア",0.55810000000000004,-8.9899999999999994E-2,"24勝19敗",0.56520000000000004,5.9700000000000003E-2,"39勝30敗"]
[381,3854,"アイル",0.54930000000000001,-4.0500000000000001E-2,"39勝32敗",0.52,5.7500000000000002E-2,"26勝24敗"]
[382,3861,"王子ホールディングス",0.64290000000000003,-3.1899999999999998E-2,"45勝25敗",0.69350000000000001,2.5100000000000001E-2,"43勝19敗"]
[383,3863,"日本製紙",0.47060000000000002,-2.4299999999999999E-2,"24勝27敗",0.44619999999999999,3.04E-2,"29勝36敗"]
[384,3864,"三菱製紙",0.54690000000000005,-2.9499999999999998E-2,"35勝29敗",0.48149999999999998,3.0099999999999998E-2,"26勝28敗"]
[385,3865,"北越コーポレーション",0.53680000000000005,-5.4600000000000003E-2,"51勝44敗",0.3488,3.1600000000000003E-2,"15勝28敗"]
[{"$f":"ROW()-2","v":386},3877,"中越パルプ工業",0.48330000000000001,-2.1499999999999998E-2,"29勝31敗",0.6,2.5399999999999999E-2,"33勝22敗"]
[387,3880,"大王製紙",0.39129999999999998,-4.6399999999999997E-2,"18勝28敗",0.48,2.6800000000000001E-2,"36勝39敗"]
[388,3901,"マークラインズ",0.59650000000000003,-4.9200000000000001E-2,"34勝23敗",0.45,4.5900000000000003E-2,"27勝33敗"]
[389,3902,"メディカル・データ・ビジョン",0.5,-5.8099999999999999E-2,"31勝31敗",0.41099999999999998,4.7399999999999998E-2,"30勝43敗"]
[390,3903,"ｇｕｍｉ",0.52380000000000004,-5.79E-2,"33勝30敗",0.53969999999999996,5.7000000000000002E-2,"34勝29敗"]
[391,3915,"テラスカイ",0.57330000000000003,-5.1299999999999998E-2,"43勝32敗",0.58730000000000004,5.0799999999999998E-2,"37勝26敗"]
[392,3916,"デジタル・インフォメーション・テクノロジー",0.5857,-2.93E-2,"41勝29敗",0.57140000000000002,4.7100000000000003E-2,"36勝27敗"]
[393,3921,"ネオジャパン",0.48720000000000002,-4.7E-2,"38勝40敗",0.56669999999999998,4.53E-2,"34勝26敗"]
[394,3922,"ＰＲ　ＴＩＭＥＳ",0.63490000000000002,-5.7299999999999997E-2,"40勝23敗",0.44440000000000002,4.9500000000000002E-2,"24勝30敗"]
[395,3923,"ラクス",0.50670000000000004,-7.2999999999999995E-2,"38勝37敗",0.62160000000000004,8.1299999999999997E-2,"46勝28敗"]
[396,3924,"ランドコンピュータ",0.50619999999999998,-5.0500000000000003E-2,"41勝40敗",0.4103,3.7100000000000001E-2,"16勝23敗"]
[397,3925,"ダブルスタンダード",0.52700000000000002,-5.4100000000000002E-2,"39勝35敗",0.53029999999999999,7.3099999999999998E-2,"35勝31敗"]
[398,3926,"オープンドア",0.5,-7.5499999999999998E-2,"28勝28敗",0.42859999999999998,7.2900000000000006E-2,"24勝32敗"]
[399,3932,"アカツキ",0.63829999999999998,-3.15E-2,"30勝17敗",0.52049999999999996,4.1000000000000002E-2,"38勝35敗"]
[400,3937,"Ｕｂｉｃｏｍホールディングス",0.53420000000000001,-9.6500000000000002E-2,"39勝34敗",0.64710000000000001,4.4600000000000001E-2,"44勝24敗"]
[401,3939,"カナミックネットワーク",0.55169999999999997,-5.5500000000000001E-2,"32勝26敗",0.57969999999999999,4.36E-2,"40勝29敗"]
[402,3941,"レンゴー",0.59699999999999998,-2.9100000000000001E-2,"40勝27敗",0.61539999999999995,4.2999999999999997E-2,"40勝25敗"]
[403,3946,"トーモク",0.47689999999999999,-2.0500000000000001E-2,"31勝34敗",0.53700000000000003,2.5999999999999999E-2,"29勝25敗"]
[404,3950,"ザ・パック",0.45450000000000002,-2.29E-2,"30勝36敗",0.56599999999999995,3.0700000000000002E-2,"30勝23敗"]
[405,3962,"チェンジホールディングス",0.55559999999999998,-6.1800000000000001E-2,"35勝28敗",0.54549999999999998,8.5199999999999998E-2,"36勝30敗"]
[406,3963,"シンクロ・フード",0.61819999999999997,-5.6099999999999997E-2,"34勝21敗",0.55169999999999997,7.3599999999999999E-2,"32勝26敗"]
[407,3964,"オークネット",0.4627,-5.9499999999999997E-2,"31勝36敗",0.52539999999999998,5.2699999999999997E-2,"31勝28敗"]
[408,3968,"セグエグループ",0.45450000000000002,-5.8400000000000001E-2,"30勝36敗",0.54690000000000005,3.4500000000000003E-2,"35勝29敗"]
[409,3978,"マクロミル",0.5161,-5.3600000000000002E-2,"32勝30敗",0.68420000000000003,3.8100000000000002E-2,"39勝18敗"]
[410,3983,"オロ",0.64149999999999996,-5.2900000000000003E-2,"34勝19敗",0.62119999999999997,6.3600000000000004E-2,"41勝25敗"]
[411,3984,"ユーザーローカル",0.62350000000000005,-3.6499999999999998E-2,"53勝32敗",0.46150000000000002,5.8400000000000001E-2,"24勝28敗"]
[412,3992,"ニーズウェル",0.625,-6.2700000000000006E-2,"50勝30敗",0.56599999999999995,3.6799999999999999E-2,"30勝23敗"]
[413,3993,"ＰＫＳＨＡ　Ｔｅｃｈｎｏｌｏｇｙ",0.49409999999999998,-3.8199999999999998E-2,"42勝43敗",0.6038,4.5900000000000003E-2,"32勝21敗"]
[414,3994,"マネーフォワード",0.5625,-6.3899999999999998E-2,"36勝28敗",0.46429999999999999,5.7799999999999997E-2,"26勝30敗"]
[415,4004,"レゾナック・ホールディングス",0.51519999999999999,-3.3700000000000001E-2,"34勝32敗",0.52239999999999998,5.2499999999999998E-2,"35勝32敗"]
[416,4005,"住友化学",0.43080000000000002,-3.5900000000000001E-2,"28勝37敗",0.56100000000000005,3.0800000000000001E-2,"46勝36敗"]
[417,4008,"住友精化",0.4194,-1.9900000000000001E-2,"26勝36敗",0.48330000000000001,3.39E-2,"29勝31敗"]
[418,4021,"日産化学",0.55559999999999998,-2.8000000000000001E-2,"35勝28敗",0.47460000000000002,5.0099999999999999E-2,"28勝31敗"]
[419,4022,"ラサ工業",0.53659999999999997,-5.33E-2,"44勝38敗",0.61699999999999999,4.0500000000000001E-2,"29勝18敗"]
[420,4023,"クレハ",0.62960000000000005,-3.5000000000000003E-2,"34勝20敗",0.56140000000000001,4.3900000000000002E-2,"32勝25敗"]
[421,4025,"多木化学",0.41510000000000002,-5.0700000000000002E-2,"22勝31敗",0.6623,4.07E-2,"51勝26敗"]
[422,4027,"テイカ",0.51670000000000005,-2.8799999999999999E-2,"31勝29敗",0.53849999999999998,3.7199999999999997E-2,"35勝30敗"]
[423,4028,"石原産業",0.55289999999999995,-4.1300000000000003E-2,"47勝38敗",0.56000000000000005,3.6799999999999999E-2,"28勝22敗"]
[424,4041,"日本曹達",0.52629999999999999,-2.12E-2,"50勝45敗",0.48780000000000001,3.0099999999999998E-2,"20勝21敗"]
[425,4042,"東ソー",0.52170000000000005,-2.6200000000000001E-2,"36勝33敗",0.53420000000000001,2.98E-2,"39勝34敗"]
[426,4043,"トクヤマ",0.6552,-0.02,"38勝20敗",0.65790000000000004,3.7499999999999999E-2,"50勝26敗"]
[427,4044,"セントラル硝子",0.53520000000000001,-2.5899999999999999E-2,"38勝33敗",0.65,2.5000000000000001E-2,"39勝21敗"]
[428,4045,"東亞合成",0.43059999999999998,-2.3199999999999998E-2,"31勝41敗",0.68,3.3399999999999999E-2,"34勝16敗"]
[429,4046,"大阪ソーダ",0.42220000000000002,-3.8800000000000001E-2,"38勝52敗",0.54759999999999998,5.1499999999999997E-2,"23勝19敗"]
[430,4047,"関東電化工業",0.59489999999999998,-2.6599999999999999E-2,"47勝32敗",0.51429999999999998,3.7600000000000001E-2,"36勝34敗"]
[431,4061,"デンカ",0.5484,-3.4700000000000002E-2,"34勝28敗",0.56759999999999999,3.1E-2,"42勝32敗"]
[432,4062,"イビデン",0.48,-3.6600000000000001E-2,"24勝26敗",0.5696,5.5800000000000002E-2,"45勝34敗"]
[433,4063,"信越化学工業",0.41110000000000002,-2.35E-2,"37勝53敗",0.625,3.39E-2,"35勝21敗"]
[434,4064,"日本カーバイド工業",0.47060000000000002,-2.07E-2,"32勝36敗",0.54390000000000005,2.47E-2,"31勝26敗"]
[435,4078,"堺化学工業",0.65669999999999995,-2.1399999999999999E-2,"44勝23敗",0.55559999999999998,2.9899999999999999E-2,"25勝20敗"]
[436,4082,"第一稀元素化学工業",0.57889999999999997,-3.0200000000000001E-2,"33勝24敗",0.53620000000000001,2.8000000000000001E-2,"37勝32敗"]
[437,4088,"エア・ウォーター",0.47760000000000002,-2.5600000000000001E-2,"32勝35敗",0.64,3.4299999999999997E-2,"32勝18敗"]
[438,4091,"日本酸素ホールディングス",0.49320000000000003,-3.5700000000000003E-2,"36勝37敗",0.53129999999999999,4.8800000000000003E-2,"34勝30敗"]
[439,4092,"日本化学工業",0.52939999999999998,-3.9600000000000003E-2,"27勝24敗",0.5373,3.8699999999999998E-2,"36勝31敗"]
[440,4093,"東邦アセチレン",0.6,-4.48E-2,"45勝30敗",0.56100000000000005,2.5999999999999999E-2,"23勝18敗"]
[441,4095,"日本パーカライジング",0.56720000000000004,-3.1699999999999999E-2,"38勝29敗",0.60419999999999996,3.9899999999999998E-2,"29勝19敗"]
[442,4097,"高圧ガス工業",0.61760000000000004,-4.1500000000000002E-2,"42勝26敗",0.58540000000000003,2.9399999999999999E-2,"24勝17敗"]
[443,4099,"四国化成ホールディングス",0.66669999999999996,-3.3099999999999997E-2,"52勝26敗",0.62860000000000005,3.9E-2,"22勝13敗"]
[444,4109,"ステラ　ケミファ",0.5,-3.2399999999999998E-2,"36勝36敗",0.62,3.5200000000000002E-2,"31勝19敗"]
[445,4112,"保土谷化学工業",0.48720000000000002,-4.02E-2,"38勝40敗",0.48330000000000001,6.3100000000000003E-2,"29勝31敗"]
[446,4114,"日本触媒",0.63160000000000005,-2.5899999999999999E-2,"48勝28敗",0.72550000000000003,2.69E-2,"37勝14敗"]
[447,4116,"大日精化工業",0.62860000000000005,-2.2599999999999999E-2,"44勝26敗",0.50939999999999996,4.4200000000000003E-2,"27勝26敗"]
[448,4118,"カネカ",0.54049999999999998,-2.64E-2,"40勝34敗",0.62749999999999995,2.81E-2,"32勝19敗"]
[449,4151,"協和キリン",0.48280000000000001,-3.1899999999999998E-2,"28勝30敗",0.4783,3.6499999999999998E-2,"33勝36敗"]
[{"$f":"ROW()-2","v":450},4182,"三菱瓦斯化学",0.5,-2.4299999999999999E-2,"45勝45敗",0.40679999999999999,3.9899999999999998E-2,"24勝35敗"]
[451,4183,"三井化学",0.47620000000000001,-3.9100000000000003E-2,"30勝33敗",0.56599999999999995,4.3200000000000002E-2,"30勝23敗"]
[452,4186,"東京応化工業",0.47220000000000001,-3.15E-2,"34勝38敗",0.45100000000000001,3.5299999999999998E-2,"23勝28敗"]
[453,4187,"大阪有機化学工業",0.43209999999999998,-3.7699999999999997E-2,"35勝46敗",0.53620000000000001,3.8600000000000002E-2,"37勝32敗"]
[454,4188,"三菱ケミカルグループ",0.4133,-2.7799999999999998E-2,"31勝44敗",0.52859999999999996,2.86E-2,"37勝33敗"]
[455,4189,"ＫＨネオケム",0.55169999999999997,-3.3799999999999997E-2,"32勝26敗",0.52539999999999998,3.3700000000000001E-2,"31勝28敗"]
[456,4202,"ダイセル",0.64059999999999995,-2.2100000000000002E-2,"41勝23敗",0.70179999999999998,3.1E-2,"40勝17敗"]
[457,4203,"住友ベークライト",0.51060000000000005,-3.2099999999999997E-2,"48勝46敗",0.52,5.0099999999999999E-2,"26勝24敗"]
[458,4204,"積水化学工業",0.72130000000000005,-2.3699999999999999E-2,"44勝17敗",0.65080000000000005,2.7400000000000001E-2,"41勝22敗"]
[459,4205,"日本ゼオン",0.46379999999999999,-3.7699999999999997E-2,"32勝37敗",0.53969999999999996,4.3299999999999998E-2,"34勝29敗"]
[460,4206,"アイカ工業",0.63790000000000002,-2.3E-2,"37勝21敗",0.56340000000000001,3.0099999999999998E-2,"40勝31敗"]
[461,4208,"ＵＢＥ",0.55700000000000005,-2.0299999999999999E-2,"44勝35敗",0.51719999999999999,3.0300000000000001E-2,"30勝28敗"]
[462,4212,"積水樹脂",0.55259999999999998,-3.1399999999999997E-2,"42勝34敗",0.51849999999999996,2.53E-2,"28勝26敗"]
[463,4216,"旭有機材",0.43180000000000002,-3.6799999999999999E-2,"38勝50敗",0.62790000000000001,3.3599999999999998E-2,"27勝16敗"]
[464,4218,"ニチバン",0.47139999999999999,-2.2499999999999999E-2,"33勝37敗",0.64290000000000003,3.6700000000000003E-2,"36勝20敗"]
[465,4220,"リケンテクノス",0.49349999999999999,-3.0800000000000001E-2,"38勝39敗",0.62260000000000004,4.4999999999999998E-2,"33勝20敗"]
[466,4221,"大倉工業",0.44929999999999998,-2.9700000000000001E-2,"31勝38敗",0.52939999999999998,1.7899999999999999E-2,"27勝24敗"]
[467,4228,"積水化成品工業",0.53059999999999996,-2.63E-2,"26勝23敗",0.4375,3.04E-2,"28勝36敗"]
[468,4229,"群栄化学工業",0.56789999999999996,-2.5399999999999999E-2,"46勝35敗",0.4627,2.76E-2,"31勝36敗"]
[469,4246,"ダイキョーニシカワ",0.45,-3.4099999999999998E-2,"27勝33敗",0.58930000000000005,4.7500000000000001E-2,"33勝23敗"]
[470,4249,"森六ホールディングス",0.50790000000000002,-3.0800000000000001E-2,"32勝31敗",0.53569999999999995,2.8799999999999999E-2,"30勝26敗"]
[471,4251,"恵和",0.5,-5.4300000000000001E-2,"35勝35敗",0.71430000000000005,6.2600000000000003E-2,"35勝14敗"]
[472,4272,"日本化薬",0.64180000000000004,-2.87E-2,"43勝24敗",0.59019999999999995,3.9699999999999999E-2,"36勝25敗"]
[473,4275,"カーリット",0.54020000000000001,-3.8300000000000001E-2,"47勝40敗",0.43480000000000002,3.9E-2,"20勝26敗"]
[474,4290,"プレステージ・インターナショナル",0.37930000000000003,-2.93E-2,"22勝36敗",0.55769999999999997,3.5799999999999998E-2,"29勝23敗"]
[475,4298,"プロトコーポレーション",0.37180000000000002,-2.63E-2,"29勝49敗",0.5091,3.4599999999999999E-2,"28勝27敗"]
[476,4301,"アミューズ",0.65849999999999997,-2.0500000000000001E-2,"27勝14敗",0.48049999999999998,2.1299999999999999E-2,"37勝40敗"]
[477,4307,"野村総合研究所",0.49280000000000002,-5.2499999999999998E-2,"34勝35敗",0.63829999999999998,3.2800000000000003E-2,"30勝17敗"]
[478,4310,"ドリームインキュベータ",0.4677,-4.5999999999999999E-2,"29勝33敗",0.56579999999999997,6.3299999999999995E-2,"43勝33敗"]
[479,4318,"クイック",0.43480000000000002,-3.5200000000000002E-2,"30勝39敗",0.68120000000000003,3.7600000000000001E-2,"47勝22敗"]
[480,4323,"日本システム技術",0.49320000000000003,-6.5100000000000005E-2,"36勝37敗",0.68630000000000002,5.0500000000000003E-2,"35勝16敗"]
[481,4324,"電通グループ",0.5,-2.5600000000000001E-2,"31勝31敗",0.6452,2.6499999999999999E-2,"40勝22敗"]
[482,4326,"インテージホールディングス",0.41099999999999998,-3.1300000000000001E-2,"30勝43敗",0.51559999999999995,3.8699999999999998E-2,"33勝31敗"]
[483,4331,"テイクアンドギヴ・ニーズ",0.53029999999999999,-6.25E-2,"35勝31敗",0.5645,3.1399999999999997E-2,"35勝27敗"]
[484,4333,"東邦システムサイエンス",0.45829999999999999,-6.5000000000000002E-2,"33勝39敗",0.65790000000000004,3.2000000000000001E-2,"25勝13敗"]
[485,4337,"ぴあ",0.62119999999999997,-3.2000000000000001E-2,"41勝25敗",0.57140000000000002,4.9000000000000002E-2,"28勝21敗"]
[486,4343,"イオンファンタジー",0.44619999999999999,-2.87E-2,"29勝36敗",0.50649999999999995,7.8700000000000006E-2,"39勝38敗"]
[487,4344,"ソースネクスト",0.60560000000000003,-5.8900000000000001E-2,"43勝28敗",0.61539999999999995,4.8000000000000001E-2,"40勝25敗"]
[488,4345,"シーティーエス",0.5645,-2.8400000000000002E-2,"35勝27敗",0.48720000000000002,2.3900000000000001E-2,"38勝40敗"]
[489,4362,"日本精化",0.55069999999999997,-4.4299999999999999E-2,"38勝31敗",0.59260000000000002,3.7600000000000001E-2,"32勝22敗"]
[490,4368,"扶桑化学工業",0.56410000000000005,-3.4099999999999998E-2,"44勝34敗",0.64710000000000001,4.1399999999999999E-2,"33勝18敗"]
[491,4369,"トリケミカル研究所",0.46750000000000003,-3.61E-2,"36勝41敗",0.4531,5.1700000000000003E-2,"29勝35敗"]
[492,4384,"ラクスル",0.70830000000000004,-6.3299999999999995E-2,"51勝21敗",0.52939999999999998,7.3400000000000007E-2,"27勝24敗"]
[493,4385,"メルカリ",0.53029999999999999,-6.1699999999999998E-2,"35勝31敗",0.55930000000000002,8.4000000000000005E-2,"33勝26敗"]
[494,4390,"アイ・ピー・エス",0.56340000000000001,-3.8600000000000002E-2,"40勝31敗",0.59019999999999995,5.33E-2,"36勝25敗"]
[495,4392,"ＦＩＧ",0.62119999999999997,-3.8399999999999997E-2,"41勝25敗",0.48,2.4299999999999999E-2,"24勝26敗"]
[496,4396,"システムサポート",0.51670000000000005,-3.85E-2,"31勝29敗",0.56859999999999999,4.3200000000000002E-2,"29勝22敗"]
[497,4401,"ＡＤＥＫＡ",0.54049999999999998,-2.5000000000000001E-2,"40勝34敗",0.50819999999999999,3.85E-2,"31勝30敗"]
[498,4403,"日油",0.37969999999999998,-3.1600000000000003E-2,"30勝49敗",0.53449999999999998,3.49E-2,"31勝27敗"]
[499,4410,"ハリマ化成グループ",0.44069999999999998,-4.2700000000000002E-2,"26勝33敗",0.63329999999999997,3.09E-2,"38勝22敗"]
[500,4433,"ヒト・コミュニケーションズ・ホールディングス",0.62749999999999995,-3.5499999999999997E-2,"32勝19敗",0.4143,4.7300000000000002E-2,"29勝41敗"]
[501,4443,"Ｓａｎｓａｎ",0.50700000000000001,-7.5999999999999998E-2,"36勝35敗",0.37290000000000001,6.5600000000000006E-2,"22勝37敗"]
[502,4446,"Ｌｉｎｋ－Ｕグループ",0.6,-6.1899999999999997E-2,"36勝24敗",0.50700000000000001,7.2400000000000006E-2,"36勝35敗"]
[503,4449,"ギフティ",0.43590000000000001,-8.3900000000000002E-2,"34勝44敗",0.53059999999999996,6.4799999999999996E-2,"26勝23敗"]
[504,4452,"花王",0.64439999999999997,-1.8599999999999998E-2,"29勝16敗",0.68240000000000001,2.6599999999999999E-2,"58勝27敗"]
[505,4461,"第一工業製薬",0.55100000000000005,-2.4E-2,"27勝22敗",0.50680000000000003,4.6399999999999997E-2,"37勝36敗"]
[506,4462,"石原ケミカル",0.50570000000000004,-3.0099999999999998E-2,"44勝43敗",0.73470000000000002,4.6100000000000002E-2,"36勝13敗"]
[507,4471,"三洋化成工業",0.58489999999999998,-2.3199999999999998E-2,"31勝22敗",0.75,2.5499999999999998E-2,"51勝17敗"]
[508,4502,"武田薬品工業",0.46300000000000002,-1.6400000000000001E-2,"25勝29敗",0.64180000000000004,2.6700000000000002E-2,"43勝24敗"]
[509,4503,"アステラス製薬",0.55169999999999997,-2.24E-2,"32勝26敗",0.5645,2.5600000000000001E-2,"35勝27敗"]
[510,4506,"住友ファーマ",0.4,-3.2399999999999998E-2,"20勝30敗",0.46239999999999998,4.4499999999999998E-2,"43勝50敗"]
[511,4507,"塩野義製薬",0.61899999999999999,-3.2099999999999997E-2,"39勝24敗",0.55169999999999997,3.3599999999999998E-2,"32勝26敗"]
[512,4516,"日本新薬",0.41460000000000002,-1.6500000000000001E-2,"17勝24敗",0.53249999999999997,4.0800000000000003E-2,"41勝36敗"]
[513,4519,"中外製薬",0.49409999999999998,-2.8199999999999999E-2,"42勝43敗",0.5111,4.9000000000000002E-2,"23勝22敗"]
[{"$f":"ROW()-2","v":514},4521,"科研製薬",0.52049999999999996,-2.2800000000000001E-2,"38勝35敗",0.54690000000000005,2.1700000000000001E-2,"35勝29敗"]
[515,4523,"エーザイ",0.42620000000000002,-4.82E-2,"26勝35敗",0.5,2.47E-2,"35勝35敗"]
[516,4526,"理研ビタミン",0.53159999999999996,-2.5600000000000001E-2,"42勝37敗",0.57779999999999998,3.0499999999999999E-2,"26勝19敗"]
[517,4527,"ロート製薬",0.64100000000000001,-3.1199999999999999E-2,"50勝28敗",0.56140000000000001,4.19E-2,"32勝25敗"]
[518,4528,"小野薬品工業",0.4219,-2.1100000000000001E-2,"27勝37敗",0.43590000000000001,1.9199999999999998E-2,"34勝44敗"]
[519,4530,"久光製薬",0.45,-2.8299999999999999E-2,"27勝33敗",0.40350000000000003,2.35E-2,"23勝34敗"]
[520,4534,"持田製薬",0.52270000000000005,-3.4700000000000002E-2,"23勝21敗",0.6119,3.2800000000000003E-2,"41勝26敗"]
[521,4536,"参天製薬",0.56920000000000004,-2.76E-2,"37勝28敗",0.5161,2.5499999999999998E-2,"32勝30敗"]
[522,4538,"扶桑薬品工業",0.56140000000000001,-3.3000000000000002E-2,"32勝25敗",0.5323,4.7699999999999999E-2,"33勝29敗"]
[523,4540,"ツムラ",0.52539999999999998,-2.35E-2,"31勝28敗",0.57809999999999995,2.9899999999999999E-2,"37勝27敗"]
[524,4543,"テルモ",0.54410000000000003,-1.84E-2,"37勝31敗",0.57140000000000002,3.2599999999999997E-2,"36勝27敗"]
[525,4544,"Ｈ．Ｕ．グループホールディングス",0.42420000000000002,-2.3900000000000001E-2,"28勝38敗",0.49330000000000002,3.1199999999999999E-2,"37勝38敗"]
[526,4547,"キッセイ薬品工業",0.55710000000000004,-2.92E-2,"39勝31敗",0.52170000000000005,5.0200000000000002E-2,"24勝22敗"]
[527,4548,"生化学工業",0.66069999999999995,-2.3800000000000002E-2,"37勝19敗",0.46029999999999999,3.3799999999999997E-2,"29勝34敗"]
[528,4549,"栄研化学",0.5897,-2.5600000000000001E-2,"46勝32敗",0.42859999999999998,3.9100000000000003E-2,"24勝32敗"]
[529,4551,"鳥居薬品",0.50670000000000004,-2.7199999999999998E-2,"38勝37敗",0.62070000000000003,3.0300000000000001E-2,"36勝22敗"]
[530,4552,"ＪＣＲファーマ",0.60340000000000005,-4.6300000000000001E-2,"35勝23敗",0.52310000000000001,5.9900000000000002E-2,"34勝31敗"]
[531,4553,"東和薬品",0.41670000000000001,-4.0300000000000002E-2,"25勝35敗",0.49230000000000002,3.0499999999999999E-2,"32勝33敗"]
[532,4554,"富士製薬工業",0.61760000000000004,-3.6799999999999999E-2,"42勝26敗",0.70269999999999999,3.2000000000000001E-2,"26勝11敗"]
[533,4559,"ゼリア新薬工業",0.65669999999999995,-2.4E-2,"44勝23敗",0.53569999999999995,3.7699999999999997E-2,"30勝26敗"]
[534,4565,"ネクセラファーマ",0.6129,-5.1499999999999997E-2,"38勝24敗",0.57809999999999995,4.82E-2,"37勝27敗"]
[535,4568,"第一三共",0.63929999999999998,-3.9E-2,"39勝22敗",0.6,4.36E-2,"30勝20敗"]
[536,4569,"杏林製薬",0.59379999999999999,-2.9000000000000001E-2,"38勝26敗",0.6,2.63E-2,"27勝18敗"]
[537,4574,"大幸薬品",0.66669999999999996,-4.9700000000000001E-2,"38勝19敗",0.57579999999999998,4.3200000000000002E-2,"38勝28敗"]
[538,4577,"ダイト",0.48,-3.4000000000000002E-2,"24勝26敗",0.46750000000000003,2.98E-2,"36勝41敗"]
[539,4578,"大塚ホールディングス",0.4839,-2.46E-2,"30勝32敗",0.50849999999999995,2.6100000000000002E-2,"30勝29敗"]
[540,4587,"ペプチドリーム",0.54049999999999998,-3.0800000000000001E-2,"40勝34敗",0.53569999999999995,5.3600000000000002E-2,"30勝26敗"]
[541,4611,"大日本塗料",0.52170000000000005,-3.7999999999999999E-2,"36勝33敗",0.63270000000000004,2.63E-2,"31勝18敗"]
[542,4612,"日本ペイントホールディングス",0.51900000000000002,-4.2200000000000001E-2,"41勝38敗",0.47370000000000001,3.39E-2,"27勝30敗"]
[543,4613,"関西ペイント",0.46970000000000001,-2.35E-2,"31勝35敗",0.5373,3.09E-2,"36勝31敗"]
[544,4617,"中国塗料",0.61360000000000003,-3.1300000000000001E-2,"54勝34敗",0.68420000000000003,4.0899999999999999E-2,"26勝12敗"]
[545,4626,"太陽ホールディングス",0.54169999999999996,-2.7400000000000001E-2,"39勝33敗",0.54390000000000005,3.4299999999999997E-2,"31勝26敗"]
[546,4631,"ＤＩＣ",0.4219,-2.98E-2,"27勝37敗",0.69230000000000003,2.8400000000000002E-2,"36勝16敗"]
[547,4633,"サカタインクス",0.4839,-2.86E-2,"30勝32敗",0.64810000000000001,2.98E-2,"35勝19敗"]
[548,4634,"ａｒｔｉｅｎｃｅ",0.51160000000000005,-1.8800000000000001E-2,"22勝21敗",0.52539999999999998,3.7699999999999997E-2,"31勝28敗"]
[549,4641,"アルプス技研",0.45590000000000003,-2.3400000000000001E-2,"31勝37敗",0.58620000000000005,3.6200000000000003E-2,"34勝24敗"]
[550,4658,"日本空調サービス",0.57689999999999997,-2.0299999999999999E-2,"30勝22敗",0.54349999999999998,2.01E-2,"25勝21敗"]
[551,4661,"オリエンタルランド",0.3579,-2.4500000000000001E-2,"34勝61敗",0.67569999999999997,3.4599999999999999E-2,"50勝24敗"]
[552,4662,"フォーカスシステムズ",0.41980000000000001,-6.9599999999999995E-2,"34勝47敗",0.56140000000000001,2.07E-2,"32勝25敗"]
[553,4665,"ダスキン",0.5,-1.5699999999999999E-2,"39勝39敗",0.6552,3.4799999999999998E-2,"38勝20敗"]
[554,4666,"パーク二四",0.46429999999999999,-2.5399999999999999E-2,"26勝30敗",0.55410000000000004,5.4100000000000002E-2,"41勝33敗"]
[555,4668,"明光ネットワークジャパン",0.52,-2.7900000000000001E-2,"26勝24敗",0.58819999999999995,2.58E-2,"40勝28敗"]
[556,4674,"クレスコ",0.47949999999999998,-3.3500000000000002E-2,"35勝38敗",0.6724,3.6700000000000003E-2,"39勝19敗"]
[557,4676,"フジ・メディア・ホールディングス",0.59150000000000003,-2.7199999999999998E-2,"42勝29敗",0.57889999999999997,3.0200000000000001E-2,"33勝24敗"]
[558,4680,"ラウンドワン",0.42859999999999998,-3.9399999999999998E-2,"33勝44敗",0.56599999999999995,6.7199999999999996E-2,"30勝23敗"]
[559,4681,"リゾートトラスト",0.59379999999999999,-3.5400000000000001E-2,"38勝26敗",0.66669999999999996,4.4400000000000002E-2,"42勝21敗"]
[560,4684,"オービック",0.59650000000000003,-2.6499999999999999E-2,"34勝23敗",0.5,3.0700000000000002E-2,"35勝35敗"]
[561,4686,"ジャストシステム",0.54100000000000004,-3.4299999999999997E-2,"33勝28敗",0.46910000000000002,4.8899999999999999E-2,"38勝43敗"]
[562,4687,"ＴＤＣソフト",0.52690000000000003,-5.2900000000000003E-2,"49勝44敗",0.69640000000000002,3.4099999999999998E-2,"39勝17敗"]
[563,4689,"ＬＩＮＥヤフー",0.52380000000000004,-3.2599999999999997E-2,"33勝30敗",0.4375,4.9500000000000002E-2,"28勝36敗"]
[564,4694,"ビー・エム・エル",0.52110000000000001,-4.8599999999999997E-2,"37勝34敗",0.52170000000000005,2.92E-2,"24勝22敗"]
[565,4704,"トレンドマイクロ",0.56899999999999995,-3.3099999999999997E-2,"33勝25敗",0.48,5.8299999999999998E-2,"36勝39敗"]
[566,4709,"ＩＤホールディングス",0.57950000000000002,-2.7300000000000001E-2,"51勝37敗",0.75509999999999999,3.2599999999999997E-2,"37勝12敗"]
[567,4714,"リソー教育",0.52459999999999996,-2.3400000000000001E-2,"32勝29敗",0.47889999999999999,3.8300000000000001E-2,"34勝37敗"]
[568,4718,"早稲田アカデミー",0.49380000000000002,-2.4500000000000001E-2,"40勝41敗",0.54349999999999998,2.7699999999999999E-2,"25勝21敗"]
[569,4719,"アルファシステムズ",0.6119,-4.3700000000000003E-2,"41勝26敗",0.40820000000000001,2.8400000000000002E-2,"20勝29敗"]
[570,4722,"フューチャー",0.52700000000000002,-3.4299999999999997E-2,"39勝35敗",0.62260000000000004,6.5199999999999994E-2,"33勝20敗"]
[571,4725,"ＣＡＣ　Ｈｏｌｄｉｎｇｓ",0.58489999999999998,-2.1100000000000001E-2,"31勝22敗",0.64059999999999995,2.47E-2,"41勝23敗"]
[572,4732,"ユー・エス・エス",0.50590000000000002,-2.5999999999999999E-2,"43勝42敗",0.57140000000000002,3.15E-2,"32勝24敗"]
[573,4733,"オービックビジネスコンサルタント",0.56669999999999998,-2.8799999999999999E-2,"34勝26敗",0.4118,5.1799999999999999E-2,"28勝40敗"]
[574,4743,"アイティフォー",0.48530000000000001,-2.9100000000000001E-2,"33勝35敗",0.74070000000000003,3.15E-2,"40勝14敗"]
[575,4751,"サイバーエージェント",0.60660000000000003,-3.2000000000000001E-2,"37勝24敗",0.6119,4.3999999999999997E-2,"41勝26敗"]
[576,4755,"楽天グループ",0.63160000000000005,-4.0599999999999997E-2,"48勝28敗",0.47620000000000001,5.6300000000000003E-2,"30勝33敗"]
[577,4763,"クリーク・アンド・リバー社",0.56759999999999999,-4.02E-2,"42勝32敗",0.60319999999999996,3.39E-2,"38勝25敗"]
[{"$f":"ROW()-2","v":578},4765,"ＳＢＩグローバルアセットマネジメント",0.54790000000000005,-2.9600000000000001E-2,"40勝33敗",0.72,3.4500000000000003E-2,"36勝14敗"]
[579,4768,"大塚商会",0.53849999999999998,-2.0899999999999998E-2,"21勝18敗",0.65310000000000001,3.56E-2,"32勝17敗"]
[580,4776,"サイボウズ",0.41510000000000002,-0.1079,"22勝31敗",0.45610000000000001,6.6100000000000006E-2,"26勝31敗"]
[581,4792,"山田コンサルティンググループ",0.61670000000000003,-3.1199999999999999E-2,"37勝23敗",0.4531,5.67E-2,"29勝35敗"]
[582,4801,"セントラルスポーツ",0.55930000000000002,-2.2599999999999999E-2,"33勝26敗",0.5806,2.1299999999999999E-2,"36勝26敗"]
[583,4809,"パラカ",0.48049999999999998,-3.0200000000000001E-2,"37勝40敗",0.6552,2.75E-2,"38勝20敗"]
[584,4812,"電通総研",0.60560000000000003,-5.5199999999999999E-2,"43勝28敗",0.58819999999999995,4.0399999999999998E-2,"40勝28敗"]
[585,4813,"ＡＣＣＥＳＳ",0.44440000000000002,-5.1299999999999998E-2,"36勝45敗",0.4259,5.1700000000000003E-2,"23勝31敗"]
[586,4819,"デジタルガレージ",0.52170000000000005,-3.27E-2,"24勝22敗",0.55220000000000002,5.1400000000000001E-2,"37勝30敗"]
[587,4820,"イーエムシステムズ",0.58819999999999995,-3.6299999999999999E-2,"30勝21敗",0.43480000000000002,4.9500000000000002E-2,"30勝39敗"]
[588,4825,"ウェザーニューズ",0.41980000000000001,-2.75E-2,"34勝47敗",0.41099999999999998,2.2499999999999999E-2,"30勝43敗"]
[589,4826,"ＣＩＪ",0.53420000000000001,-4.8800000000000003E-2,"39勝34敗",0.5,3.6799999999999999E-2,"27勝27敗"]
[590,4828,"ビジネスエンジニアリング",0.51249999999999996,-3.2099999999999997E-2,"41勝39敗",0.67210000000000003,3.7699999999999997E-2,"41勝20敗"]
[591,4839,"ＷＯＷＯＷ",0.57689999999999997,-2.1000000000000001E-2,"15勝11敗",0.39760000000000001,2.3800000000000002E-2,"33勝50敗"]
[592,4845,"スカラ",0.60870000000000002,-3.3000000000000002E-2,"28勝18敗",0.5,3.7900000000000003E-2,"46勝46敗"]
[593,4847,"インテリジェント　ウェイブ",0.49299999999999999,-4.9700000000000001E-2,"35勝36敗",0.53569999999999995,3.6299999999999999E-2,"30勝26敗"]
[594,4848,"フルキャストホールディングス",0.52170000000000005,-4.7500000000000001E-2,"36勝33敗",0.6,3.3000000000000002E-2,"36勝24敗"]
[595,4849,"エン・ジャパン",0.63270000000000004,-4.02E-2,"31勝18敗",0.47689999999999999,3.9600000000000003E-2,"31勝34敗"]
[596,4880,"セルソース",0.58440000000000003,-6.6900000000000001E-2,"45勝32敗",0.57140000000000002,9.64E-2,"32勝24敗"]
[597,4901,"富士フイルムホールディングス",0.53620000000000001,-2.76E-2,"37勝32敗",0.4375,4.53E-2,"28勝36敗"]
[598,4902,"コニカミノルタ",0.36109999999999998,-3.5499999999999997E-2,"26勝46敗",0.43209999999999998,4.4900000000000002E-2,"35勝46敗"]
[599,4911,"資生堂",0.46150000000000002,-0.03,"18勝21敗",0.53849999999999998,3.9699999999999999E-2,"42勝36敗"]
[600,4912,"ライオン",0.64290000000000003,-2.3300000000000001E-2,"27勝15敗",0.48609999999999998,3.3300000000000003E-2,"35勝37敗"]
[601,4914,"高砂香料工業",0.61639999999999995,-2.6700000000000002E-2,"45勝28敗",0.45,4.4600000000000001E-2,"18勝22敗"]
[602,4917,"マンダム",0.50849999999999995,-2.9399999999999999E-2,"30勝29敗",0.56920000000000004,2.8500000000000001E-2,"37勝28敗"]
[603,4919,"ミルボン",0.59379999999999999,-3.1199999999999999E-2,"38勝26敗",0.60240000000000005,4.9399999999999999E-2,"50勝33敗"]
[604,4922,"コーセー",0.60419999999999996,-3.78E-2,"29勝19敗",0.45829999999999999,4.58E-2,"33勝39敗"]
[605,4923,"コタ",0.4884,-2.4299999999999999E-2,"42勝44敗",0.57779999999999998,1.9800000000000002E-2,"26勝19敗"]
[606,4927,"ポーラ・オルビスホールディングス",0.5333,-1.8200000000000001E-2,"32勝28敗",0.57650000000000001,3.2099999999999997E-2,"49勝36敗"]
[607,4928,"ノエビアホールディングス",0.46300000000000002,-1.89E-2,"25勝29敗",0.6,2.4500000000000001E-2,"48勝32敗"]
[608,4931,"新日本製薬",0.68569999999999998,-2.8299999999999999E-2,"48勝22敗",0.55000000000000004,3.27E-2,"33勝27敗"]
[609,4951,"エステー",0.66100000000000003,-1.72E-2,"39勝20敗",0.51719999999999999,2.0299999999999999E-2,"30勝28敗"]
[610,4956,"コニシ",0.52500000000000002,-3.2800000000000003E-2,"42勝38敗",0.70450000000000002,3.7400000000000003E-2,"31勝13敗"]
[611,4958,"長谷川香料",0.43659999999999999,-3.4000000000000002E-2,"31勝40敗",0.69840000000000002,3.5200000000000002E-2,"44勝19敗"]
[612,4967,"小林製薬",0.49059999999999998,-3.4200000000000001E-2,"26勝27敗",0.46250000000000002,2.93E-2,"37勝43敗"]
[613,4968,"荒川化学工業",0.6,-2.4199999999999999E-2,"42勝28敗",0.65449999999999997,3.39E-2,"36勝19敗"]
[614,4971,"メック",0.54290000000000005,-3.3700000000000001E-2,"38勝32敗",0.53700000000000003,4.7800000000000002E-2,"29勝25敗"]
[615,4973,"日本高純度化学",0.66069999999999995,-2.69E-2,"37勝19敗",0.57410000000000005,3.3799999999999997E-2,"31勝23敗"]
[616,4974,"タカラバイオ",0.67349999999999999,-4.02E-2,"33勝16敗",0.46910000000000002,3.27E-2,"38勝43敗"]
[617,4975,"ＪＣＵ",0.40300000000000002,-2.98E-2,"27勝40敗",0.5,3.9600000000000003E-2,"30勝30敗"]
[618,4980,"デクセリアルズ",0.4194,-3.5900000000000001E-2,"39勝54敗",0.4375,6.1199999999999997E-2,"21勝27敗"]
[619,4985,"アース製薬",0.60419999999999996,-3.0099999999999998E-2,"29勝19敗",0.65280000000000005,2.63E-2,"47勝25敗"]
[620,4996,"クミアイ化学工業",0.5,-3.8300000000000001E-2,"30勝30敗",0.5,3.4099999999999998E-2,"37勝37敗"]
[621,4997,"日本農薬",0.61040000000000005,-3.6200000000000003E-2,"47勝30敗",0.4219,3.5700000000000003E-2,"27勝37敗"]
[622,5011,"ニチレキグループ",0.37969999999999998,-2.9000000000000001E-2,"30勝49敗",0.4839,2.5000000000000001E-2,"30勝32敗"]
[623,5017,"富士石油",0.61760000000000004,-4.2799999999999998E-2,"42勝26敗",0.54390000000000005,4.9200000000000001E-2,"31勝26敗"]
[624,5019,"出光興産",0.5595,-3.56E-2,"47勝37敗",0.59089999999999998,3.9E-2,"26勝18敗"]
[625,5020,"ＥＮＥＯＳホールディングス",0.4471,-3.0499999999999999E-2,"38勝47敗",0.54720000000000002,3.2399999999999998E-2,"29勝24敗"]
[626,5021,"コスモエネルギーホールディングス",0.36709999999999998,-5.2499999999999998E-2,"29勝50敗",0.51559999999999995,4.8099999999999997E-2,"33勝31敗"]
[627,5101,"横浜ゴム",0.53620000000000001,-2.47E-2,"37勝32敗",0.43140000000000001,4.2799999999999998E-2,"22勝29敗"]
[628,5105,"ＴＯＹＯ　ＴＩＲＥ",0.52110000000000001,-2.5899999999999999E-2,"37勝34敗",0.60870000000000002,3.8899999999999997E-2,"42勝27敗"]
[629,5108,"ブリヂストン",0.52380000000000004,-2.2800000000000001E-2,"33勝30敗",0.53969999999999996,2.58E-2,"34勝29敗"]
[630,5110,"住友ゴム工業",0.53029999999999999,-3.3300000000000003E-2,"35勝31敗",0.4627,3.0499999999999999E-2,"31勝36敗"]
[631,5121,"藤倉コンポジット",0.50590000000000002,-3.7400000000000003E-2,"43勝42敗",0.69569999999999999,4.6399999999999997E-2,"32勝14敗"]
[632,5122,"オカモト",0.57969999999999999,-2.4299999999999999E-2,"40勝29敗",0.5,4.1099999999999998E-2,"27勝27敗"]
[633,5142,"アキレス",0.56359999999999999,-2.92E-2,"31勝24敗",0.59150000000000003,2.7E-2,"42勝29敗"]
[634,5185,"フコク",0.43059999999999998,-2.5399999999999999E-2,"31勝41敗",0.4773,3.2800000000000003E-2,"21勝23敗"]
[635,5186,"ニッタ",0.57809999999999995,-2.7699999999999999E-2,"37勝27敗",0.625,2.87E-2,"25勝15敗"]
[636,5191,"住友理工",0.60270000000000001,-3.7600000000000001E-2,"44勝29敗",0.60870000000000002,3.4599999999999999E-2,"28勝18敗"]
[637,5192,"三ツ星ベルト",0.44,-2.47E-2,"33勝42敗",0.53059999999999996,3.1099999999999999E-2,"26勝23敗"]
[638,5195,"バンドー化学",0.44940000000000002,-2.3900000000000001E-2,"40勝49敗",0.53190000000000004,3.3300000000000003E-2,"25勝22敗"]
[639,5201,"ＡＧＣ",0.50719999999999998,-2.8799999999999999E-2,"35勝34敗",0.56599999999999995,3.95E-2,"30勝23敗"]
[640,5202,"日本板硝子",0.60940000000000005,-5.2400000000000002E-2,"39勝25敗",0.53849999999999998,4.4999999999999998E-2,"42勝36敗"]
[641,5208,"有沢製作所",0.52780000000000005,-2.9000000000000001E-2,"38勝34敗",0.61109999999999998,2.6200000000000001E-2,"33勝21敗"]
[{"$f":"ROW()-2","v":642},5214,"日本電気硝子",0.54049999999999998,-2.81E-2,"40勝34敗",0.63929999999999998,2.7400000000000001E-2,"39勝22敗"]
[643,5232,"住友大阪セメント",0.73209999999999997,-2.9499999999999998E-2,"41勝15敗",0.59619999999999995,3.5000000000000003E-2,"31勝21敗"]
[644,5233,"太平洋セメント",0.49349999999999999,-2.98E-2,"38勝39敗",0.45760000000000001,3.2899999999999999E-2,"27勝32敗"]
[645,5261,"リソルホールディングス",0.5181,-0.02,"43勝40敗",0.61219999999999997,3.1300000000000001E-2,"30勝19敗"]
[646,5262,"日本ヒューム",0.47620000000000001,-3.1899999999999998E-2,"30勝33敗",0.48149999999999998,4.1500000000000002E-2,"26勝28敗"]
[647,5269,"日本コンクリート工業",0.54690000000000005,-3.6400000000000002E-2,"35勝29敗",0.55930000000000002,4.1399999999999999E-2,"33勝26敗"]
[648,5288,"アジアパイルホールディングス",0.51190000000000002,-3.4000000000000002E-2,"43勝41敗",0.5111,2.0199999999999999E-2,"23勝22敗"]
[649,5301,"東海カーボン",0.53569999999999995,-4.4299999999999999E-2,"30勝26敗",0.57650000000000001,4.2099999999999999E-2,"49勝36敗"]
[650,5302,"日本カーボン",0.5806,-3.0700000000000002E-2,"36勝26敗",0.53849999999999998,2.8000000000000001E-2,"42勝36敗"]
[651,5310,"東洋炭素",0.5857,-3.2500000000000001E-2,"41勝29敗",0.54349999999999998,2.8299999999999999E-2,"25勝21敗"]
[652,5331,"ノリタケ",0.48649999999999999,-2.7900000000000001E-2,"36勝38敗",0.67920000000000003,2.7799999999999998E-2,"36勝17敗"]
[653,5332,"ＴＯＴＯ",0.49209999999999998,-2.8000000000000001E-2,"31勝32敗",0.57140000000000002,2.29E-2,"36勝27敗"]
[654,5333,"日本碍子",0.52239999999999998,-2.1000000000000001E-2,"35勝32敗",0.6,2.7300000000000001E-2,"39勝26敗"]
[655,5334,"日本特殊陶業",0.42220000000000002,-2.52E-2,"38勝52敗",0.50819999999999999,4.6199999999999998E-2,"31勝30敗"]
[656,5344,"ＭＡＲＵＷＡ",0.44590000000000002,-3.04E-2,"33勝41敗",0.77270000000000005,5.0599999999999999E-2,"34勝10敗"]
[657,5351,"品川リフラクトリーズ",0.4667,-2.3E-2,"35勝40敗",0.65,2.9499999999999998E-2,"26勝14敗"]
[658,5352,"黒崎播磨",0.49440000000000001,-3.1699999999999999E-2,"44勝45敗",0.4839,4.2599999999999999E-2,"30勝32敗"]
[659,5357,"ヨータイ",0.51090000000000002,-4.9399999999999999E-2,"47勝45敗",0.7419,3.4700000000000002E-2,"23勝8敗"]
[660,5384,"フジミインコーポレーテッド",0.40479999999999999,-2.8500000000000001E-2,"34勝50敗",0.57969999999999999,4.7899999999999998E-2,"40勝29敗"]
[661,5393,"ニチアス",0.50719999999999998,-2.5600000000000001E-2,"35勝34敗",0.56100000000000005,4.9200000000000001E-2,"23勝18敗"]
[662,5401,"日本製鉄",0.46750000000000003,-4.41E-2,"36勝41敗",0.52170000000000005,4.9399999999999999E-2,"24勝22敗"]
[663,5406,"神戸製鋼所",0.50590000000000002,-4.9599999999999998E-2,"43勝42敗",0.61539999999999995,4.2200000000000001E-2,"32勝20敗"]
[664,5408,"中山製鋼所",0.52439999999999998,-4.7699999999999999E-2,"43勝39敗",0.54549999999999998,2.5899999999999999E-2,"30勝25敗"]
[665,5410,"合同製鐵",0.40539999999999998,-2.52E-2,"30勝44敗",0.65149999999999997,3.3700000000000001E-2,"43勝23敗"]
[666,5411,"ＪＦＥホールディングス",0.54549999999999998,-4.8800000000000003E-2,"42勝35敗",0.64290000000000003,3.9899999999999998E-2,"36勝20敗"]
[667,5423,"東京製鐵",0.48570000000000002,-4.7800000000000002E-2,"34勝36敗",0.57379999999999998,5.2499999999999998E-2,"35勝26敗"]
[668,5440,"共英製鋼",0.5,-5.0099999999999999E-2,"39勝39敗",0.57889999999999997,2.6100000000000002E-2,"33勝24敗"]
[669,5444,"大和工業",0.54220000000000002,-3.56E-2,"45勝38敗",0.61360000000000003,5.0900000000000001E-2,"27勝17敗"]
[670,5445,"東京鐵鋼",0.53090000000000004,-2.8299999999999999E-2,"43勝38敗",0.54100000000000004,6.83E-2,"33勝28敗"]
[671,5451,"淀川製鋼所",0.55220000000000002,-2.9899999999999999E-2,"37勝30敗",0.61899999999999999,4.5900000000000003E-2,"26勝16敗"]
[672,5463,"丸一鋼管",0.52459999999999996,-2.8899999999999999E-2,"32勝29敗",0.62790000000000001,0.03,"27勝16敗"]
[673,5471,"大同特殊鋼",0.4677,-3.61E-2,"29勝33敗",0.55379999999999996,3.4299999999999997E-2,"36勝29敗"]
[674,5480,"日本冶金工業",0.47949999999999998,-4.65E-2,"35勝38敗",0.61819999999999997,4.8300000000000003E-2,"34勝21敗"]
[675,5481,"山陽特殊製鋼",0.49299999999999999,-4.9700000000000001E-2,"35勝36敗",0.65449999999999997,4.4400000000000002E-2,"36勝19敗"]
[676,5482,"愛知製鋼",0.52239999999999998,-3.3300000000000003E-2,"35勝32敗",0.55840000000000001,3.32E-2,"43勝34敗"]
[677,5541,"大平洋金属",0.59019999999999995,-5.9499999999999997E-2,"36勝25敗",0.72409999999999997,4.7199999999999999E-2,"42勝16敗"]
[678,5563,"新日本電工",0.59699999999999998,-4.5999999999999999E-2,"40勝27敗",0.56899999999999995,5.3400000000000003E-2,"33勝25敗"]
[679,5602,"栗本鐵工所",0.47220000000000001,-2.1700000000000001E-2,"34勝38敗",0.46150000000000002,4.2999999999999997E-2,"18勝21敗"]
[680,5631,"日本製鋼所",0.40910000000000002,-4.4699999999999997E-2,"27勝39敗",0.71189999999999998,5.9200000000000003E-2,"42勝17敗"]
[681,5632,"三菱製鋼",0.51160000000000005,-5.6800000000000003E-2,"44勝42敗",0.4909,3.4700000000000002E-2,"27勝28敗"]
[682,5659,"日本精線",0.57469999999999999,-3.0300000000000001E-2,"50勝37敗",0.64439999999999997,3.0499999999999999E-2,"29勝16敗"]
[683,5698,"エンビプロ・ホールディングス",0.55169999999999997,-5.4300000000000001E-2,"32勝26敗",0.41099999999999998,5.9499999999999997E-2,"30勝43敗"]
[684,5702,"大紀アルミニウム工業所",0.46879999999999999,-5.57E-2,"30勝34敗",0.6,4.24E-2,"42勝28敗"]
[685,5703,"日本軽金属ホールディングス",0.5,-2.98E-2,"31勝31敗",0.52459999999999996,3.3099999999999997E-2,"32勝29敗"]
[686,5706,"三井金属鉱業",0.57499999999999996,-4.0800000000000003E-2,"46勝34敗",0.60419999999999996,3.6499999999999998E-2,"29勝19敗"]
[687,5707,"東邦亜鉛",0.60289999999999999,-6.3200000000000006E-2,"41勝27敗",0.4143,4.7899999999999998E-2,"29勝41敗"]
[688,5711,"三菱マテリアル",0.7,-3.6200000000000003E-2,"42勝18敗",0.45900000000000002,3.1300000000000001E-2,"28勝33敗"]
[689,5713,"住友金属鉱山",0.60319999999999996,-3.5099999999999999E-2,"38勝25敗",0.58730000000000004,2.98E-2,"37勝26敗"]
[690,5714,"ＤＯＷＡホールディングス",0.71430000000000005,-3.3000000000000002E-2,"50勝20敗",0.47689999999999999,4.1399999999999999E-2,"31勝34敗"]
[691,5715,"古河機械金属",0.57140000000000002,-2.5999999999999999E-2,"40勝30敗",0.54390000000000005,0.03,"31勝26敗"]
[692,5726,"大阪チタニウムテクノロジーズ",0.59150000000000003,-8.1900000000000001E-2,"42勝29敗",0.63080000000000003,6.7799999999999999E-2,"41勝24敗"]
[693,5727,"東邦チタニウム",0.59719999999999995,-5.62E-2,"43勝29敗",0.623,5.3499999999999999E-2,"38勝23敗"]
[694,5741,"ＵＡＣＪ",0.60870000000000002,-3.8699999999999998E-2,"42勝27敗",0.51919999999999999,5.1799999999999999E-2,"27勝25敗"]
[695,5757,"ＣＫサンエツ",0.5625,-3.32E-2,"36勝28敗",0.51790000000000003,5.8599999999999999E-2,"29勝27敗"]
[696,5801,"古河電気工業",0.5625,-2.5000000000000001E-2,"36勝28敗",0.4667,2.75E-2,"28勝32敗"]
[697,5802,"住友電気工業",0.4819,-2.52E-2,"40勝43敗",0.58489999999999998,2.9399999999999999E-2,"31勝22敗"]
[698,5803,"フジクラ",0.40910000000000002,-5.0299999999999997E-2,"36勝52敗",0.62749999999999995,6.4899999999999999E-2,"32勝19敗"]
[699,5805,"ＳＷＣＣ",0.51319999999999999,-3.6400000000000002E-2,"39勝37敗",0.439,6.5299999999999997E-2,"18勝23敗"]
[700,5821,"平河ヒューテック",0.55259999999999998,-4.2099999999999999E-2,"42勝34敗",0.61219999999999997,2.9600000000000001E-2,"30勝19敗"]
[701,5851,"リョービ",0.37180000000000002,-3.95E-2,"29勝49敗",0.44440000000000002,4.02E-2,"28勝35敗"]
[702,5852,"アーレスティ",0.56340000000000001,-4.65E-2,"40勝31敗",0.58179999999999998,4.8000000000000001E-2,"32勝23敗"]
[703,5857,"ＡＲＥホールディングス",0.57140000000000002,-2.4500000000000001E-2,"40勝30敗",0.67649999999999999,3.3099999999999997E-2,"46勝22敗"]
[704,5901,"東洋製罐グループホールディングス",0.42249999999999999,-2.7099999999999999E-2,"30勝41敗",0.56859999999999999,3.2199999999999999E-2,"29勝22敗"]
[705,5902,"ホッカンホールディングス",0.59260000000000002,-3.0200000000000001E-2,"32勝22敗",0.48330000000000001,2.5700000000000001E-2,"29勝31敗"]
[{"$f":"ROW()-2","v":706},5911,"横河ブリッジホールディングス",0.53029999999999999,-1.9699999999999999E-2,"35勝31敗",0.63639999999999997,2.64E-2,"42勝24敗"]
[707,5915,"駒井ハルテック",0.5,-2.5999999999999999E-2,"37勝37敗",0.52239999999999998,2.9100000000000001E-2,"35勝32敗"]
[708,5929,"三和ホールディングス",0.42699999999999999,-2.2499999999999999E-2,"38勝51敗",0.73909999999999998,2.7699999999999999E-2,"34勝12敗"]
[709,5930,"文化シヤッター",0.44579999999999997,-2.3699999999999999E-2,"37勝46敗",0.48,2.8000000000000001E-2,"24勝26敗"]
[710,5932,"三協立山",0.43080000000000002,-4.2299999999999997E-2,"28勝37敗",0.37840000000000001,2.9700000000000001E-2,"28勝46敗"]
[711,5933,"アルインコ",0.48570000000000002,-2.8799999999999999E-2,"34勝36敗",0.47060000000000002,1.83E-2,"24勝27敗"]
[712,5938,"ＬＩＸＩＬ",0.5373,-3.3000000000000002E-2,"36勝31敗",0.56940000000000002,2.7699999999999999E-2,"41勝31敗"]
[713,5943,"ノーリツ",0.56059999999999999,-2.9600000000000001E-2,"37勝29敗",0.53569999999999995,2.4299999999999999E-2,"30勝26敗"]
[714,5946,"長府製作所",0.65149999999999997,-3.2899999999999999E-2,"43勝23敗",0.5,3.73E-2,"30勝30敗"]
[715,5947,"リンナイ",0.52539999999999998,-1.83E-2,"31勝28敗",0.48649999999999999,2.7E-2,"36勝38敗"]
[716,5949,"ユニプレス",0.58899999999999997,-3.4299999999999997E-2,"43勝30敗",0.48330000000000001,2.7E-2,"29勝31敗"]
[717,5957,"日東精工",0.48099999999999998,-5.2200000000000003E-2,"38勝41敗",0.54349999999999998,3.61E-2,"25勝21敗"]
[718,5959,"岡部",0.5,-2.0799999999999999E-2,"32勝32敗",0.49280000000000002,2.2599999999999999E-2,"34勝35敗"]
[719,5970,"ジーテクト",0.51519999999999999,-4.07E-2,"34勝32敗",0.57889999999999997,2.8899999999999999E-2,"33勝24敗"]
[720,5975,"東プレ",0.38890000000000002,-4.1300000000000003E-2,"21勝33敗",0.50849999999999995,3.15E-2,"30勝29敗"]
[721,5976,"高周波熱錬",0.64470000000000005,-3.2000000000000001E-2,"49勝27敗",0.63039999999999996,3.3599999999999998E-2,"29勝17敗"]
[722,5981,"東京製綱",0.40579999999999999,-3.7600000000000001E-2,"28勝41敗",0.47220000000000001,4.7699999999999999E-2,"34勝38敗"]
[723,5988,"パイオラックス",0.46879999999999999,-2.6100000000000002E-2,"30勝34敗",0.66039999999999999,2.9399999999999999E-2,"35勝18敗"]
[724,5989,"エイチワン",0.47760000000000002,-4.1099999999999998E-2,"32勝35敗",0.56000000000000005,5.6399999999999999E-2,"28勝22敗"]
[725,5991,"日本発条",0.42670000000000002,-2.9499999999999998E-2,"32勝43敗",0.58620000000000005,5.5399999999999998E-2,"34勝24敗"]
[726,6005,"三浦工業",0.6129,-5.3999999999999999E-2,"38勝24敗",0.42859999999999998,2.7900000000000001E-2,"33勝44敗"]
[727,6013,"タクマ",0.51470000000000005,-2.76E-2,"35勝33敗",0.56359999999999999,3.3399999999999999E-2,"31勝24敗"]
[728,6028,"テクノプロ・ホールディングス",0.57689999999999997,-3.9800000000000002E-2,"30勝22敗",0.66149999999999998,4.7899999999999998E-2,"43勝22敗"]
[729,6035,"アイ・アールジャパンホールディングス",0.58109999999999995,-4.7899999999999998E-2,"43勝31敗",0.38329999999999997,3.78E-2,"23勝37敗"]
[730,6036,"ＫｅｅＰｅｒ技研",0.42030000000000001,-6.1899999999999997E-2,"29勝40敗",0.53700000000000003,6.3100000000000003E-2,"29勝25敗"]
[731,6047,"Ｇｕｎｏｓｙ",0.55930000000000002,-6.6000000000000003E-2,"33勝26敗",0.5484,7.6899999999999996E-2,"34勝28敗"]
[732,6050,"イー・ガーディアン",0.5373,-5.2699999999999997E-2,"36勝31敗",0.38,5.4899999999999997E-2,"19勝31敗"]
[733,6055,"ジャパンマテリアル",0.47170000000000001,-4.58E-2,"25勝28敗",0.57140000000000002,5.1999999999999998E-2,"40勝30敗"]
[734,6058,"ベクトル",0.44069999999999998,-5.4100000000000002E-2,"26勝33敗",0.629,5.5599999999999997E-2,"39勝23敗"]
[735,6062,"チャーム・ケア・コーポレーション",0.58330000000000004,-5.7599999999999998E-2,"35勝25敗",0.55100000000000005,5.1999999999999998E-2,"27勝22敗"]
[736,6070,"キャリアリンク",0.5,-4.3200000000000002E-2,"33勝33敗",0.54239999999999999,4.8399999999999999E-2,"32勝27敗"]
[737,6071,"ＩＢＪ",0.5,-4.2599999999999999E-2,"25勝25敗",0.52700000000000002,4.53E-2,"39勝35敗"]
[738,6073,"アサンテ",0.39389999999999997,-1.6500000000000001E-2,"26勝40敗",0.51559999999999995,2.1899999999999999E-2,"33勝31敗"]
[739,6078,"バリューＨＲ",0.48649999999999999,-4.8500000000000001E-2,"36勝38敗",0.6452,5.9799999999999999E-2,"40勝22敗"]
[740,6080,"Ｍ＆Ａキャピタルパートナーズ",0.49120000000000003,-3.7199999999999997E-2,"28勝29敗",0.56100000000000005,5.8099999999999999E-2,"46勝36敗"]
[741,6088,"シグマクシス・ホールディングス",0.55559999999999998,-4.0800000000000003E-2,"45勝36敗",0.65449999999999997,5.4199999999999998E-2,"36勝19敗"]
[742,6089,"ウィルグループ",0.56720000000000004,-4.3700000000000003E-2,"38勝29敗",0.56579999999999997,3.9899999999999998E-2,"43勝33敗"]
[743,6095,"メドピア",0.55559999999999998,-5.4100000000000002E-2,"30勝24敗",0.44440000000000002,8.0299999999999996E-2,"32勝40敗"]
[744,6098,"リクルートホールディングス",0.45950000000000002,-2.7E-2,"34勝40敗",0.63160000000000005,5.79E-2,"36勝21敗"]
[745,6099,"エラン",0.57889999999999997,-3.5099999999999999E-2,"33勝24敗",0.51429999999999998,3.49E-2,"36勝34敗"]
[746,6101,"ツガミ",0.53129999999999999,-4.9700000000000001E-2,"34勝30敗",0.55000000000000004,5.1799999999999999E-2,"33勝27敗"]
[747,6103,"オークマ",0.3538,-3.7699999999999997E-2,"23勝42敗",0.55879999999999996,3.6900000000000002E-2,"38勝30敗"]
[748,6104,"芝浦機械",0.4118,-3.0700000000000002E-2,"28勝40敗",0.56940000000000002,3.44E-2,"41勝31敗"]
[749,6113,"アマダ",0.47139999999999999,-2.2200000000000001E-2,"33勝37敗",0.55359999999999998,3.49E-2,"31勝25敗"]
[750,6118,"アイダエンジニアリング",0.46429999999999999,-2.2800000000000001E-2,"26勝30敗",0.51790000000000003,3.4599999999999999E-2,"29勝27敗"]
[751,6134,"ＦＵＪＩ",0.46970000000000001,-2.7199999999999998E-2,"31勝35敗",0.5161,2.86E-2,"32勝30敗"]
[752,6135,"牧野フライス製作所",0.59379999999999999,-3.6499999999999998E-2,"38勝26敗",0.625,3.2899999999999999E-2,"40勝24敗"]
[753,6136,"オーエスジー",0.63929999999999998,-3.1199999999999999E-2,"39勝22敗",0.5867,2.6200000000000001E-2,"44勝31敗"]
[754,6140,"旭ダイヤモンド工業",0.51470000000000005,-3.5099999999999999E-2,"35勝33敗",0.59260000000000002,2.9499999999999998E-2,"32勝22敗"]
[755,6141,"ＤＭＧ森精機",0.43059999999999998,-3.0599999999999999E-2,"31勝41敗",0.57579999999999998,4.0500000000000001E-2,"38勝28敗"]
[756,6143,"ソディック",0.53449999999999998,-3.5400000000000001E-2,"31勝27敗",0.55130000000000001,3.1300000000000001E-2,"43勝35敗"]
[757,6146,"ディスコ",0.50600000000000001,-3.5900000000000001E-2,"42勝41敗",0.48209999999999997,4.1200000000000001E-2,"27勝29敗"]
[758,6151,"日東工器",0.66149999999999998,-2.4400000000000002E-2,"43勝22敗",0.46810000000000002,3.3599999999999998E-2,"22勝25敗"]
[759,6157,"日進工具",0.46300000000000002,-3.4000000000000002E-2,"25勝29敗",0.56140000000000001,4.6800000000000001E-2,"32勝25敗"]
[760,6167,"冨士ダイス",0.5,-2.63E-2,"35勝35敗",0.61360000000000003,4.0399999999999998E-2,"27勝17敗"]
[761,6178,"日本郵政",0.51249999999999996,-2.3E-2,"41勝39敗",0.48980000000000001,2.8400000000000002E-2,"24勝25敗"]
[762,6183,"ベルシステム２４ホールディングス",0.44640000000000002,-2.4299999999999999E-2,"25勝31敗",0.53090000000000004,3.04E-2,"43勝38敗"]
[763,6184,"鎌倉新書",0.54239999999999999,-4.4400000000000002E-2,"32勝27敗",0.55410000000000004,6.13E-2,"41勝33敗"]
[764,6191,"エアトリ",0.54549999999999998,-6.4199999999999993E-2,"30勝25敗",0.47949999999999998,6.5100000000000005E-2,"35勝38敗"]
[765,6194,"アトラエ",0.51790000000000003,-6.1800000000000001E-2,"29勝27敗",0.40300000000000002,8.8900000000000007E-2,"27勝40敗"]
[766,6196,"ストライク",0.53849999999999998,-8.6599999999999996E-2,"28勝24敗",0.61839999999999995,5.3999999999999999E-2,"47勝29敗"]
[767,6197,"ソラスト",0.62160000000000004,-2.98E-2,"23勝14敗",0.39710000000000001,3.8199999999999998E-2,"27勝41敗"]
[768,6200,"インソース",0.625,-5.0900000000000001E-2,"40勝24敗",0.6,6.7699999999999996E-2,"36勝24敗"]
[769,6201,"豊田自動織機",0.35620000000000002,-2.76E-2,"26勝47敗",0.6,3.6700000000000003E-2,"39勝26敗"]
[{"$f":"ROW()-2","v":770},6222,"島精機製作所",0.36359999999999998,-4.0399999999999998E-2,"20勝35敗",0.55559999999999998,3.1800000000000002E-2,"45勝36敗"]
[771,6235,"オプトラン",0.41820000000000002,-4.0800000000000003E-2,"23勝32敗",0.54239999999999999,4.7E-2,"32勝27敗"]
[772,6237,"イワキ",0.41770000000000002,-3.1300000000000001E-2,"33勝46敗",0.60529999999999995,5.7099999999999998E-2,"23勝15敗"]
[773,6238,"フリュー",0.57889999999999997,-4.1599999999999998E-2,"44勝32敗",0.35189999999999999,3.44E-2,"19勝35敗"]
[774,6240,"ヤマシンフィルタ",0.57140000000000002,-5.5300000000000002E-2,"32勝24敗",0.52,5.16E-2,"39勝36敗"]
[775,6247,"日阪製作所",0.49370000000000003,-2.93E-2,"39勝40敗",0.56100000000000005,3.1899999999999998E-2,"23勝18敗"]
[776,6250,"やまびこ",0.59719999999999995,-2.2800000000000001E-2,"43勝29敗",0.45760000000000001,4.7899999999999998E-2,"27勝32敗"]
[777,6254,"野村マイクロ・サイエンス",0.39389999999999997,-4.1700000000000001E-2,"39勝60敗",0.5,4.7699999999999999E-2,"33勝33敗"]
[778,6258,"平田機工",0.36919999999999997,-3.2599999999999997E-2,"24勝41敗",0.46050000000000002,3.2099999999999997E-2,"35勝41敗"]
[779,6262,"ＰＥＧＡＳＵＳ",0.48099999999999998,-5.6399999999999999E-2,"38勝41敗",0.57809999999999995,4.3999999999999997E-2,"37勝27敗"]
[780,6264,"マルマエ",0.52500000000000002,-4.8000000000000001E-2,"42勝38敗",0.4098,4.7300000000000002E-2,"25勝36敗"]
[781,6266,"タツモ",0.5645,-4.9599999999999998E-2,"35勝27敗",0.4844,6.5699999999999995E-2,"31勝33敗"]
[782,6268,"ナブテスコ",0.3836,-3.7100000000000001E-2,"28勝45敗",0.47539999999999999,3.9699999999999999E-2,"29勝32敗"]
[783,6269,"三井海洋開発",0.6,-4.7100000000000003E-2,"48勝32敗",0.57140000000000002,7.4399999999999994E-2,"32勝24敗"]
[784,6272,"レオン自動機",0.58620000000000005,-3.3599999999999998E-2,"34勝24敗",0.63890000000000002,3.4799999999999998E-2,"46勝26敗"]
[785,6273,"ＳＭＣ",0.62709999999999999,-3.15E-2,"37勝22敗",0.3881,3.2899999999999999E-2,"26勝41敗"]
[786,6277,"ホソカワミクロン",0.42859999999999998,-4.1399999999999999E-2,"36勝48敗",0.56899999999999995,4.0899999999999999E-2,"33勝25敗"]
[787,6278,"ユニオンツール",0.63490000000000002,-2.5600000000000001E-2,"40勝23敗",0.48280000000000001,5.0700000000000002E-2,"28勝30敗"]
[788,6279,"瑞光",0.41539999999999999,-3.73E-2,"27勝38敗",0.45329999999999998,3.4500000000000003E-2,"34勝41敗"]
[789,6282,"オイレス工業",0.43419999999999997,-1.61E-2,"33勝43敗",0.6825,2.75E-2,"43勝20敗"]
[790,6284,"日精エー・エス・ビー機械",0.35,-2.5399999999999999E-2,"21勝39敗",0.52170000000000005,3.5400000000000001E-2,"36勝33敗"]
[791,6287,"サトーホールディングス",0.50790000000000002,-2.3300000000000001E-2,"32勝31敗",0.49280000000000002,2.6499999999999999E-2,"34勝35敗"]
[792,6289,"技研製作所",0.4884,-3.6900000000000002E-2,"21勝22敗",0.43159999999999998,2.3599999999999999E-2,"41勝54敗"]
[793,6293,"日精樹脂工業",0.44779999999999998,-3.2899999999999999E-2,"30勝37敗",0.65449999999999997,4.7500000000000001E-2,"36勝19敗"]
[794,6294,"オカダアイヨン",0.57330000000000003,-3.5400000000000001E-2,"43勝32敗",0.56140000000000001,3.4500000000000003E-2,"32勝25敗"]
[795,6298,"ワイエイシイホールディングス",0.47439999999999999,-5.2999999999999999E-2,"37勝41敗",0.48209999999999997,6.8699999999999997E-2,"27勝29敗"]
[796,6301,"小松製作所",0.53849999999999998,-2.1100000000000001E-2,"42勝36敗",0.5,4.2299999999999997E-2,"34勝34敗"]
[797,6302,"住友重機械工業",0.44119999999999998,-3.44E-2,"30勝38敗",0.66100000000000003,2.46E-2,"39勝20敗"]
[798,6305,"日立建機",0.43590000000000001,-3.6400000000000002E-2,"34勝44敗",0.53029999999999999,0.03,"35勝31敗"]
[799,6306,"日工",0.66669999999999996,-1.5900000000000001E-2,"48勝24敗",0.56899999999999995,1.9E-2,"33勝25敗"]
[800,6309,"巴工業",0.54410000000000003,-3.6999999999999998E-2,"37勝31敗",0.55559999999999998,3.2199999999999999E-2,"30勝24敗"]
[801,6310,"井関農機",0.63490000000000002,-3.8600000000000002E-2,"40勝23敗",0.49209999999999998,2.86E-2,"31勝32敗"]
[802,6315,"ＴＯＷＡ",0.3553,-5.1200000000000002E-2,"27勝49敗",0.3115,7.0099999999999996E-2,"19勝42敗"]
[803,6323,"ローツェ",0.48609999999999998,-6.4100000000000004E-2,"35勝37敗",0.54100000000000004,5.7299999999999997E-2,"33勝28敗"]
[804,6326,"クボタ",0.59150000000000003,-3.04E-2,"42勝29敗",0.51719999999999999,3.7199999999999997E-2,"30勝28敗"]
[805,6328,"荏原実業",0.4,-3.1300000000000001E-2,"40勝60敗",0.60709999999999997,3.9699999999999999E-2,"34勝22敗"]
[806,6330,"東洋エンジニアリング",0.69230000000000003,-5.04E-2,"45勝20敗",0.42859999999999998,4.6800000000000001E-2,"21勝28敗"]
[807,6331,"三菱化工機",0.52780000000000005,-3.7900000000000003E-2,"38勝34敗",0.59619999999999995,4.1700000000000001E-2,"31勝21敗"]
[808,6332,"月島ホールディングス",0.53129999999999999,-3.3500000000000002E-2,"34勝30敗",0.63639999999999997,3.8600000000000002E-2,"42勝24敗"]
[809,6333,"帝国電機製作所",0.36070000000000002,-3.5099999999999999E-2,"22勝39敗",0.59260000000000002,3.6400000000000002E-2,"32勝22敗"]
[810,6339,"新東工業",0.51060000000000005,-3.0200000000000001E-2,"24勝23敗",0.66039999999999999,2.5999999999999999E-2,"35勝18敗"]
[811,6340,"澁谷工業",0.59089999999999998,-2.86E-2,"39勝27敗",0.6129,3.5799999999999998E-2,"38勝24敗"]
[812,6345,"アイチコーポレーション",0.5393,-2.4400000000000002E-2,"48勝41敗",0.56410000000000005,2.5899999999999999E-2,"22勝17敗"]
[813,6349,"小森コーポレーション",0.49330000000000002,-3.8699999999999998E-2,"37勝38敗",0.49120000000000003,3.9899999999999998E-2,"28勝29敗"]
[814,6351,"鶴見製作所",0.59489999999999998,-3.27E-2,"47勝32敗",0.47060000000000002,4.8599999999999997E-2,"24勝27敗"]
[815,6358,"酒井重工業",0.3448,-3.7600000000000001E-2,"30勝57敗",0.68630000000000002,3.5299999999999998E-2,"35勝16敗"]
[816,6361,"荏原製作所",0.45879999999999999,-3.5799999999999998E-2,"39勝46敗",0.5897,5.4300000000000001E-2,"23勝16敗"]
[817,6363,"酉島製作所",0.52780000000000005,-0.02,"38勝34敗",0.625,3.78E-2,"35勝21敗"]
[818,6364,"北越工業",0.4819,-3.7699999999999997E-2,"40勝43敗",0.44829999999999998,3.3500000000000002E-2,"26勝32敗"]
[819,6367,"ダイキン工業",0.49230000000000002,-0.03,"32勝33敗",0.51949999999999996,4.1399999999999999E-2,"40勝37敗"]
[820,6368,"オルガノ",0.37819999999999998,-3.5299999999999998E-2,"45勝74敗",0.5,4.4400000000000002E-2,"27勝27敗"]
[821,6369,"トーヨーカネツ",0.43059999999999998,-2.2100000000000002E-2,"31勝41敗",0.5,3.5799999999999998E-2,"25勝25敗"]
[822,6370,"栗田工業",0.53129999999999999,-3.27E-2,"34勝30敗",0.66100000000000003,4.2599999999999999E-2,"39勝20敗"]
[823,6371,"椿本チエイン",0.5333,-2.01E-2,"40勝35敗",0.57450000000000001,3.73E-2,"27勝20敗"]
[824,6376,"日機装",0.48149999999999998,-2.3400000000000001E-2,"26勝28敗",0.54410000000000003,3.9899999999999998E-2,"37勝31敗"]
[825,6379,"レイズネクスト",0.54390000000000005,-2.81E-2,"31勝26敗",0.65629999999999999,2.9100000000000001E-2,"42勝22敗"]
[826,6381,"アネスト岩田",0.63639999999999997,-2.8299999999999999E-2,"49勝28敗",0.46939999999999998,3.15E-2,"23勝26敗"]
[827,6383,"ダイフク",0.49280000000000002,-5.7000000000000002E-2,"34勝35敗",0.47889999999999999,5.33E-2,"34勝37敗"]
[828,6387,"サムコ",0.58330000000000004,-5.0500000000000003E-2,"42勝30敗",0.56669999999999998,5.3999999999999999E-2,"34勝26敗"]
[829,6390,"加藤製作所",0.49180000000000001,-5.5300000000000002E-2,"30勝31敗",0.6119,3.9800000000000002E-2,"41勝26敗"]
[830,6395,"タダノ",0.52629999999999999,-2.7300000000000001E-2,"40勝36敗",0.55559999999999998,5.2900000000000003E-2,"30勝24敗"]
[831,6406,"フジテック",0.49430000000000002,-3.3399999999999999E-2,"43勝44敗",0.35560000000000003,4.3200000000000002E-2,"16勝29敗"]
[832,6407,"ＣＫＤ",0.39129999999999998,-3.1800000000000002E-2,"27勝42敗",0.55879999999999996,3.8600000000000002E-2,"38勝30敗"]
[833,6412,"平和",0.59379999999999999,-2.1299999999999999E-2,"38勝26敗",0.5,1.7500000000000002E-2,"36勝36敗"]
[{"$f":"ROW()-2","v":834},6413,"理想科学工業",0.53949999999999998,-4.53E-2,"41勝35敗",0.74419999999999997,3.8399999999999997E-2,"32勝11敗"]
[835,6417,"三共",0.47299999999999998,-2.1499999999999998E-2,"35勝39敗",0.56520000000000004,4.19E-2,"26勝20敗"]
[836,6418,"日本金銭機械",0.47949999999999998,-5.04E-2,"35勝38敗",0.53969999999999996,3.3099999999999997E-2,"34勝29敗"]
[837,6419,"マースグループホールディングス",0.39739999999999998,-3.4200000000000001E-2,"31勝47敗",0.6,4.3999999999999997E-2,"33勝22敗"]
[838,6420,"フクシマガリレイ",0.62029999999999996,-3.0700000000000002E-2,"49勝30敗",0.62,3.3799999999999997E-2,"31勝19敗"]
[839,6430,"ダイコク電機",0.52110000000000001,-4.2999999999999997E-2,"37勝34敗",0.5,3.8699999999999998E-2,"22勝22敗"]
[840,6432,"竹内製作所",0.51849999999999996,-4.07E-2,"42勝39敗",0.55359999999999998,5.0500000000000003E-2,"31勝25敗"]
[841,6436,"アマノ",0.48,-0.03,"36勝39敗",0.62260000000000004,3.0099999999999998E-2,"33勝20敗"]
[842,6440,"ＪＵＫＩ",0.54390000000000005,-5.0500000000000003E-2,"31勝26敗",0.38159999999999999,0.03,"29勝47敗"]
[843,6445,"ジャノメ",0.49330000000000002,-4.1799999999999997E-2,"37勝38敗",0.45450000000000002,4.6699999999999998E-2,"25勝30敗"]
[844,6448,"ブラザー工業",0.5333,-3.0700000000000002E-2,"32勝28敗",0.55220000000000002,3.5900000000000001E-2,"37勝30敗"]
[845,6454,"マックス",0.49380000000000002,-2.5000000000000001E-2,"40勝41敗",0.46810000000000002,2.3099999999999999E-2,"22勝25敗"]
[846,6455,"モリタホールディングス",0.61760000000000004,-2.7199999999999998E-2,"42勝26敗",0.5,3.6700000000000003E-2,"26勝26敗"]
[847,6457,"グローリー",0.58489999999999998,-3.9199999999999999E-2,"31勝22敗",0.65080000000000005,3.1199999999999999E-2,"41勝22敗"]
[848,6458,"新晃工業",0.42109999999999997,-2.9499999999999998E-2,"40勝55敗",0.3962,6.5500000000000003E-2,"21勝32敗"]
[849,6459,"大和冷機工業",0.66669999999999996,-3.6900000000000002E-2,"52勝26敗",0.61219999999999997,2.9899999999999999E-2,"30勝19敗"]
[850,6460,"セガサミーホールディングス",0.4667,-3.5299999999999998E-2,"35勝40敗",0.59379999999999999,3.95E-2,"38勝26敗"]
[851,6463,"ＴＰＲ",0.5,-3.3500000000000002E-2,"33勝33敗",0.61699999999999999,0.04,"29勝18敗"]
[852,6464,"ツバキ・ナカシマ",0.45240000000000002,-3.9800000000000002E-2,"19勝23敗",0.53749999999999998,4.9399999999999999E-2,"43勝37敗"]
[853,6465,"ホシザキ",0.51690000000000003,-1.89E-2,"46勝43敗",0.35289999999999999,3.5200000000000002E-2,"18勝33敗"]
[854,6471,"日本精工",0.58620000000000005,-2.9499999999999998E-2,"34勝24敗",0.47299999999999998,3.1899999999999998E-2,"35勝39敗"]
[855,6472,"ＮＴＮ",0.49249999999999999,-4.4699999999999997E-2,"33勝34敗",0.54690000000000005,3.9399999999999998E-2,"35勝29敗"]
[856,6473,"ジェイテクト",0.59460000000000002,-3.6799999999999999E-2,"44勝30敗",0.40579999999999999,4.4499999999999998E-2,"28勝41敗"]
[857,6474,"不二越",0.57140000000000002,-3.5900000000000001E-2,"32勝24敗",0.47889999999999999,3.4799999999999998E-2,"34勝37敗"]
[858,6479,"ミネベアミツミ",0.54239999999999999,-3.4099999999999998E-2,"32勝27敗",0.50790000000000002,3.9300000000000002E-2,"32勝31敗"]
[859,6480,"日本トムソン",0.61019999999999996,-4.0800000000000003E-2,"36勝23敗",0.54049999999999998,3.4599999999999999E-2,"40勝34敗"]
[860,6481,"ＴＨＫ",0.51559999999999995,-3.9E-2,"33勝31敗",0.45760000000000001,4.1300000000000003E-2,"27勝32敗"]
[861,6486,"イーグル工業",0.48749999999999999,-3.1399999999999997E-2,"39勝41敗",0.51919999999999999,3.2000000000000001E-2,"27勝25敗"]
[862,6490,"ＰＩＬＬＡＲ",0.51719999999999999,-3.85E-2,"45勝42敗",0.57140000000000002,3.7900000000000003E-2,"20勝15敗"]
[863,6498,"キッツ",0.63490000000000002,-3.3799999999999997E-2,"40勝23敗",0.54759999999999998,4.53E-2,"23勝19敗"]
[864,6501,"日立製作所",0.47060000000000002,-2.0899999999999998E-2,"40勝45敗",0.53849999999999998,5.4399999999999997E-2,"28勝24敗"]
[865,6503,"三菱電機",0.58620000000000005,-2.4500000000000001E-2,"34勝24敗",0.57450000000000001,3.1800000000000002E-2,"27勝20敗"]
[866,6504,"富士電機",0.51849999999999996,-2.6499999999999999E-2,"42勝39敗",0.69350000000000001,3.7699999999999997E-2,"43勝19敗"]
[867,6506,"安川電機",0.4138,-3.3700000000000001E-2,"24勝34敗",0.54549999999999998,3.4299999999999997E-2,"36勝30敗"]
[868,6507,"シンフォニア　テクノロジー",0.41980000000000001,-3.7100000000000001E-2,"34勝47敗",0.55320000000000003,6.2700000000000006E-2,"26勝21敗"]
[869,6508,"明電舎",0.50700000000000001,-3.3399999999999999E-2,"36勝35敗",0.60340000000000005,3.27E-2,"35勝23敗"]
[870,6516,"山洋電気",0.49299999999999999,-3.56E-2,"35勝36敗",0.58460000000000001,2.9399999999999999E-2,"38勝27敗"]
[871,6517,"デンヨー",0.61539999999999995,-4.6300000000000001E-2,"40勝25敗",0.60709999999999997,4.5499999999999999E-2,"34勝22敗"]
[872,6532,"ベイカレント",0.45829999999999999,-7.3099999999999998E-2,"44勝52敗",0.52939999999999998,5.1200000000000002E-2,"27勝24敗"]
[873,6533,"Ｏｒｃｈｅｓｔｒａ　Ｈｏｌｄｉｎｇｓ",0.56920000000000004,-6.4399999999999999E-2,"37勝28敗",0.57410000000000005,7.17E-2,"31勝23敗"]
[874,6535,"アイモバイル",0.4819,-6.4000000000000001E-2,"40勝43敗",0.57689999999999997,5.7200000000000001E-2,"30勝22敗"]
[875,6539,"ＭＳ－Ｊａｐａｎ",0.52110000000000001,-3.2199999999999999E-2,"37勝34敗",0.46150000000000002,3.7100000000000001E-2,"24勝28敗"]
[876,6544,"ジャパンエレベーターサービスホールディングス",0.43330000000000002,-3.39E-2,"26勝34敗",0.66669999999999996,4.5199999999999997E-2,"44勝22敗"]
[877,6560,"エル・ティー・エス",0.28949999999999998,-7.8399999999999997E-2,"22勝54敗",0.55559999999999998,6.6299999999999998E-2,"30勝24敗"]
[878,6564,"ミダックホールディングス",0.55810000000000004,-5.1200000000000002E-2,"48勝38敗",0.36170000000000002,6.7799999999999999E-2,"17勝30敗"]
[879,6571,"キュービーネットホールディングス",0.50749999999999995,-3.5299999999999998E-2,"34勝33敗",0.54790000000000005,3.2000000000000001E-2,"40勝33敗"]
[880,6572,"オープングループ",0.68179999999999996,-7.1999999999999995E-2,"30勝14敗",0.47060000000000002,6.1499999999999999E-2,"32勝36敗"]
[881,6584,"三櫻工業",0.47949999999999998,-5.11E-2,"35勝38敗",0.44619999999999999,3.32E-2,"29勝36敗"]
[882,6586,"マキタ",0.51470000000000005,-2.8500000000000001E-2,"35勝33敗",0.50880000000000003,4.0800000000000003E-2,"29勝28敗"]
[883,6588,"東芝テック",0.69640000000000002,-3.4500000000000003E-2,"39勝17敗",0.56520000000000004,4.4699999999999997E-2,"39勝30敗"]
[884,6590,"芝浦メカトロニクス",0.54879999999999995,-4.9000000000000002E-2,"45勝37敗",0.6,7.6700000000000004E-2,"30勝20敗"]
[885,6592,"マブチモーター",0.60609999999999997,-2.5499999999999998E-2,"40勝26敗",0.55169999999999997,2.29E-2,"32勝26敗"]
[886,6594,"ニデック",0.6,-2.7199999999999998E-2,"39勝26敗",0.51429999999999998,4.0599999999999997E-2,"36勝34敗"]
[887,6615,"ユー・エム・シー・エレクトロニクス",0.57140000000000002,-4.4400000000000002E-2,"40勝30敗",0.54410000000000003,5.21E-2,"37勝31敗"]
[888,6616,"トレックス・セミコンダクター",0.64149999999999996,-5.3100000000000001E-2,"34勝19敗",0.47139999999999999,4.7699999999999999E-2,"33勝37敗"]
[889,6617,"東光高岳",0.6,-3.5999999999999997E-2,"45勝30敗",0.67800000000000005,3.6299999999999999E-2,"40勝19敗"]
[890,6619,"ダブル・スコープ",0.61040000000000005,-9.0800000000000006E-2,"47勝30敗",0.43840000000000001,8.3500000000000005E-2,"32勝41敗"]
[891,6620,"宮越ホールディングス",0.55259999999999998,-4.6100000000000002E-2,"42勝34敗",0.46150000000000002,9.4700000000000006E-2,"30勝35敗"]
[892,6622,"ダイヘン",0.4375,-4.1599999999999998E-2,"35勝45敗",0.40350000000000003,2.4E-2,"23勝34敗"]
[893,6630,"ヤーマン",0.2727,-6.3E-2,"18勝48敗",0.52049999999999996,4.2599999999999999E-2,"38勝35敗"]
[894,6632,"ＪＶＣケンウッド",0.49370000000000003,-3.7699999999999997E-2,"39勝40敗",0.55930000000000002,4.3200000000000002E-2,"33勝26敗"]
[895,6638,"ミマキエンジニアリング",0.44569999999999999,-6.9000000000000006E-2,"41勝51敗",0.4884,2.93E-2,"21勝22敗"]
[896,6640,"Ｉ－ＰＥＸ",0.57350000000000001,-3.3500000000000002E-2,"39勝29敗",0.55000000000000004,3.9199999999999999E-2,"33勝27敗"]
[897,6644,"大崎電気工業",0.60660000000000003,-2.8400000000000002E-2,"37勝24敗",0.4677,3.0300000000000001E-2,"29勝33敗"]
[{"$f":"ROW()-2","v":898},6645,"オムロン",0.5,-2.8199999999999999E-2,"34勝34敗",0.4118,4.2000000000000003E-2,"28勝40敗"]
[899,6651,"日東工業",0.52939999999999998,-2.7699999999999999E-2,"36勝32敗",0.59419999999999995,2.6599999999999999E-2,"41勝28敗"]
[900,6652,"ＩＤＥＣ",0.64710000000000001,-3.4500000000000003E-2,"44勝24敗",0.57140000000000002,2.7799999999999998E-2,"36勝27敗"]
[901,6653,"正興電機製作所",0.65149999999999997,-6.1400000000000003E-2,"43勝23敗",0.5091,3.1099999999999999E-2,"28勝27敗"]
[902,6674,"ジーエス・ユアサ　コーポレーション",0.37680000000000002,-3.5499999999999997E-2,"26勝43敗",0.60529999999999995,3.27E-2,"46勝30敗"]
[903,6699,"ダイヤモンドエレクトリックホールディングス",0.56669999999999998,-7.3200000000000001E-2,"34勝26敗",0.56759999999999999,0.1101,"42勝32敗"]
[904,6701,"日本電気",0.55840000000000001,-4.2200000000000001E-2,"43勝34敗",0.61219999999999997,5.0099999999999999E-2,"30勝19敗"]
[905,6702,"富士通",0.46050000000000002,-2.52E-2,"35勝41敗",0.64410000000000001,3.9399999999999998E-2,"38勝21敗"]
[906,6703,"沖電気工業",0.5,-2.29E-2,"32勝32敗",0.60609999999999997,3.7199999999999997E-2,"40勝26敗"]
[907,6706,"電気興業",0.58930000000000005,-3.2099999999999997E-2,"33勝23敗",0.5,2.86E-2,"29勝29敗"]
[908,6707,"サンケン電気",0.4032,-3.95E-2,"25勝37敗",0.5,5.62E-2,"34勝34敗"]
[909,6718,"アイホン",0.50849999999999995,-1.9400000000000001E-2,"30勝29敗",0.45100000000000001,2.5999999999999999E-2,"23勝28敗"]
[910,6723,"ルネサスエレクトロニクス",0.46150000000000002,-4.5100000000000001E-2,"30勝35敗",0.5625,5.4899999999999997E-2,"27勝21敗"]
[911,6724,"セイコーエプソン",0.54930000000000001,-3.1199999999999999E-2,"39勝32敗",0.61670000000000003,4.2599999999999999E-2,"37勝23敗"]
[912,6727,"ワコム",0.50770000000000004,-4.4299999999999999E-2,"33勝32敗",0.47060000000000002,4.7399999999999998E-2,"32勝36敗"]
[913,6728,"アルバック",0.52239999999999998,-3.1099999999999999E-2,"35勝32敗",0.58330000000000004,3.7600000000000001E-2,"35勝25敗"]
[914,6737,"ＥＩＺＯ",0.42420000000000002,-2.4799999999999999E-2,"28勝38敗",0.4516,5.11E-2,"28勝34敗"]
[915,6740,"ジャパンディスプレイ",0.66669999999999996,-6.6100000000000006E-2,"34勝17敗",0.3175,5.8700000000000002E-2,"20勝43敗"]
[916,6741,"日本信号",0.6129,-2.5899999999999999E-2,"38勝24敗",0.56359999999999999,2.2100000000000002E-2,"31勝24敗"]
[917,6742,"京三製作所",0.48649999999999999,-2.8899999999999999E-2,"36勝38敗",0.51849999999999996,3.2399999999999998E-2,"28勝26敗"]
[918,6744,"能美防災",0.56000000000000005,-5.3199999999999997E-2,"42勝33敗",0.59260000000000002,2.5000000000000001E-2,"32勝22敗"]
[919,6745,"ホーチキ",0.5373,-3.95E-2,"36勝31敗",0.46150000000000002,4.3200000000000002E-2,"18勝21敗"]
[920,6750,"エレコム",0.6129,-2.5000000000000001E-2,"38勝24敗",0.5,4.1599999999999998E-2,"33勝33敗"]
[921,6752,"パナソニック　ホールディングス",0.49330000000000002,-2.7099999999999999E-2,"37勝38敗",0.5333,4.02E-2,"32勝28敗"]
[922,6753,"シャープ",0.59319999999999995,-4.53E-2,"35勝24敗",0.53159999999999996,3.8300000000000001E-2,"42勝37敗"]
[923,6754,"アンリツ",0.43640000000000001,-2.5399999999999999E-2,"24勝31敗",0.45350000000000001,2.4899999999999999E-2,"39勝47敗"]
[924,6755,"富士通ゼネラル",0.30649999999999999,-2.4299999999999999E-2,"19勝43敗",0.63329999999999997,3.7199999999999997E-2,"57勝33敗"]
[925,6758,"ソニーグループ",0.51390000000000002,-2.5399999999999999E-2,"37勝35敗",0.4884,4.5400000000000003E-2,"21勝22敗"]
[926,6762,"ＴＤＫ",0.46750000000000003,-3.2000000000000001E-2,"36勝41敗",0.46550000000000002,6.1400000000000003E-2,"27勝31敗"]
[927,6763,"帝国通信工業",0.39529999999999998,-3.1699999999999999E-2,"34勝52敗",0.57140000000000002,3.2099999999999997E-2,"24勝18敗"]
[928,6768,"タムラ製作所",0.64710000000000001,-4.9700000000000001E-2,"44勝24敗",0.5373,3.27E-2,"36勝31敗"]
[929,6770,"アルプスアルパイン",0.56000000000000005,-3.6299999999999999E-2,"42勝33敗",0.47060000000000002,4.3400000000000001E-2,"32勝36敗"]
[930,6779,"日本電波工業",0.39729999999999999,-5.0299999999999997E-2,"29勝44敗",0.61219999999999997,4.3299999999999998E-2,"30勝19敗"]
[931,6785,"鈴木",0.5,-2.6200000000000001E-2,"38勝38敗",0.5161,5.21E-2,"32勝30敗"]
[932,6787,"メイコー",0.40739999999999998,-4.53E-2,"33勝48敗",0.49230000000000002,8.0399999999999999E-2,"32勝33敗"]
[933,6788,"日本トリム",0.69489999999999996,-3.1300000000000001E-2,"41勝18敗",0.4844,2.7699999999999999E-2,"31勝33敗"]
[934,6794,"フォスター電機",0.45710000000000001,-3.8399999999999997E-2,"32勝38敗",0.43209999999999998,3.8800000000000001E-2,"35勝46敗"]
[935,6798,"ＳＭＫ",0.63790000000000002,-3.2300000000000002E-2,"37勝21敗",0.56599999999999995,3.39E-2,"30勝23敗"]
[936,6800,"ヨコオ",0.47689999999999999,-2.8000000000000001E-2,"31勝34敗",0.46429999999999999,3.2800000000000003E-2,"39勝45敗"]
[937,6804,"ホシデン",0.48,-3.0800000000000001E-2,"36勝39敗",0.47460000000000002,2.7900000000000001E-2,"28勝31敗"]
[938,6806,"ヒロセ電機",0.52239999999999998,-5.1400000000000001E-2,"35勝32敗",0.5091,3.8600000000000002E-2,"28勝27敗"]
[939,6807,"日本航空電子工業",0.56410000000000005,-2.9600000000000001E-2,"44勝34敗",0.52829999999999999,4.3400000000000001E-2,"28勝25敗"]
[940,6809,"ＴＯＡ",0.50700000000000001,-2.63E-2,"36勝35敗",0.45610000000000001,3.4000000000000002E-2,"26勝31敗"]
[941,6810,"マクセル",0.54930000000000001,-2.81E-2,"39勝32敗",0.56899999999999995,4.53E-2,"33勝25敗"]
[942,6814,"古野電気",0.51280000000000003,-4.7500000000000001E-2,"40勝38敗",0.45240000000000002,4.8599999999999997E-2,"19勝23敗"]
[943,6817,"スミダコーポレーション",0.52459999999999996,-3.7199999999999997E-2,"32勝29敗",0.5696,3.7999999999999999E-2,"45勝34敗"]
[944,6820,"アイコム",0.58140000000000003,-2.41E-2,"50勝36敗",0.56669999999999998,2.47E-2,"34勝26敗"]
[945,6823,"リオン",0.54930000000000001,-2.98E-2,"39勝32敗",0.50700000000000001,3.5099999999999999E-2,"36勝35敗"]
[946,6841,"横河電機",0.42470000000000002,-3.8300000000000001E-2,"31勝42敗",0.44440000000000002,4.1200000000000001E-2,"28勝35敗"]
[947,6844,"新電元工業",0.69350000000000001,-4.19E-2,"43勝19敗",0.5,2.8500000000000001E-2,"29勝29敗"]
[948,6845,"アズビル",0.57379999999999998,-5.6899999999999999E-2,"35勝26敗",0.55169999999999997,3.3399999999999999E-2,"32勝26敗"]
[949,6849,"日本光電工業",0.54930000000000001,-3.27E-2,"39勝32敗",0.71209999999999996,3.6999999999999998E-2,"47勝19敗"]
[950,6850,"チノー",0.66249999999999998,-3.2000000000000001E-2,"53勝27敗",0.55810000000000004,2.7E-2,"24勝19敗"]
[951,6856,"堀場製作所",0.5,-4.19E-2,"35勝35敗",0.54549999999999998,3.3599999999999998E-2,"30勝25敗"]
[952,6857,"アドバンテスト",0.439,-4.02E-2,"36勝46敗",0.54900000000000004,6.83E-2,"28勝23敗"]
[953,6859,"エスペック",0.48,-2.3400000000000001E-2,"36勝39敗",0.56000000000000005,3.0700000000000002E-2,"28勝22敗"]
[954,6861,"キーエンス",0.48099999999999998,-2.6499999999999999E-2,"38勝41敗",0.46550000000000002,3.9300000000000002E-2,"27勝31敗"]
[955,6866,"日置電機",0.54549999999999998,-3.5000000000000003E-2,"36勝30敗",0.63829999999999998,2.4500000000000001E-2,"30勝17敗"]
[956,6869,"シスメックス",0.53969999999999996,-2.6700000000000002E-2,"34勝29敗",0.47760000000000002,4.2700000000000002E-2,"32勝35敗"]
[957,6871,"日本マイクロニクス",0.47299999999999998,-4.6899999999999997E-2,"35勝39敗",0.43640000000000001,3.5700000000000003E-2,"24勝31敗"]
[958,6875,"メガチップス",0.43240000000000001,-3.1699999999999999E-2,"32勝42敗",0.56140000000000001,4.4200000000000003E-2,"32勝25敗"]
[959,6879,"ＩＭＡＧＩＣＡ　ＧＲＯＵＰ",0.56920000000000004,-5.3699999999999998E-2,"37勝28敗",0.44779999999999998,4.3999999999999997E-2,"30勝37敗"]
[960,6902,"デンソー",0.54879999999999995,-2.4899999999999999E-2,"45勝37敗",0.47760000000000002,3.7199999999999997E-2,"32勝35敗"]
[961,6905,"コーセル",0.51390000000000002,-3.9300000000000002E-2,"37勝35敗",0.52380000000000004,3.0800000000000001E-2,"33勝30敗"]
[{"$f":"ROW()-2","v":962},6908,"イリソ電子工業",0.51559999999999995,-4.5600000000000002E-2,"33勝31敗",0.62319999999999998,4.7E-2,"43勝26敗"]
[963,6914,"オプテックスグループ",0.67159999999999997,-3.8600000000000002E-2,"45勝22敗",0.4138,3.4799999999999998E-2,"24勝34敗"]
[964,6920,"レーザーテック",0.55700000000000005,-5.0299999999999997E-2,"44勝35敗",0.5,6.4500000000000002E-2,"32勝32敗"]
[965,6923,"スタンレー電気",0.6,-2.8799999999999999E-2,"39勝26敗",0.61970000000000003,3.04E-2,"44勝27敗"]
[966,6925,"ウシオ電機",0.48749999999999999,-2.5899999999999999E-2,"39勝41敗",0.60709999999999997,2.7799999999999998E-2,"34勝22敗"]
[967,6928,"エノモト",0.58730000000000004,-3.9899999999999998E-2,"37勝26敗",0.57809999999999995,4.6800000000000001E-2,"37勝27敗"]
[968,6929,"日本セラミック",0.55000000000000004,-2.64E-2,"33勝27敗",0.4,2.5499999999999998E-2,"28勝42敗"]
[969,6941,"山一電機",0.54049999999999998,-3.8899999999999997E-2,"40勝34敗",0.46300000000000002,3.9899999999999998E-2,"25勝29敗"]
[970,6947,"図研",0.5,-6.2899999999999998E-2,"40勝40敗",0.5625,3.3799999999999997E-2,"27勝21敗"]
[971,6951,"日本電子",0.39439999999999997,-3.9699999999999999E-2,"28勝43敗",0.45610000000000001,4.2799999999999998E-2,"26勝31敗"]
[972,6952,"カシオ計算機",0.48480000000000001,-2.58E-2,"32勝34敗",0.5696,3.2599999999999997E-2,"45勝34敗"]
[973,6954,"ファナック",0.46150000000000002,-3.6700000000000003E-2,"24勝28敗",0.5,1.9800000000000002E-2,"32勝32敗"]
[974,6958,"日本シイエムケイ",0.63639999999999997,-3.8300000000000001E-2,"35勝20敗",0.53129999999999999,3.5900000000000001E-2,"34勝30敗"]
[975,6961,"エンプラス",0.47370000000000001,-5.1400000000000001E-2,"36勝40敗",0.55000000000000004,7.1499999999999994E-2,"33勝27敗"]
[976,6962,"大真空",0.4521,-4.4200000000000003E-2,"33勝40敗",0.60660000000000003,5.6399999999999999E-2,"37勝24敗"]
[977,6963,"ローム",0.5,-3.2599999999999997E-2,"33勝33敗",0.49299999999999999,3.27E-2,"35勝36敗"]
[978,6965,"浜松ホトニクス",0.5,-2.5999999999999999E-2,"32勝32敗",0.4516,4.3999999999999997E-2,"42勝51敗"]
[979,6966,"三井ハイテック",0.51139999999999997,-3.7900000000000003E-2,"45勝43敗",0.4627,6.8599999999999994E-2,"31勝36敗"]
[980,6971,"京セラ",0.57650000000000001,-2.1399999999999999E-2,"49勝36敗",0.60940000000000005,2.52E-2,"39勝25敗"]
[981,6976,"太陽誘電",0.46150000000000002,-3.85E-2,"30勝35敗",0.48609999999999998,3.9199999999999999E-2,"35勝37敗"]
[982,6981,"村田製作所",0.4521,-2.4500000000000001E-2,"33勝40敗",0.47539999999999999,3.9699999999999999E-2,"29勝32敗"]
[983,6986,"双葉電子工業",0.58540000000000003,-3.7999999999999999E-2,"24勝17敗",0.52780000000000005,2.5499999999999998E-2,"38勝34敗"]
[984,6988,"日東電工",0.38640000000000002,-2.6100000000000002E-2,"34勝54敗",0.46,3.8800000000000001E-2,"23勝27敗"]
[985,6995,"東海理化電機製作所",0.44290000000000002,-2.6700000000000002E-2,"31勝39敗",0.56720000000000004,3.6299999999999999E-2,"38勝29敗"]
[986,6996,"ニチコン",0.55220000000000002,-3.3799999999999997E-2,"37勝30敗",0.46029999999999999,2.5700000000000001E-2,"29勝34敗"]
[987,6997,"日本ケミコン",0.54290000000000005,-5.2400000000000002E-2,"38勝32敗",0.3382,3.04E-2,"23勝45敗"]
[988,6999,"ＫＯＡ",0.66669999999999996,-3.2300000000000002E-2,"34勝17敗",0.6714,3.5299999999999998E-2,"47勝23敗"]
[989,7003,"三井Ｅ＆Ｓ",0.4022,-7.6700000000000004E-2,"37勝55敗",0.45450000000000002,9.2999999999999999E-2,"20勝24敗"]
[990,7004,"カナデビア",0.54320000000000002,-4.3499999999999997E-2,"44勝37敗",0.55169999999999997,3.5099999999999999E-2,"32勝26敗"]
[991,7011,"三菱重工業",0.40910000000000002,-3.1099999999999999E-2,"36勝52敗",0.51670000000000005,5.6300000000000003E-2,"31勝29敗"]
[992,7012,"川崎重工業",0.47189999999999999,-5.0299999999999997E-2,"42勝47敗",0.54720000000000002,4.4999999999999998E-2,"29勝24敗"]
[993,7013,"ＩＨＩ",0.46250000000000002,-5.4699999999999999E-2,"37勝43敗",0.63270000000000004,5.3400000000000003E-2,"31勝18敗"]
[994,7033,"マネジメントソリューションズ",0.51470000000000005,-5.7299999999999997E-2,"35勝33敗",0.5806,8.1299999999999997E-2,"36勝26敗"]
[995,7034,"プロレド・パートナーズ",0.66669999999999996,-5.8000000000000003E-2,"32勝16敗",0.54790000000000005,7.3700000000000002E-2,"40勝33敗"]
[996,7038,"フロンティア・マネジメント",0.48480000000000001,-9.1399999999999995E-2,"32勝34敗",0.60660000000000003,5.1900000000000002E-2,"37勝24敗"]
[997,7059,"コプロ・ホールディングス",0.439,-4.5199999999999997E-2,"36勝46敗",0.47920000000000001,5.1200000000000002E-2,"23勝25敗"]
[998,7071,"アンビスホールディングス",0.56140000000000001,-7.3999999999999996E-2,"32勝25敗",0.51719999999999999,5.2699999999999997E-2,"30勝28敗"]
[999,7102,"日本車輌製造",0.60609999999999997,-2.3599999999999999E-2,"40勝26敗",0.63639999999999997,2.52E-2,"35勝20敗"]
[1000,7148,"ＦＰＧ",0.46879999999999999,-3.1E-2,"45勝51敗",0.5857,5.2299999999999999E-2,"41勝29敗"]
[1001,7164,"全国保証",0.54669999999999996,-2.5000000000000001E-2,"41勝34敗",0.69089999999999996,2.5600000000000001E-2,"38勝17敗"]
[1002,7167,"めぶきフィナンシャルグループ",0.52690000000000003,-3.9300000000000002E-2,"49勝44敗",0.42220000000000002,4.7E-2,"19勝26敗"]
[1003,7172,"ジャパンインベストメントアドバイザー",0.59379999999999999,-4.9799999999999997E-2,"38勝26敗",0.52380000000000004,5.1200000000000002E-2,"33勝30敗"]
[1004,7173,"東京きらぼしフィナンシャルグループ",0.52039999999999997,-3.5299999999999998E-2,"51勝47敗",0.52500000000000002,5.8400000000000001E-2,"21勝19敗"]
[1005,7180,"九州フィナンシャルグループ",0.44869999999999999,-3.32E-2,"35勝43敗",0.50880000000000003,3.9800000000000002E-2,"29勝28敗"]
[1006,7181,"かんぽ生命保険",0.52049999999999996,-3.5799999999999998E-2,"38勝35敗",0.59650000000000003,2.8500000000000001E-2,"34勝23敗"]
[1007,7182,"ゆうちょ銀行",0.47470000000000001,-4.3499999999999997E-2,"47勝52敗",0.53059999999999996,1.77E-2,"26勝23敗"]
[1008,7184,"富山第一銀行",0.51219999999999999,-4.7300000000000002E-2,"42勝40敗",0.70269999999999999,5.96E-2,"26勝11敗"]
[1009,7186,"コンコルディア・フィナンシャルグループ",0.47189999999999999,-3.2399999999999998E-2,"42勝47敗",0.6,3.7999999999999999E-2,"30勝20敗"]
[1010,7187,"ジェイリース",0.5222,-5.6899999999999999E-2,"47勝43敗",0.73329999999999995,6.2600000000000003E-2,"33勝12敗"]
[1011,7189,"西日本フィナンシャルホールディングス",0.42309999999999998,-3.4599999999999999E-2,"33勝45敗",0.42859999999999998,5.2900000000000003E-2,"18勝24敗"]
[1012,7198,"ＳＢＩアルヒ",0.57969999999999999,-4.8899999999999999E-2,"40勝29敗",0.3377,3.1099999999999999E-2,"26勝51敗"]
[1013,7199,"プレミアグループ",0.55259999999999998,-3.7900000000000003E-2,"42勝34敗",0.56000000000000005,5.5899999999999998E-2,"28勝22敗"]
[1014,7201,"日産自動車",0.45829999999999999,-4.36E-2,"33勝39敗",0.49320000000000003,4.7100000000000003E-2,"36勝37敗"]
[1015,7202,"いすゞ自動車",0.46970000000000001,-2.8299999999999999E-2,"31勝35敗",0.58930000000000005,4.3200000000000002E-2,"33勝23敗"]
[1016,7203,"トヨタ自動車",0.56340000000000001,-2.4199999999999999E-2,"40勝31敗",0.57969999999999999,3.2800000000000003E-2,"40勝29敗"]
[1017,7205,"日野自動車",0.5,-4.1799999999999997E-2,"33勝33敗",0.55559999999999998,5.2600000000000001E-2,"50勝40敗"]
[1018,7211,"三菱自動車工業",0.50619999999999998,-4.7E-2,"41勝40敗",0.45450000000000002,4.2700000000000002E-2,"30勝36敗"]
[1019,7220,"武蔵精密工業",0.48609999999999998,-4.5199999999999997E-2,"35勝37敗",0.56940000000000002,5.0999999999999997E-2,"41勝31敗"]
[1020,7224,"新明和工業",0.4,-0.03,"26勝39敗",0.57140000000000002,3.6600000000000001E-2,"32勝24敗"]
[1021,7226,"極東開発工業",0.55259999999999998,-3.4099999999999998E-2,"42勝34敗",0.59619999999999995,4.1000000000000002E-2,"31勝21敗"]
[1022,7231,"トピー工業",0.42370000000000002,-4.2700000000000002E-2,"25勝34敗",0.434,3.4599999999999999E-2,"23勝30敗"]
[1023,7236,"ティラド",0.44590000000000002,-3.04E-2,"33勝41敗",0.57410000000000005,4.5999999999999999E-2,"31勝23敗"]
[1024,7238,"曙ブレーキ工業",0.71109999999999995,-5.1999999999999998E-2,"32勝13敗",0.52310000000000001,6.0499999999999998E-2,"34勝31敗"]
[1025,7239,"タチエス",0.38569999999999999,-2.7099999999999999E-2,"27勝43敗",0.57630000000000003,3.7400000000000003E-2,"34勝25敗"]
[{"$f":"ROW()-2","v":1026},7240,"ＮＯＫ",0.4,-1.9900000000000001E-2,"28勝42敗",0.48280000000000001,3.5999999999999997E-2,"28勝30敗"]
[1027,7241,"フタバ産業",0.52170000000000005,-3.4700000000000002E-2,"36勝33敗",0.47620000000000001,3.6900000000000002E-2,"30勝33敗"]
[1028,7242,"カヤバ",0.48649999999999999,-3.9800000000000002E-2,"36勝38敗",0.47370000000000001,4.6399999999999997E-2,"27勝30敗"]
[1029,7244,"市光工業",0.4909,-4.8899999999999999E-2,"27勝28敗",0.52239999999999998,4.5499999999999999E-2,"35勝32敗"]
[1030,7245,"大同メタル工業",0.5,-3.9399999999999998E-2,"35勝35敗",0.51790000000000003,2.9600000000000001E-2,"29勝27敗"]
[1031,7246,"プレス工業",0.49299999999999999,-3.5299999999999998E-2,"35勝36敗",0.48209999999999997,3.1699999999999999E-2,"27勝29敗"]
[1032,7250,"太平洋工業",0.55000000000000004,-3.5700000000000003E-2,"33勝27敗",0.5333,4.7699999999999999E-2,"32勝28敗"]
[1033,7259,"アイシン",0.42249999999999999,-3.1899999999999998E-2,"30勝41敗",0.53620000000000001,3.2099999999999997E-2,"37勝32敗"]
[1034,7261,"マツダ",0.43659999999999999,-4.9599999999999998E-2,"31勝40敗",0.5,4.53E-2,"33勝33敗"]
[1035,7267,"本田技研工業",0.44929999999999998,-2.2200000000000001E-2,"31勝38敗",0.46479999999999999,4.1500000000000002E-2,"33勝38敗"]
[1036,7269,"スズキ",0.57499999999999996,-4.1399999999999999E-2,"46勝34敗",0.57140000000000002,0.05,"36勝27敗"]
[1037,7270,"ＳＵＢＡＲＵ",0.49299999999999999,-3.6600000000000001E-2,"35勝36敗",0.46879999999999999,4.5499999999999999E-2,"30勝34敗"]
[1038,7272,"ヤマハ発動機",0.41539999999999999,-3.6900000000000002E-2,"27勝38敗",0.5,3.3599999999999998E-2,"30勝30敗"]
[1039,7276,"小糸製作所",0.54690000000000005,-4.6199999999999998E-2,"35勝29敗",0.57379999999999998,3.8199999999999998E-2,"35勝26敗"]
[1040,7278,"エクセディ",0.45679999999999998,-2.2700000000000001E-2,"37勝44敗",0.63329999999999997,4.36E-2,"38勝22敗"]
[1041,7280,"ミツバ",0.59460000000000002,-3.9800000000000002E-2,"44勝30敗",0.57140000000000002,6.4600000000000005E-2,"32勝24敗"]
[1042,7282,"豊田合成",0.54410000000000003,-2.7300000000000001E-2,"37勝31敗",0.45829999999999999,3.3599999999999998E-2,"33勝39敗"]
[1043,7283,"愛三工業",0.50670000000000004,-3.85E-2,"38勝37敗",0.57889999999999997,5.2900000000000003E-2,"33勝24敗"]
[1044,7294,"ヨロズ",0.46550000000000002,-3.9399999999999998E-2,"27勝31敗",0.375,3.8199999999999998E-2,"27勝45敗"]
[1045,7296,"エフ・シー・シー",0.41789999999999999,-2.41E-2,"28勝39敗",0.5484,2.58E-2,"34勝28敗"]
[1046,7309,"シマノ",0.51319999999999999,-3.3500000000000002E-2,"39勝37敗",0.47620000000000001,3.6999999999999998E-2,"30勝33敗"]
[1047,7313,"テイ・エス　テック",0.51429999999999998,-2.52E-2,"36勝34敗",0.42420000000000002,3.0800000000000001E-2,"28勝38敗"]
[1048,7322,"三十三フィナンシャルグループ",0.5111,-3.1600000000000003E-2,"46勝44敗",0.58330000000000004,4.1099999999999998E-2,"28勝20敗"]
[1049,7327,"第四北越フィナンシャルグループ",0.54120000000000001,-3.9199999999999999E-2,"46勝39敗",0.44190000000000002,3.1300000000000001E-2,"19勝24敗"]
[1050,7408,"ジャムコ",0.60560000000000003,-4.82E-2,"43勝28敗",0.6,5.5199999999999999E-2,"33勝22敗"]
[1051,7414,"小野建",0.46479999999999999,-1.67E-2,"33勝38敗",0.63639999999999997,2.3199999999999998E-2,"35勝20敗"]
[1052,7419,"ノジマ",0.4022,-2.29E-2,"37勝55敗",0.48330000000000001,2.7E-2,"29勝31敗"]
[1053,7420,"佐鳥電機",0.5857,-3.0099999999999998E-2,"41勝29敗",0.60319999999999996,4.1000000000000002E-2,"38勝25敗"]
[1054,7421,"カッパ・クリエイト",0.43480000000000002,-1.9199999999999998E-2,"30勝39敗",0.65380000000000005,2.64E-2,"34勝18敗"]
[1055,7433,"伯東",0.52629999999999999,-2.75E-2,"40勝36敗",0.61539999999999995,3.6400000000000002E-2,"32勝20敗"]
[1056,7438,"コンドーテック",0.55220000000000002,-2.12E-2,"37勝30敗",0.625,2.64E-2,"25勝15敗"]
[1057,7447,"ナガイレーベン",0.71430000000000005,-3.49E-2,"50勝20敗",0.47460000000000002,2.93E-2,"28勝31敗"]
[1058,7453,"良品計画",0.5645,-4.6800000000000001E-2,"35勝27敗",0.55700000000000005,4.3900000000000002E-2,"44勝35敗"]
[1059,7456,"松田産業",0.56159999999999999,-4.0399999999999998E-2,"41勝32敗",0.62960000000000005,0.03,"34勝20敗"]
[1060,7458,"第一興商",0.58489999999999998,-3.1199999999999999E-2,"31勝22敗",0.47620000000000001,4.2900000000000001E-2,"30勝33敗"]
[1061,7459,"メディパルホールディングス",0.36509999999999998,-5.2999999999999999E-2,"23勝40敗",0.64290000000000003,2.4400000000000002E-2,"36勝20敗"]
[1062,7466,"ＳＰＫ",0.55559999999999998,-5.74E-2,"35勝28敗",0.58819999999999995,2.6200000000000001E-2,"30勝21敗"]
[1063,7467,"萩原電気ホールディングス",0.57969999999999999,-3.2399999999999998E-2,"40勝29敗",0.56059999999999999,3.5499999999999997E-2,"37勝29敗"]
[1064,7475,"アルビス",0.57330000000000003,-2.7099999999999999E-2,"43勝32敗",0.55000000000000004,2.53E-2,"22勝18敗"]
[1065,7476,"アズワン",0.43140000000000001,-3.6200000000000003E-2,"22勝29敗",0.52170000000000005,3.8300000000000001E-2,"36勝33敗"]
[1066,7482,"シモジマ",0.49230000000000002,-6.3200000000000006E-2,"32勝33敗",0.54,2.4500000000000001E-2,"27勝23敗"]
[1067,7483,"ドウシシャ",0.54169999999999996,-2.7799999999999998E-2,"39勝33敗",0.56669999999999998,2.5899999999999999E-2,"34勝26敗"]
[1068,7504,"高速",0.5,-6.6400000000000001E-2,"34勝34敗",0.62960000000000005,3.85E-2,"34勝20敗"]
[1069,7508,"Ｇ－７ホールディングス",0.50719999999999998,-3.8800000000000001E-2,"35勝34敗",0.58330000000000004,4.6899999999999997E-2,"35勝25敗"]
[1070,7510,"たけびし",0.40789999999999998,-2.0799999999999999E-2,"31勝45敗",0.5968,3.1800000000000002E-2,"37勝25敗"]
[1071,7513,"コジマ",0.51390000000000002,-2.7199999999999998E-2,"37勝35敗",0.49299999999999999,2.2700000000000001E-2,"35勝36敗"]
[1072,7516,"コーナン商事",0.58020000000000005,-3.04E-2,"47勝34敗",0.57750000000000001,0.02,"41勝30敗"]
[1073,7518,"ネットワンシステムズ",0.4032,-4.2599999999999999E-2,"25勝37敗",0.52459999999999996,5.4100000000000002E-2,"32勝29敗"]
[1074,7520,"エコス",0.61539999999999995,-3.3099999999999997E-2,"32勝20敗",0.63639999999999997,2.23E-2,"35勝20敗"]
[1075,7522,"ワタミ",0.47370000000000001,-3.1600000000000003E-2,"27勝30敗",0.61729999999999996,2.98E-2,"50勝31敗"]
[1076,7525,"リックス",0.45879999999999999,-3.3500000000000002E-2,"39勝46敗",0.55320000000000003,3.0200000000000001E-2,"26勝21敗"]
[1077,7532,"パン・パシフィック・インターナショナルホールディングス",0.59489999999999998,-3.2800000000000003E-2,"47勝32敗",0.63039999999999996,4.6800000000000001E-2,"29勝17敗"]
[1078,7537,"丸文",0.56159999999999999,-3.5200000000000002E-2,"41勝32敗",0.51559999999999995,4.6699999999999998E-2,"33勝31敗"]
[1079,7545,"西松屋チェーン",0.49430000000000002,-3.0599999999999999E-2,"43勝44敗",0.39219999999999999,3.0300000000000001E-2,"20勝31敗"]
[1080,7550,"ゼンショーホールディングス",0.53410000000000002,-3.27E-2,"47勝41敗",0.79590000000000005,3.32E-2,"39勝10敗"]
[1081,7552,"ハピネット",0.55559999999999998,-4.4999999999999998E-2,"45勝36敗",0.63160000000000005,4.19E-2,"36勝21敗"]
[1082,7554,"幸楽苑",0.65710000000000002,-2.58E-2,"23勝12敗",0.56340000000000001,3.7900000000000003E-2,"40勝31敗"]
[1083,7575,"日本ライフライン",0.47460000000000002,-2.8299999999999999E-2,"28勝31敗",0.56359999999999999,4.3400000000000001E-2,"31勝24敗"]
[1084,7581,"サイゼリヤ",0.57140000000000002,-3.8899999999999997E-2,"52勝39敗",0.58330000000000004,4.07E-2,"35勝25敗"]
[1085,7593,"ＶＴホールディングス",0.5161,-2.6800000000000001E-2,"32勝30敗",0.43330000000000002,2.1499999999999998E-2,"26勝34敗"]
[1086,7595,"アルゴグラフィックス",0.63490000000000002,-4.0099999999999997E-2,"40勝23敗",0.62,3.44E-2,"31勝19敗"]
[1087,7596,"魚力",0.4516,-1.3599999999999999E-2,"42勝51敗",0.55320000000000003,2.41E-2,"26勝21敗"]
[1088,7599,"ＩＤＯＭ",0.50649999999999995,-5.33E-2,"39勝38敗",0.5,3.7400000000000003E-2,"27勝27敗"]
[1089,7600,"日本エム・ディ・エム",0.56599999999999995,-4.1700000000000001E-2,"30勝23敗",0.47499999999999998,3.5099999999999999E-2,"38勝42敗"]
[{"$f":"ROW()-2","v":1090},7605,"フジ・コーポレーション",0.47220000000000001,-2.9899999999999999E-2,"34勝38敗",0.61670000000000003,4.4900000000000002E-2,"37勝23敗"]
[1091,7606,"ユナイテッドアローズ",0.4839,-3.9E-2,"30勝32敗",0.53849999999999998,4.7500000000000001E-2,"42勝36敗"]
[1092,7607,"進和",0.52700000000000002,-2.7E-2,"39勝35敗",0.60780000000000001,2.98E-2,"31勝20敗"]
[1093,7609,"ダイトロン",0.52859999999999996,-3.2399999999999998E-2,"37勝33敗",0.49249999999999999,4.3799999999999999E-2,"33勝34敗"]
[1094,7611,"ハイデイ日高",0.56000000000000005,-2.2599999999999999E-2,"42勝33敗",0.46879999999999999,2.81E-2,"30勝34敗"]
[1095,7613,"シークス",0.5,-3.1600000000000003E-2,"37勝37敗",0.42109999999999997,3.9100000000000003E-2,"32勝44敗"]
[1096,7616,"コロワイド",0.52939999999999998,-2.9399999999999999E-2,"36勝32敗",0.68969999999999998,5.0900000000000001E-2,"40勝18敗"]
[1097,7628,"オーハシテクニカ",0.57650000000000001,-2.5000000000000001E-2,"49勝36敗",0.64859999999999995,2.5600000000000001E-2,"24勝13敗"]
[1098,7630,"壱番屋",0.59260000000000002,-1.72E-2,"32勝22敗",0.47620000000000001,1.7600000000000001E-2,"30勝33敗"]
[1099,7637,"白銅",0.56059999999999999,-3.6299999999999999E-2,"37勝29敗",0.53849999999999998,3.3300000000000003E-2,"28勝24敗"]
[1100,7649,"スギホールディングス",0.54430000000000001,-2.5499999999999998E-2,"43勝36敗",0.55740000000000001,2.7699999999999999E-2,"34勝27敗"]
[1101,7679,"薬王堂ホールディングス",0.58819999999999995,-6.4000000000000001E-2,"40勝28敗",0.45,3.2500000000000001E-2,"27勝33敗"]
[1102,7683,"ダブルエー",0.63290000000000002,-4.0399999999999998E-2,"50勝29敗",0.5,4.5699999999999998E-2,"26勝26敗"]
[1103,7701,"島津製作所",0.5,-2.2800000000000001E-2,"41勝41敗",0.4098,3.0599999999999999E-2,"25勝36敗"]
[1104,7715,"長野計器",0.41980000000000001,-5.4100000000000002E-2,"34勝47敗",0.42859999999999998,4.4499999999999998E-2,"15勝20敗"]
[1105,7717,"ブイ・テクノロジー",0.56000000000000005,-3.85E-2,"28勝22敗",0.58430000000000004,4.3299999999999998E-2,"52勝37敗"]
[1106,7718,"スター精密",0.30649999999999999,-2.01E-2,"19勝43敗",0.4844,2.87E-2,"31勝33敗"]
[1107,7721,"東京計器",0.55410000000000004,-3.5900000000000001E-2,"41勝33敗",0.61760000000000004,3.8800000000000001E-2,"21勝13敗"]
[1108,7723,"愛知時計電機",0.5,-0.02,"32勝32敗",0.67689999999999995,4.4999999999999998E-2,"44勝21敗"]
[1109,7725,"インターアクション",0.52459999999999996,-4.8099999999999997E-2,"32勝29敗",0.5,4.7899999999999998E-2,"34勝34敗"]
[1110,7729,"東京精密",0.54790000000000005,-4.3400000000000001E-2,"40勝33敗",0.64810000000000001,3.9600000000000003E-2,"35勝19敗"]
[1111,7730,"マニー",0.55930000000000002,-3.0700000000000002E-2,"33勝26敗",0.5373,3.9899999999999998E-2,"36勝31敗"]
[1112,7731,"ニコン",0.36759999999999998,-3.1E-2,"25勝43敗",0.56720000000000004,3.5000000000000003E-2,"38勝29敗"]
[1113,7732,"トプコン",0.50680000000000003,-3.9899999999999998E-2,"37勝36敗",0.58209999999999995,5.9900000000000002E-2,"39勝28敗"]
[1114,7733,"オリンパス",0.5806,-2.8000000000000001E-2,"36勝26敗",0.63460000000000005,5.3900000000000003E-2,"33勝19敗"]
[1115,7734,"理研計器",0.5222,-4.2700000000000002E-2,"47勝43敗",0.72,4.7800000000000002E-2,"36勝14敗"]
[1116,7735,"ＳＣＲＥＥＮホールディングス",0.36990000000000001,-2.8199999999999999E-2,"27勝46敗",0.44440000000000002,6.1699999999999998E-2,"24勝30敗"]
[1117,7739,"キヤノン電子",0.54549999999999998,-2.58E-2,"36勝30敗",0.57889999999999997,3.0200000000000001E-2,"33勝24敗"]
[1118,7740,"タムロン",0.55810000000000004,-3.0099999999999998E-2,"48勝38敗",0.41670000000000001,5.3999999999999999E-2,"20勝28敗"]
[1119,7741,"ＨＯＹＡ",0.43659999999999999,-6.2899999999999998E-2,"31勝40敗",0.44230000000000003,3.7699999999999997E-2,"23勝29敗"]
[1120,7743,"シード",0.47539999999999999,-2.81E-2,"29勝32敗",0.54049999999999998,4.7E-2,"40勝34敗"]
[1121,7744,"ノーリツ鋼機",0.64290000000000003,-4.07E-2,"45勝25敗",0.59570000000000001,5.16E-2,"28勝19敗"]
[1122,7745,"Ａ＆Ｄホロンホールディングス",0.50680000000000003,-3.7100000000000001E-2,"37勝36敗",0.57999999999999996,4.87E-2,"29勝21敗"]
[1123,7747,"朝日インテック",0.5373,-3.4799999999999998E-2,"36勝31敗",0.40579999999999999,4.0800000000000003E-2,"28勝41敗"]
[1124,7751,"キヤノン",0.66039999999999999,-3.0700000000000002E-2,"35勝18敗",0.61819999999999997,3.6600000000000001E-2,"34勝21敗"]
[1125,7752,"リコー",0.52939999999999998,-3.4500000000000003E-2,"36勝32敗",0.5333,4.36E-2,"32勝28敗"]
[1126,7762,"シチズン時計",0.48570000000000002,-2.4899999999999999E-2,"34勝36敗",0.56859999999999999,4.4699999999999997E-2,"29勝22敗"]
[1127,7769,"リズム",0.55679999999999996,-4.7399999999999998E-2,"49勝39敗",0.4783,5.8900000000000001E-2,"22勝24敗"]
[1128,7780,"メニコン",0.56059999999999999,-6.7299999999999999E-2,"37勝29敗",0.42670000000000002,3.7699999999999997E-2,"32勝43敗"]
[1129,7817,"パラマウントベッドホールディングス",0.5373,-2.9600000000000001E-2,"36勝31敗",0.57350000000000001,3.9E-2,"39勝29敗"]
[1130,7818,"トランザクション",0.56920000000000004,-4.4900000000000002E-2,"37勝28敗",0.42859999999999998,3.9199999999999999E-2,"24勝32敗"]
[1131,7820,"ニホンフラッシュ",0.68179999999999996,-3.2000000000000001E-2,"30勝14敗",0.32840000000000003,3.8399999999999997E-2,"22勝45敗"]
[1132,7821,"前田工繊",0.48680000000000001,-2.6100000000000002E-2,"37勝39敗",0.62260000000000004,3.4700000000000002E-2,"33勝20敗"]
[1133,7826,"フルヤ金属",0.45779999999999998,-4.3499999999999997E-2,"38勝45敗",0.47170000000000001,4.7100000000000003E-2,"25勝28敗"]
[1134,7832,"バンダイナムコホールディングス",0.47620000000000001,-5.9400000000000001E-2,"30勝33敗",0.4667,3.9699999999999999E-2,"28勝32敗"]
[1135,7839,"ＳＨＯＥＩ",0.58440000000000003,-2.8199999999999999E-2,"45勝32敗",0.5,5.1700000000000003E-2,"33勝33敗"]
[1136,7840,"フランスベッドホールディングス",0.59460000000000002,-2.3599999999999999E-2,"44勝30敗",0.65310000000000001,3.2300000000000002E-2,"32勝17敗"]
[1137,7844,"マーベラス",0.56599999999999995,-3.4000000000000002E-2,"30勝23敗",0.48809999999999998,3.3799999999999997E-2,"41勝43敗"]
[1138,7846,"パイロットコーポレーション",0.59719999999999995,-2.7199999999999998E-2,"43勝29敗",0.57630000000000003,3.2300000000000002E-2,"34勝25敗"]
[1139,7856,"萩原工業",0.50980000000000003,-1.95E-2,"26勝25敗",0.61329999999999996,3.09E-2,"46勝29敗"]
[1140,7860,"エイベックス",0.57140000000000002,-2.6499999999999999E-2,"40勝30敗",0.5161,4.36E-2,"32勝30敗"]
[1141,7864,"フジシールインターナショナル",0.47689999999999999,-5.7000000000000002E-2,"31勝34敗",0.47270000000000001,3.49E-2,"26勝29敗"]
[1142,7867,"タカラトミー",0.44190000000000002,-2.8799999999999999E-2,"38勝48敗",0.62790000000000001,3.7499999999999999E-2,"27勝16敗"]
[1143,7868,"広済堂ホールディングス",0.46150000000000002,-4.5100000000000001E-2,"42勝49敗",0.53700000000000003,7.9100000000000004E-2,"29勝25敗"]
[1144,7874,"レック",0.50790000000000002,-3.2099999999999997E-2,"32勝31敗",0.49230000000000002,3.5999999999999997E-2,"32勝33敗"]
[1145,7888,"三光合成",0.61539999999999995,-4.58E-2,"40勝25敗",0.51670000000000005,3.6499999999999998E-2,"31勝29敗"]
[1146,7893,"プロネクサス",0.53520000000000001,-3.32E-2,"38勝33敗",0.52270000000000005,1.9800000000000002E-2,"23勝21敗"]
[1147,7911,"ＴＯＰＰＡＮホールディングス",0.41980000000000001,-3.5999999999999997E-2,"34勝47敗",0.63790000000000002,3.2300000000000002E-2,"37勝21敗"]
[1148,7912,"大日本印刷",0.44440000000000002,-2.9600000000000001E-2,"28勝35敗",0.48149999999999998,3.61E-2,"26勝28敗"]
[1149,7914,"共同印刷",0.37330000000000002,-3.5099999999999999E-2,"28勝47敗",0.48080000000000001,2.0400000000000001E-2,"25勝27敗"]
[1150,7915,"ＮＩＳＳＨＡ",0.4909,-4.1700000000000001E-2,"27勝28敗",0.5333,4.6699999999999998E-2,"32勝28敗"]
[1151,7917,"ＺＡＣＲＯＳ",0.57750000000000001,-2.6200000000000001E-2,"41勝30敗",0.54549999999999998,3.6200000000000003E-2,"30勝25敗"]
[1152,7921,"ＴＡＫＡＲＡ　＆　ＣＯＭＰＡＮＹ",0.5444,-3.8300000000000001E-2,"49勝41敗",0.57689999999999997,2.6800000000000001E-2,"30勝22敗"]
[1153,7925,"前澤化成工業",0.67159999999999997,-1.2500000000000001E-2,"45勝22敗",0.61019999999999996,2.2200000000000001E-2,"36勝23敗"]
[{"$f":"ROW()-2","v":1154},7931,"未来工業",0.41110000000000002,-2.9499999999999998E-2,"37勝53敗",0.60419999999999996,3.5900000000000001E-2,"29勝19敗"]
[1155,7936,"アシックス",0.59570000000000001,-4.4499999999999998E-2,"56勝38敗",0.6522,6.4000000000000001E-2,"30勝16敗"]
[1156,7942,"ＪＳＰ",0.55379999999999996,-1.55E-2,"36勝29敗",0.57630000000000003,2.81E-2,"34勝25敗"]
[1157,7943,"ニチハ",0.47370000000000001,-3.0800000000000001E-2,"36勝40敗",0.64439999999999997,3.0599999999999999E-2,"29勝16敗"]
[1158,7947,"エフピコ",0.55169999999999997,-6.2199999999999998E-2,"32勝26敗",0.47920000000000001,3.3799999999999997E-2,"23勝25敗"]
[1159,7949,"小松ウオール工業",0.55710000000000004,-2.63E-2,"39勝31敗",0.65310000000000001,2.9899999999999999E-2,"32勝17敗"]
[1160,7951,"ヤマハ",0.61219999999999997,-3.3300000000000003E-2,"30勝19敗",0.40629999999999999,4.1700000000000001E-2,"26勝38敗"]
[1161,7952,"河合楽器製作所",0.57530000000000003,-3.3599999999999998E-2,"42勝31敗",0.39340000000000003,4.0399999999999998E-2,"24勝37敗"]
[1162,7955,"クリナップ",0.41270000000000001,-3.6400000000000002E-2,"26勝37敗",0.62260000000000004,2.52E-2,"33勝20敗"]
[1163,7956,"ピジョン",0.73809999999999998,-2.7799999999999998E-2,"31勝11敗",0.51719999999999999,4.2299999999999997E-2,"45勝42敗"]
[1164,7958,"天馬",0.46839999999999998,-3.7699999999999997E-2,"37勝42敗",0.57410000000000005,2.7400000000000001E-2,"31勝23敗"]
[1165,7962,"キングジム",0.6,-5.2499999999999998E-2,"27勝18敗",0.41670000000000001,1.4800000000000001E-2,"25勝35敗"]
[1166,7965,"象印マホービン",0.51249999999999996,-3.3799999999999997E-2,"41勝39敗",0.37880000000000003,2.8500000000000001E-2,"25勝41敗"]
[1167,7966,"リンテック",0.50719999999999998,-2.5899999999999999E-2,"35勝34敗",0.69230000000000003,2.5499999999999998E-2,"36勝16敗"]
[1168,7970,"信越ポリマー",0.57750000000000001,-3.5200000000000002E-2,"41勝30敗",0.66669999999999996,3.6700000000000003E-2,"32勝16敗"]
[1169,7972,"イトーキ",0.55420000000000003,-4.0099999999999997E-2,"46勝37敗",0.58699999999999997,3.9899999999999998E-2,"27勝19敗"]
[1170,7974,"任天堂",0.49370000000000003,-2.5499999999999998E-2,"39勝40敗",0.6038,4.0399999999999998E-2,"32勝21敗"]
[1171,7976,"三菱鉛筆",0.64,-3.1199999999999999E-2,"48勝27敗",0.51719999999999999,3.4000000000000002E-2,"30勝28敗"]
[1172,7979,"松風",0.43880000000000002,-2.6800000000000001E-2,"43勝55敗",0.82499999999999996,4.19E-2,"33勝7敗"]
[1173,7981,"タカラスタンダード",0.6,-2.7799999999999998E-2,"36勝24敗",0.42109999999999997,2.8400000000000002E-2,"24勝33敗"]
[1174,7984,"コクヨ",0.51790000000000003,-1.9099999999999999E-2,"29勝27敗",0.71930000000000005,4.58E-2,"41勝16敗"]
[1175,7988,"ニフコ",0.52539999999999998,-3.2300000000000002E-2,"31勝28敗",0.44829999999999998,4.48E-2,"26勝32敗"]
[1176,7989,"立川ブラインド工業",0.6552,-2.3099999999999999E-2,"38勝20敗",0.71430000000000005,3.49E-2,"35勝14敗"]
[1177,7990,"グローブライド",0.44119999999999998,-2.24E-2,"30勝38敗",0.53129999999999999,3.1899999999999998E-2,"34勝30敗"]
[1178,7994,"オカムラ",0.52500000000000002,-2.4299999999999999E-2,"42勝38敗",0.59619999999999995,3.3799999999999997E-2,"31勝21敗"]
[1179,7995,"バルカー",0.50600000000000001,-3.1600000000000003E-2,"42勝41敗",0.61539999999999995,2.87E-2,"32勝20敗"]
[1180,8001,"伊藤忠商事",0.49409999999999998,-1.9400000000000001E-2,"42勝43敗",0.64290000000000003,5.33E-2,"27勝15敗"]
[1181,8002,"丸紅",0.4632,-3.3599999999999998E-2,"44勝51敗",0.52729999999999999,3.9699999999999999E-2,"29勝26敗"]
[1182,8005,"スクロール",0.46389999999999998,-2.98E-2,"45勝52敗",0.48149999999999998,4.4600000000000001E-2,"26勝28敗"]
[1183,8007,"高島",0.34379999999999999,-2.4199999999999999E-2,"33勝63敗",0.72919999999999996,6.0900000000000003E-2,"35勝13敗"]
[1184,8008,"ヨンドシーホールディングス",0.55169999999999997,-2.3699999999999999E-2,"32勝26敗",0.59619999999999995,1.67E-2,"31勝21敗"]
[1185,8011,"三陽商会",0.55059999999999998,-3.5499999999999997E-2,"49勝40敗",0.51160000000000005,8.0699999999999994E-2,"22勝21敗"]
[1186,8012,"長瀬産業",0.49409999999999998,-2.98E-2,"42勝43敗",0.48,2.6700000000000002E-2,"24勝26敗"]
[1187,8014,"蝶理",0.39679999999999999,-2.5399999999999999E-2,"25勝38敗",0.70830000000000004,4.4400000000000002E-2,"34勝14敗"]
[1188,8015,"豊田通商",0.41670000000000001,-3.4299999999999997E-2,"35勝49敗",0.59650000000000003,4.3999999999999997E-2,"34勝23敗"]
[1189,8016,"オンワードホールディングス",0.4,-3.9399999999999998E-2,"36勝54敗",0.65449999999999997,3.4599999999999999E-2,"36勝19敗"]
[1190,8020,"兼松",0.49399999999999999,-2.3699999999999999E-2,"41勝42敗",0.55930000000000002,3.2300000000000002E-2,"33勝26敗"]
[1191,8022,"美津濃",0.53849999999999998,-3.4299999999999997E-2,"49勝42敗",0.59570000000000001,6.8699999999999997E-2,"28勝19敗"]
[1192,8031,"三井物産",0.43209999999999998,-2.8000000000000001E-2,"35勝46敗",0.71430000000000005,3.5000000000000003E-2,"25勝10敗"]
[1193,8032,"日本紙パルプ商事",0.49409999999999998,-3.1600000000000003E-2,"42勝43敗",0.54169999999999996,2.41E-2,"26勝22敗"]
[1194,8035,"東京エレクトロン",0.46150000000000002,-3.8600000000000002E-2,"36勝42敗",0.51719999999999999,3.9699999999999999E-2,"30勝28敗"]
[1195,8037,"カメイ",0.62029999999999996,-3.44E-2,"49勝30敗",0.61109999999999998,2.9100000000000001E-2,"22勝14敗"]
[1196,8043,"スターゼン",0.54259999999999997,-2.8500000000000001E-2,"51勝43敗",0.59519999999999995,3.1899999999999998E-2,"25勝17敗"]
[1197,8050,"セイコーグループ",0.47949999999999998,-3.9800000000000002E-2,"35勝38敗",0.52729999999999999,3.4200000000000001E-2,"29勝26敗"]
[1198,8051,"山善",0.52439999999999998,-3.0499999999999999E-2,"43勝39敗",0.72919999999999996,3.1300000000000001E-2,"35勝13敗"]
[1199,8052,"椿本興業",0.4824,-2.8199999999999999E-2,"41勝44敗",0.62070000000000003,3.6499999999999998E-2,"36勝22敗"]
[1200,8053,"住友商事",0.46879999999999999,-2.92E-2,"45勝51敗",0.60660000000000003,3.8899999999999997E-2,"37勝24敗"]
[1201,8056,"ＢＩＰＲＯＧＹ",0.67210000000000003,-2.3800000000000002E-2,"41勝20敗",0.56859999999999999,4.99E-2,"29勝22敗"]
[1202,8057,"内田洋行",0.5333,-3.5099999999999999E-2,"40勝35敗",0.52459999999999996,4.07E-2,"32勝29敗"]
[1203,8058,"三菱商事",0.43009999999999998,-2.5100000000000001E-2,"40勝53敗",0.6,2.8000000000000001E-2,"33勝22敗"]
[1204,8059,"第一実業",0.51249999999999996,-2.86E-2,"41勝39敗",0.54349999999999998,3.6799999999999999E-2,"25勝21敗"]
[1205,8060,"キヤノンマーケティングジャパン",0.41670000000000001,-2.4299999999999999E-2,"30勝42敗",0.57140000000000002,2.6100000000000002E-2,"28勝21敗"]
[1206,8061,"西華産業",0.59150000000000003,-3.09E-2,"42勝29敗",0.57889999999999997,4.4499999999999998E-2,"33勝24敗"]
[1207,8065,"佐藤商事",0.375,-3.9300000000000002E-2,"30勝50敗",0.53490000000000004,2.5600000000000001E-2,"23勝20敗"]
[1208,8070,"東京産業",0.62690000000000001,-3.6700000000000003E-2,"42勝25敗",0.76600000000000001,2.46E-2,"36勝11敗"]
[1209,8074,"ユアサ商事",0.5484,-2.7400000000000001E-2,"34勝28敗",0.54,2.93E-2,"27勝23敗"]
[1210,8075,"神鋼商事",0.45779999999999998,-2.4899999999999999E-2,"38勝45敗",0.5,3.32E-2,"23勝23敗"]
[1211,8078,"阪和興業",0.47689999999999999,-3.0099999999999998E-2,"31勝34敗",0.62,3.6900000000000002E-2,"31勝19敗"]
[1212,8079,"正栄食品工業",0.46389999999999998,-2.07E-2,"45勝52敗",0.56579999999999997,2.9399999999999999E-2,"43勝33敗"]
[1213,8081,"カナデン",0.59379999999999999,-3.2500000000000001E-2,"38勝26敗",0.54549999999999998,2.9600000000000001E-2,"30勝25敗"]
[1214,8084,"ＲＹＯＤＥＮ",0.52780000000000005,-1.9E-2,"38勝34敗",0.55559999999999998,3.1899999999999998E-2,"30勝24敗"]
[1215,8086,"ニプロ",0.65629999999999999,-3.3500000000000002E-2,"42勝22敗",0.5625,2.69E-2,"27勝21敗"]
[1216,8088,"岩谷産業",0.5161,-3.1300000000000001E-2,"32勝30敗",0.55769999999999997,3.0099999999999998E-2,"29勝23敗"]
[1217,8091,"ニチモウ",0.43180000000000002,-1.95E-2,"38勝50敗",0.64439999999999997,2.7099999999999999E-2,"29勝16敗"]
[{"$f":"ROW()-2","v":1218},8093,"極東貿易",0.3256,-1.83E-2,"28勝58敗",0.50880000000000003,3.9899999999999998E-2,"29勝28敗"]
[1219,8095,"アステナホールディングス",0.5,-4.2000000000000003E-2,"35勝35敗",0.64910000000000001,2.6800000000000001E-2,"37勝20敗"]
[1220,8097,"三愛オブリ",0.47949999999999998,-3.8100000000000002E-2,"35勝38敗",0.5,6.93E-2,"24勝24敗"]
[1221,8098,"稲畑産業",0.50719999999999998,-2.5600000000000001E-2,"35勝34敗",0.6,3.8899999999999997E-2,"24勝16敗"]
[1222,8101,"ＧＳＩクレオス",0.51219999999999999,-3.0599999999999999E-2,"42勝40敗",0.70730000000000004,3.1E-2,"29勝12敗"]
[1223,8103,"明和産業",0.50819999999999999,-2.9899999999999999E-2,"31勝30敗",0.55410000000000004,3.9E-2,"41勝33敗"]
[1224,8111,"ゴールドウイン",0.52700000000000002,-2.5100000000000001E-2,"39勝35敗",0.3906,4.2299999999999997E-2,"25勝39敗"]
[1225,8113,"ユニ・チャーム",0.61670000000000003,-2.6100000000000002E-2,"37勝23敗",0.5373,2.7400000000000001E-2,"36勝31敗"]
[1226,8125,"ワキタ",0.52939999999999998,-2.7199999999999998E-2,"45勝40敗",0.50980000000000003,2.3400000000000001E-2,"26勝25敗"]
[1227,8129,"東邦ホールディングス",0.39760000000000001,-2.4899999999999999E-2,"33勝50敗",0.55740000000000001,4.24E-2,"34勝27敗"]
[1228,8130,"サンゲツ",0.52110000000000001,-2.1600000000000001E-2,"37勝34敗",0.53190000000000004,2.5000000000000001E-2,"25勝22敗"]
[1229,8132,"シナネンホールディングス",0.48280000000000001,-3.85E-2,"42勝45敗",0.54349999999999998,3.2800000000000003E-2,"25勝21敗"]
[1230,8133,"伊藤忠エネクス",0.60229999999999995,-3.2000000000000001E-2,"53勝35敗",0.72729999999999995,3.04E-2,"24勝9敗"]
[1231,8136,"サンリオ",0.43680000000000002,-3.7199999999999997E-2,"38勝49敗",0.57140000000000002,5.8200000000000002E-2,"28勝21敗"]
[1232,8137,"サンワテクノス",0.47439999999999999,-3.2500000000000001E-2,"37勝41敗",0.50880000000000003,4.2900000000000001E-2,"29勝28敗"]
[1233,8141,"新光商事",0.49280000000000002,-3.3700000000000001E-2,"34勝35敗",0.59650000000000003,3.8899999999999997E-2,"34勝23敗"]
[1234,8142,"トーホー",0.38030000000000003,-2.5499999999999998E-2,"27勝44敗",0.53969999999999996,4.82E-2,"34勝29敗"]
[1235,8150,"三信電気",0.47270000000000001,-3.56E-2,"26勝29敗",0.55840000000000001,3.5700000000000003E-2,"43勝34敗"]
[1236,8151,"東陽テクニカ",0.50790000000000002,-1.9599999999999999E-2,"32勝31敗",0.61539999999999995,3.09E-2,"40勝25敗"]
[1237,8153,"モスフードサービス",0.43020000000000003,-1.6899999999999998E-2,"37勝49敗",0.48780000000000001,1.72E-2,"20勝21敗"]
[1238,8154,"加賀電子",0.47370000000000001,-2.5399999999999999E-2,"36勝40敗",0.63270000000000004,3.56E-2,"31勝18敗"]
[1239,8157,"都築電気",0.39739999999999998,-2.3400000000000001E-2,"31勝47敗",0.44900000000000001,2.7199999999999998E-2,"22勝27敗"]
[1240,8158,"ソーダニッカ",0.44940000000000002,-5.57E-2,"40勝49敗",0.62790000000000001,3.3300000000000003E-2,"27勝16敗"]
[1241,8159,"立花エレテック",0.50629999999999997,-2.8400000000000002E-2,"40勝39敗",0.52459999999999996,2.5999999999999999E-2,"32勝29敗"]
[1242,8160,"木曽路",0.47370000000000001,-1.8700000000000001E-2,"36勝40敗",0.49209999999999998,1.9099999999999999E-2,"31勝32敗"]
[1243,8163,"ＳＲＳホールディングス",0.33329999999999999,-1.41E-2,"28勝56敗",0.5484,2.5000000000000001E-2,"34勝28敗"]
[1244,8167,"リテールパートナーズ",0.50670000000000004,-3.8399999999999997E-2,"38勝37敗",0.45900000000000002,3.0700000000000002E-2,"28勝33敗"]
[1245,8173,"上新電機",0.60870000000000002,-5.57E-2,"42勝27敗",0.31709999999999999,2.7799999999999998E-2,"13勝28敗"]
[1246,8174,"日本瓦斯",0.52859999999999996,-6.2E-2,"37勝33敗",0.5,3.6499999999999998E-2,"26勝26敗"]
[1247,8179,"ロイヤルホールディングス",0.5,-3.56E-2,"30勝30敗",0.4667,2.47E-2,"35勝40敗"]
[1248,8182,"いなげや",0.5091,-2.9499999999999998E-2,"28勝27敗",0.4778,3.3500000000000002E-2,"43勝47敗"]
[1249,8185,"チヨダ",0.53749999999999998,-2.7900000000000001E-2,"43勝37敗",0.57579999999999998,2.7900000000000001E-2,"38勝28敗"]
[1250,8194,"ライフコーポレーション",0.42420000000000002,-3.3799999999999997E-2,"28勝38敗",0.46970000000000001,2.8199999999999999E-2,"31勝35敗"]
[1251,8200,"リンガーハット",0.5,-1.83E-2,"26勝26敗",0.69230000000000003,2.4199999999999999E-2,"45勝20敗"]
[1252,8203,"ミスターマックス・ホールディングス",0.55879999999999996,-5.5E-2,"38勝30敗",0.59699999999999998,3.4500000000000003E-2,"40勝27敗"]
[1253,8214,"ＡＯＫＩホールディングス",0.57579999999999998,-2.8000000000000001E-2,"38勝28敗",0.68089999999999995,4.2299999999999997E-2,"32勝15敗"]
[1254,8217,"オークワ",0.55169999999999997,-3.5099999999999999E-2,"32勝26敗",0.5181,2.92E-2,"43勝40敗"]
[1255,8218,"コメリ",0.55259999999999998,-2.07E-2,"42勝34敗",0.59089999999999998,3.5099999999999999E-2,"39勝27敗"]
[1256,8219,"青山商事",0.38159999999999999,-5.4899999999999997E-2,"29勝47敗",0.6825,4.5199999999999997E-2,"43勝20敗"]
[1257,8227,"しまむら",0.40860000000000002,-5.8999999999999997E-2,"38勝55敗",0.53190000000000004,4.3299999999999998E-2,"25勝22敗"]
[1258,8233,"高島屋",0.52380000000000004,-2.3199999999999998E-2,"44勝40敗",0.52729999999999999,3.3000000000000002E-2,"29勝26敗"]
[1259,8237,"松屋",0.58819999999999995,-5.0500000000000003E-2,"50勝35敗",0.53059999999999996,4.7E-2,"26勝23敗"]
[1260,8242,"エイチ・ツー・オー　リテイリング",0.4138,-2.35E-2,"36勝51敗",0.39340000000000003,3.6299999999999999E-2,"24勝37敗"]
[1261,8252,"丸井グループ",0.56140000000000001,-2.76E-2,"32勝25敗",0.73440000000000005,3.32E-2,"47勝17敗"]
[1262,8253,"クレディセゾン",0.5,-2.8500000000000001E-2,"41勝41敗",0.67859999999999998,3.6200000000000003E-2,"38勝18敗"]
[1263,8255,"アクシアル　リテイリング",0.6129,-3.1899999999999998E-2,"38勝24敗",0.50880000000000003,2.5000000000000001E-2,"29勝28敗"]
[1264,8267,"イオン",0.52270000000000005,-4.7399999999999998E-2,"46勝42敗",0.52539999999999998,2.5600000000000001E-2,"31勝28敗"]
[1265,8273,"イズミ",0.44619999999999999,-2.1600000000000001E-2,"29勝36敗",0.625,3.1399999999999997E-2,"45勝27敗"]
[1266,8276,"平和堂",0.51519999999999999,-3.0700000000000002E-2,"34勝32敗",0.43330000000000002,2.06E-2,"26勝34敗"]
[1267,8278,"フジ",0.54239999999999999,-3.5900000000000001E-2,"32勝27敗",0.629,2.06E-2,"39勝23敗"]
[1268,8279,"ヤオコー",0.51900000000000002,-1.9E-2,"41勝38敗",0.61899999999999999,3.44E-2,"26勝16敗"]
[1269,8281,"ゼビオホールディングス",0.623,-3.0599999999999999E-2,"38勝23敗",0.35820000000000002,4.1500000000000002E-2,"24勝43敗"]
[1270,8282,"ケーズホールディングス",0.39389999999999997,-2.4400000000000002E-2,"26勝40敗",0.51319999999999999,2.6800000000000001E-2,"39勝37敗"]
[1271,8283,"ＰＡＬＴＡＣ",0.61819999999999997,-2.9899999999999999E-2,"34勝21敗",0.54690000000000005,3.2599999999999997E-2,"35勝29敗"]
[1272,8304,"あおぞら銀行",0.42859999999999998,-2.9399999999999999E-2,"33勝44敗",0.66039999999999999,2.6200000000000001E-2,"35勝18敗"]
[1273,8306,"三菱ＵＦＪフィナンシャル・グループ",0.47420000000000001,-3.1300000000000001E-2,"46勝51敗",0.45610000000000001,3.4099999999999998E-2,"26勝31敗"]
[1274,8308,"りそなホールディングス",0.53849999999999998,-3.6900000000000002E-2,"49勝42敗",0.47370000000000001,4.4999999999999998E-2,"27勝30敗"]
[1275,8309,"三井住友トラストグループ",0.65329999999999999,-3.0599999999999999E-2,"49勝26敗",0.63639999999999997,3.4000000000000002E-2,"35勝20敗"]
[1276,8316,"三井住友フィナンシャルグループ",0.45450000000000002,-2.8500000000000001E-2,"45勝54敗",0.59179999999999999,3.8300000000000001E-2,"29勝20敗"]
[1277,8331,"千葉銀行",0.53010000000000002,-3.9699999999999999E-2,"44勝39敗",0.6,3.3000000000000002E-2,"30勝20敗"]
[1278,8334,"群馬銀行",0.52939999999999998,-3.0700000000000002E-2,"45勝40敗",0.52500000000000002,4.5900000000000003E-2,"21勝19敗"]
[1279,8336,"武蔵野銀行",0.45779999999999998,-3.0200000000000001E-2,"38勝45敗",0.43480000000000002,2.87E-2,"20勝26敗"]
[1280,8337,"千葉興業銀行",0.48149999999999998,-5.1200000000000002E-2,"39勝42敗",0.52500000000000002,3.8800000000000001E-2,"21勝19敗"]
[1281,8338,"筑波銀行",0.51390000000000002,-5.5199999999999999E-2,"37勝35敗",0.54,4.0099999999999997E-2,"27勝23敗"]
[{"$f":"ROW()-2","v":1282},8341,"七十七銀行",0.52129999999999999,-4.4699999999999997E-2,"49勝45敗",0.42220000000000002,4.9200000000000001E-2,"19勝26敗"]
[1283,8343,"秋田銀行",0.40239999999999998,-3.0700000000000002E-2,"33勝49敗",0.55100000000000005,3.4099999999999998E-2,"27勝22敗"]
[1284,8344,"山形銀行",0.61329999999999996,-3.6299999999999999E-2,"46勝29敗",0.46300000000000002,3.8800000000000001E-2,"25勝29敗"]
[1285,8345,"岩手銀行",0.44869999999999999,-4.5100000000000001E-2,"35勝43敗",0.5,3.1199999999999999E-2,"21勝21敗"]
[1286,8346,"東邦銀行",0.48149999999999998,-2.9899999999999999E-2,"39勝42敗",0.61219999999999997,2.98E-2,"30勝19敗"]
[1287,8354,"ふくおかフィナンシャルグループ",0.4405,-3.27E-2,"37勝47敗",0.57410000000000005,3.8899999999999997E-2,"31勝23敗"]
[1288,8358,"スルガ銀行",0.45350000000000001,-3.2300000000000002E-2,"39勝47敗",0.57140000000000002,4.0099999999999997E-2,"20勝15敗"]
[1289,8359,"八十二銀行",0.44319999999999998,-3.5499999999999997E-2,"39勝49敗",0.54049999999999998,5.9799999999999999E-2,"20勝17敗"]
[1290,8360,"山梨中央銀行",0.42270000000000002,-3.8399999999999997E-2,"41勝56敗",0.45,4.4900000000000002E-2,"18勝22敗"]
[1291,8361,"大垣共立銀行",0.58230000000000004,-3.6600000000000001E-2,"46勝33敗",0.46,4.1200000000000001E-2,"23勝27敗"]
[1292,8362,"福井銀行",0.59299999999999997,-3.5499999999999997E-2,"51勝35敗",0.57410000000000005,2.8299999999999999E-2,"31勝23敗"]
[1293,8364,"清水銀行",0.54169999999999996,-3.3799999999999997E-2,"39勝33敗",0.62960000000000005,2.9600000000000001E-2,"34勝20敗"]
[1294,8366,"滋賀銀行",0.62160000000000004,-3.1300000000000001E-2,"46勝28敗",0.60660000000000003,4.9700000000000001E-2,"37勝24敗"]
[1295,8367,"南都銀行",0.48609999999999998,-0.03,"35勝37敗",0.53190000000000004,3.9E-2,"25勝22敗"]
[1296,8368,"百五銀行",0.45679999999999998,-3.3099999999999997E-2,"37勝44敗",0.5111,3.6400000000000002E-2,"23勝22敗"]
[1297,8370,"紀陽銀行",0.60760000000000003,-3.6700000000000003E-2,"48勝31敗",0.5,4.02E-2,"23勝23敗"]
[1298,8377,"ほくほくフィナンシャルグループ",0.53129999999999999,-3.9300000000000002E-2,"51勝45敗",0.55259999999999998,4.8800000000000003E-2,"21勝17敗"]
[1299,8381,"山陰合同銀行",0.61360000000000003,-2.9899999999999999E-2,"54勝34敗",0.48570000000000002,3.9E-2,"17勝18敗"]
[1300,8386,"百十四銀行",0.4,-3.4799999999999998E-2,"32勝48敗",0.36670000000000003,2.8000000000000001E-2,"22勝38敗"]
[1301,8387,"四国銀行",0.4819,-3.1099999999999999E-2,"40勝43敗",0.64290000000000003,3.39E-2,"27勝15敗"]
[1302,8388,"阿波銀行",0.45710000000000001,-4.1099999999999998E-2,"32勝38敗",0.5,3.56E-2,"29勝29敗"]
[1303,8392,"大分銀行",0.5,-2.98E-2,"37勝37敗",0.44829999999999998,4.8399999999999999E-2,"26勝32敗"]
[1304,8393,"宮崎銀行",0.54549999999999998,-3.2000000000000001E-2,"48勝40敗",0.44440000000000002,3.5900000000000001E-2,"16勝20敗"]
[1305,8395,"佐賀銀行",0.5181,-3.4200000000000001E-2,"43勝40敗",0.55320000000000003,3.73E-2,"26勝21敗"]
[1306,8399,"琉球銀行",0.46429999999999999,-3.2199999999999999E-2,"39勝45敗",0.59519999999999995,4.2999999999999997E-2,"25勝17敗"]
[1307,8410,"セブン銀行",0.55220000000000002,-2.5100000000000001E-2,"37勝30敗",0.5,1.49E-2,"30勝30敗"]
[1308,8411,"みずほフィナンシャルグループ",0.56569999999999998,-3.1699999999999999E-2,"56勝43敗",0.35849999999999999,3.8100000000000002E-2,"19勝34敗"]
[1309,8418,"山口フィナンシャルグループ",0.51719999999999999,-4.2000000000000003E-2,"45勝42敗",0.64100000000000001,3.6900000000000002E-2,"25勝14敗"]
[1310,8424,"芙蓉総合リース",0.58750000000000002,-2.8299999999999999E-2,"47勝33敗",0.59619999999999995,2.9600000000000001E-2,"31勝21敗"]
[1311,8425,"みずほリース",0.51690000000000003,-4.8899999999999999E-2,"46勝43敗",0.62219999999999998,2.81E-2,"28勝17敗"]
[1312,8439,"東京センチュリー",0.50819999999999999,-4.4400000000000002E-2,"31勝30敗",0.50770000000000004,3.8600000000000002E-2,"33勝32敗"]
[1313,8473,"ＳＢＩホールディングス",0.51949999999999996,-2.52E-2,"40勝37敗",0.69010000000000005,3.9199999999999999E-2,"49勝22敗"]
[1314,8511,"日本証券金融",0.50619999999999998,-3.4799999999999998E-2,"41勝40敗",0.58140000000000003,3.3500000000000002E-2,"25勝18敗"]
[1315,8515,"アイフル",0.55559999999999998,-4.2099999999999999E-2,"45勝36敗",0.61819999999999997,3.7699999999999997E-2,"34勝21敗"]
[1316,8522,"名古屋銀行",0.47560000000000002,-4.9399999999999999E-2,"39勝43敗",0.52380000000000004,3.44E-2,"22勝20敗"]
[1317,8524,"北洋銀行",0.5,-3.0200000000000001E-2,"42勝42敗",0.5,3.7600000000000001E-2,"27勝27敗"]
[1318,8541,"愛媛銀行",0.56000000000000005,-2.98E-2,"42勝33敗",0.5,2.8400000000000002E-2,"27勝27敗"]
[1319,8544,"京葉銀行",0.45569999999999999,-3.61E-2,"36勝43敗",0.5,4.0800000000000003E-2,"23勝23敗"]
[1320,8550,"栃木銀行",0.44190000000000002,-4.6899999999999997E-2,"38勝48敗",0.45,4.3999999999999997E-2,"18勝22敗"]
[1321,8551,"北日本銀行",0.54669999999999996,-3.2500000000000001E-2,"41勝34敗",0.5111,2.58E-2,"23勝22敗"]
[1322,8558,"東和銀行",0.43369999999999997,-3.4700000000000002E-2,"36勝47敗",0.50939999999999996,3.2399999999999998E-2,"27勝26敗"]
[1323,8566,"リコーリース",0.47470000000000001,-2.29E-2,"47勝52敗",0.51280000000000003,2.3199999999999998E-2,"20勝19敗"]
[1324,8570,"イオンフィナンシャルサービス",0.53249999999999997,-2.76E-2,"41勝36敗",0.5333,2.7099999999999999E-2,"32勝28敗"]
[1325,8584,"ジャックス",0.51849999999999996,-2.9399999999999999E-2,"42勝39敗",0.64,3.2099999999999997E-2,"32勝18敗"]
[1326,8585,"オリエントコーポレーション",0.65669999999999995,-3.0700000000000002E-2,"44勝23敗",0.5645,2.7699999999999999E-2,"35勝27敗"]
[1327,8591,"オリックス",0.50560000000000005,-2.29E-2,"45勝44敗",0.64439999999999997,5.8000000000000003E-2,"29勝16敗"]
[1328,8593,"三菱ＨＣキャピタル",0.51759999999999995,-2.3099999999999999E-2,"44勝41敗",0.60470000000000002,3.3000000000000002E-2,"26勝17敗"]
[1329,8595,"ジャフコ　グループ",0.5,-3.3000000000000002E-2,"50勝50敗",0.60980000000000001,2.5899999999999999E-2,"25勝16敗"]
[1330,8600,"トモニホールディングス",0.6,-4.1799999999999997E-2,"42勝28敗",0.34210000000000002,2.3099999999999999E-2,"13勝25敗"]
[1331,8601,"大和証券グループ本社",0.4,-2.2599999999999999E-2,"34勝51敗",0.75509999999999999,3.5000000000000003E-2,"37勝12敗"]
[1332,8604,"野村ホールディングス",0.49330000000000002,-2.0400000000000001E-2,"37勝38敗",0.64059999999999995,3.2000000000000001E-2,"41勝23敗"]
[1333,8609,"岡三証券グループ",0.45450000000000002,-2.8799999999999999E-2,"30勝36敗",0.63929999999999998,3.7400000000000003E-2,"39勝22敗"]
[1334,8613,"丸三証券",0.59040000000000004,-2.9700000000000001E-2,"49勝34敗",0.58330000000000004,3.8300000000000001E-2,"35勝25敗"]
[1335,8614,"東洋証券",0.42309999999999998,-4.9200000000000001E-2,"33勝45敗",0.64410000000000001,3.6600000000000001E-2,"38勝21敗"]
[1336,8616,"東海東京フィナンシャル・ホールディングス",0.54169999999999996,-2.98E-2,"39勝33敗",0.60870000000000002,2.6499999999999999E-2,"28勝18敗"]
[1337,8622,"水戸証券",0.40699999999999997,-2.8799999999999999E-2,"35勝51敗",0.51790000000000003,4.2700000000000002E-2,"29勝27敗"]
[1338,8624,"いちよし証券",0.50590000000000002,-2.6800000000000001E-2,"43勝42敗",0.56059999999999999,3.0700000000000002E-2,"37勝29敗"]
[1339,8628,"松井証券",0.43480000000000002,-1.9099999999999999E-2,"30勝39敗",0.61539999999999995,3.7100000000000001E-2,"40勝25敗"]
[1340,8630,"ＳＯＭＰＯホールディングス",0.61970000000000003,-1.89E-2,"44勝27敗",0.56599999999999995,4.0500000000000001E-2,"30勝23敗"]
[1341,8697,"日本取引所グループ",0.52749999999999997,-2.4299999999999999E-2,"48勝43敗",0.53849999999999998,3.04E-2,"28勝24敗"]
[1342,8698,"マネックスグループ",0.4778,-5.6500000000000002E-2,"43勝47敗",0.63490000000000002,4.6300000000000001E-2,"40勝23敗"]
[1343,8706,"極東証券",0.37659999999999999,-4.07E-2,"29勝48敗",0.63039999999999996,3.1199999999999999E-2,"29勝17敗"]
[1344,8707,"岩井コスモホールディングス",0.44190000000000002,-3.2199999999999999E-2,"38勝48敗",0.64149999999999996,2.53E-2,"34勝19敗"]
[1345,8708,"アイザワ証券グループ",0.54049999999999998,-3.5299999999999998E-2,"40勝34敗",0.56000000000000005,3.7400000000000003E-2,"28勝22敗"]
[{"$f":"ROW()-2","v":1346},8713,"フィデアホールディングス",0.44579999999999997,-3.3099999999999997E-2,"37勝46敗",0.6038,3.5299999999999998E-2,"32勝21敗"]
[1347,8714,"池田泉州ホールディングス",0.47270000000000001,-3.5000000000000003E-2,"52勝58敗",0.4118,5.6399999999999999E-2,"14勝20敗"]
[1348,8715,"アニコム　ホールディングス",0.52829999999999999,-4.5900000000000003E-2,"28勝25敗",0.49280000000000002,3.56E-2,"34勝35敗"]
[1349,8725,"ＭＳ＆ＡＤインシュアランスグループホールディングス",0.46510000000000001,-2.2599999999999999E-2,"40勝46敗",0.55320000000000003,2.81E-2,"26勝21敗"]
[1350,8739,"スパークス・グループ",0.3125,-2.7400000000000001E-2,"20勝44敗",0.52539999999999998,4.36E-2,"31勝28敗"]
[1351,8750,"第一生命ホールディングス",0.49330000000000002,-3.8100000000000002E-2,"37勝38敗",0.38,4.2999999999999997E-2,"19勝31敗"]
[1352,8766,"東京海上ホールディングス",0.50539999999999996,-2.1700000000000001E-2,"47勝46敗",0.47060000000000002,4.24E-2,"24勝27敗"]
[1353,8771,"イー・ギャランティ",0.60340000000000005,-2.7400000000000001E-2,"35勝23敗",0.46970000000000001,3.2199999999999999E-2,"31勝35敗"]
[1354,8793,"ＮＥＣキャピタルソリューション",0.375,-2.12E-2,"30勝50敗",0.66669999999999996,2.1999999999999999E-2,"28勝14敗"]
[1355,8795,"Ｔ＆Ｄホールディングス",0.53249999999999997,-4.3799999999999999E-2,"41勝36敗",0.51719999999999999,4.6300000000000001E-2,"30勝28敗"]
[1356,8798,"アドバンスクリエイト",0.50790000000000002,-3.2399999999999998E-2,"32勝31敗",0.49330000000000002,2.5100000000000001E-2,"37勝38敗"]
[1357,8801,"三井不動産",0.48720000000000002,-2.35E-2,"38勝40敗",0.6724,3.4000000000000002E-2,"39勝19敗"]
[1358,8802,"三菱地所",0.4844,-2.9499999999999998E-2,"31勝33敗",0.55359999999999998,2.4500000000000001E-2,"31勝25敗"]
[1359,8803,"平和不動産",0.65710000000000002,-3.3399999999999999E-2,"46勝24敗",0.57379999999999998,2.53E-2,"35勝26敗"]
[1360,8804,"東京建物",0.46879999999999999,-2.6100000000000002E-2,"30勝34敗",0.63829999999999998,3.7100000000000001E-2,"30勝17敗"]
[1361,8818,"京阪神ビルディング",0.50629999999999997,-3.4799999999999998E-2,"40勝39敗",0.56599999999999995,4.1700000000000001E-2,"30勝23敗"]
[1362,8830,"住友不動産",0.40789999999999998,-3.1E-2,"31勝45敗",0.47270000000000001,3.5299999999999998E-2,"26勝29敗"]
[1363,8848,"レオパレス２１",0.54690000000000005,-6.3E-2,"35勝29敗",0.59319999999999995,6.6299999999999998E-2,"35勝24敗"]
[1364,8850,"スターツコーポレーション",0.46879999999999999,-2.3900000000000001E-2,"30勝34敗",0.62960000000000005,3.0700000000000002E-2,"34勝20敗"]
[1365,8860,"フジ住宅",0.5181,-2.3699999999999999E-2,"43勝40敗",0.53700000000000003,2.4899999999999999E-2,"29勝25敗"]
[1366,8864,"空港施設",0.59650000000000003,-1.8800000000000001E-2,"34勝23敗",0.56859999999999999,2.5899999999999999E-2,"29勝22敗"]
[1367,8876,"リログループ",0.55810000000000004,-3.7600000000000001E-2,"24勝19敗",0.62819999999999998,5.4600000000000003E-2,"49勝29敗"]
[1368,8877,"エスリード",0.47,-2.1999999999999999E-2,"47勝53敗",0.7,3.1300000000000001E-2,"28勝12敗"]
[1369,8881,"日神グループホールディングス",0.54790000000000005,-2.1000000000000001E-2,"40勝33敗",0.5625,2.9100000000000001E-2,"27勝21敗"]
[1370,8892,"日本エスコン",0.50700000000000001,-2.2599999999999999E-2,"36勝35敗",0.49320000000000003,3.6200000000000003E-2,"36勝37敗"]
[1371,8897,"ＭＩＲＡＲＴＨホールディングス",0.5181,-3.5700000000000003E-2,"43勝40敗",0.629,2.9700000000000001E-2,"39勝23敗"]
[1372,8905,"イオンモール",0.52239999999999998,-2.2700000000000001E-2,"35勝32敗",0.64710000000000001,2.87E-2,"33勝18敗"]
[1373,8919,"カチタス",0.56859999999999999,-4.3799999999999999E-2,"29勝22敗",0.55769999999999997,6.1199999999999997E-2,"29勝23敗"]
[1374,8923,"トーセイ",0.52270000000000005,-3.1199999999999999E-2,"46勝42敗",0.45829999999999999,4.0599999999999997E-2,"22勝26敗"]
[1375,8934,"サンフロンティア不動産",0.51280000000000003,-2.7E-2,"40勝38敗",0.67649999999999999,3.3700000000000001E-2,"23勝11敗"]
[1376,8935,"ＦＪネクストホールディングス",0.43330000000000002,-1.9800000000000002E-2,"39勝51敗",0.625,2.35E-2,"25勝15敗"]
[1377,8999,"グランディハウス",0.55840000000000001,-2.4299999999999999E-2,"43勝34敗",0.6,3.3399999999999999E-2,"27勝18敗"]
[1378,9001,"東武鉄道",0.50849999999999995,-2.01E-2,"30勝29敗",0.39660000000000001,2.58E-2,"23勝35敗"]
[1379,9003,"相鉄ホールディングス",0.61670000000000003,-2.41E-2,"37勝23敗",0.56059999999999999,3.0499999999999999E-2,"37勝29敗"]
[1380,9005,"東急",0.45710000000000001,-2.5999999999999999E-2,"32勝38敗",0.58330000000000004,2.23E-2,"28勝20敗"]
[1381,9006,"京浜急行電鉄",0.64410000000000001,-2.92E-2,"38勝21敗",0.54239999999999999,2.7199999999999998E-2,"32勝27敗"]
[1382,9007,"小田急電鉄",0.48980000000000001,-2.98E-2,"24勝25敗",0.49370000000000003,2.6200000000000001E-2,"39勝40敗"]
[1383,9008,"京王電鉄",0.4667,-2.75E-2,"21勝24敗",0.47060000000000002,2.7300000000000001E-2,"40勝45敗"]
[1384,9009,"京成電鉄",0.4783,-3.0599999999999999E-2,"33勝36敗",0.51280000000000003,3.5400000000000001E-2,"40勝38敗"]
[1385,9010,"富士急行",0.57809999999999995,-3.4799999999999998E-2,"37勝27敗",0.40789999999999998,5.7799999999999997E-2,"31勝45敗"]
[1386,9020,"東日本旅客鉄道",0.61539999999999995,-2.4299999999999999E-2,"40勝25敗",0.49120000000000003,2.5600000000000001E-2,"28勝29敗"]
[1387,9021,"西日本旅客鉄道",0.58819999999999995,-2.81E-2,"40勝28敗",0.55169999999999997,3.1300000000000001E-2,"32勝26敗"]
[1388,9022,"東海旅客鉄道",0.54549999999999998,-2.7099999999999999E-2,"30勝25敗",0.47689999999999999,2.92E-2,"31勝34敗"]
[1389,9024,"西武ホールディングス",0.43020000000000003,-3.0200000000000001E-2,"37勝49敗",0.50849999999999995,5.2699999999999997E-2,"30勝29敗"]
[1390,9025,"鴻池運輸",0.44,-3.04E-2,"33勝42敗",0.59260000000000002,3.6999999999999998E-2,"32勝22敗"]
[1391,9031,"西日本鉄道",0.71699999999999997,-2.9899999999999999E-2,"38勝15敗",0.55359999999999998,2.0500000000000001E-2,"31勝25敗"]
[1392,9037,"ハマキョウレックス",0.55220000000000002,-1.8599999999999998E-2,"37勝30敗",0.65380000000000005,2.7300000000000001E-2,"34勝18敗"]
[1393,9039,"サカイ引越センター",0.57450000000000001,-2.1700000000000001E-2,"27勝20敗",0.49370000000000003,3.0599999999999999E-2,"39勝40敗"]
[1394,9041,"近鉄グループホールディングス",0.44640000000000002,-2.63E-2,"25勝31敗",0.39340000000000003,3.0099999999999998E-2,"24勝37敗"]
[1395,9042,"阪急阪神ホールディングス",0.54549999999999998,-2.75E-2,"36勝30敗",0.48149999999999998,2.3800000000000002E-2,"26勝28敗"]
[1396,9044,"南海電気鉄道",0.49180000000000001,-2.1700000000000001E-2,"30勝31敗",0.57140000000000002,2.9899999999999999E-2,"36勝27敗"]
[1397,9045,"京阪ホールディングス",0.50939999999999996,-2.87E-2,"27勝26敗",0.47220000000000001,2.86E-2,"34勝38敗"]
[1398,9046,"神戸電鉄",0.74360000000000004,-2.0500000000000001E-2,"29勝10敗",0.56100000000000005,2.93E-2,"46勝36敗"]
[1399,9048,"名古屋鉄道",0.6,-1.9699999999999999E-2,"30勝20敗",0.375,2.1299999999999999E-2,"27勝45敗"]
[1400,9052,"山陽電気鉄道",0.62339999999999995,-2.0799999999999999E-2,"48勝29敗",0.51919999999999999,1.9300000000000001E-2,"27勝25敗"]
[1401,9064,"ヤマトホールディングス",0.44929999999999998,-2.7799999999999998E-2,"31勝38敗",0.45069999999999999,2.7E-2,"32勝39敗"]
[1402,9065,"山九",0.45610000000000001,-2.47E-2,"26勝31敗",0.52829999999999999,3.2500000000000001E-2,"28勝25敗"]
[1403,9066,"日新",0.45450000000000002,-3.78E-2,"35勝42敗",0.4894,3.9100000000000003E-2,"23勝24敗"]
[1404,9068,"丸全昭和運輸",0.59740000000000004,-3.2399999999999998E-2,"46勝31敗",0.65,3.3500000000000002E-2,"26勝14敗"]
[1405,9069,"センコーグループホールディングス",0.57969999999999999,-1.9699999999999999E-2,"40勝29敗",0.52270000000000005,2.2499999999999999E-2,"23勝21敗"]
[1406,9070,"トナミホールディングス",0.63490000000000002,-2.7900000000000001E-2,"40勝23敗",0.53059999999999996,2.3599999999999999E-2,"26勝23敗"]
[1407,9072,"ニッコンホールディングス",0.44119999999999998,-2.6200000000000001E-2,"30勝38敗",0.49020000000000002,2.7799999999999998E-2,"25勝26敗"]
[1408,9075,"福山通運",0.55559999999999998,-3.27E-2,"35勝28敗",0.4839,3.5200000000000002E-2,"30勝32敗"]
[1409,9076,"セイノーホールディングス",0.54669999999999996,-2.7400000000000001E-2,"41勝34敗",0.41510000000000002,2.8799999999999999E-2,"22勝31敗"]
[{"$f":"ROW()-2","v":1410},9081,"神奈川中央交通",0.69810000000000005,-2.4799999999999999E-2,"37勝16敗",0.60419999999999996,1.9199999999999998E-2,"29勝19敗"]
[1411,9090,"ＡＺ－ＣＯＭ丸和ホールディングス",0.47620000000000001,-3.0800000000000001E-2,"30勝33敗",0.53749999999999998,3.8699999999999998E-2,"43勝37敗"]
[1412,9101,"日本郵船",0.54369999999999996,-3.1E-2,"56勝47敗",0.52939999999999998,5.8099999999999999E-2,"27勝24敗"]
[1413,9104,"商船三井",0.42530000000000001,-3.6999999999999998E-2,"37勝50敗",0.625,4.0800000000000003E-2,"30勝18敗"]
[1414,9107,"川崎汽船",0.4632,-6.4100000000000004E-2,"44勝51敗",0.71050000000000002,5.6899999999999999E-2,"27勝11敗"]
[1415,9110,"ＮＳユナイテッド海運",0.56759999999999999,-4.19E-2,"42勝32敗",0.42620000000000002,4.1399999999999999E-2,"26勝35敗"]
[1416,9119,"飯野海運",0.59340000000000004,-4.2200000000000001E-2,"54勝37敗",0.67269999999999996,3.9899999999999998E-2,"37勝18敗"]
[1417,9142,"九州旅客鉄道",0.54549999999999998,-2.2100000000000002E-2,"42勝35敗",0.48,3.1099999999999999E-2,"24勝26敗"]
[1418,9143,"ＳＧホールディングス",0.42470000000000002,-3.1600000000000003E-2,"31勝42敗",0.54100000000000004,3.2199999999999999E-2,"33勝28敗"]
[1419,9201,"日本航空",0.48480000000000001,-0.03,"32勝34敗",0.53620000000000001,3.9199999999999999E-2,"37勝32敗"]
[1420,9202,"ＡＮＡホールディングス",0.57140000000000002,-2.5700000000000001E-2,"36勝27敗",0.59150000000000003,3.9100000000000003E-2,"42勝29敗"]
[1421,9260,"西本Ｗｉｓｍｅｔｔａｃホールディングス",0.50719999999999998,-4.4200000000000003E-2,"35勝34敗",0.53129999999999999,6.08E-2,"34勝30敗"]
[1422,9267,"Ｇｅｎｋｙ　ＤｒｕｇＳｔｏｒｅｓ",0.62070000000000003,-3.9899999999999998E-2,"54勝33敗",0.46939999999999998,4.5400000000000003E-2,"23勝26敗"]
[1423,9273,"コーア商事ホールディングス",0.35870000000000002,-7.5399999999999995E-2,"33勝59敗",0.5,2.7300000000000001E-2,"33勝33敗"]
[1424,9274,"ＫＰＰグループホールディングス",0.60870000000000002,-5.04E-2,"42勝27敗",0.58699999999999997,3.9800000000000002E-2,"27勝19敗"]
[1425,9278,"ブックオフグループホールディングス",0.5,-3.2099999999999997E-2,"34勝34敗",0.58330000000000004,2.9399999999999999E-2,"35勝25敗"]
[1426,9279,"ギフトホールディングス",0.44319999999999998,-5.04E-2,"39勝49敗",0.64580000000000004,6.3200000000000006E-2,"31勝17敗"]
[1427,9301,"三菱倉庫",0.41860000000000003,-1.7399999999999999E-2,"36勝50敗",0.48209999999999997,4.02E-2,"27勝29敗"]
[1428,9302,"三井倉庫ホールディングス",0.43159999999999998,-2.9100000000000001E-2,"41勝54敗",0.42309999999999998,3.4000000000000002E-2,"22勝30敗"]
[1429,9303,"住友倉庫",0.50629999999999997,-1.6E-2,"40勝39敗",0.65449999999999997,2.9000000000000001E-2,"36勝19敗"]
[1430,9304,"澁澤倉庫",0.4133,-7.0300000000000001E-2,"31勝44敗",0.55930000000000002,2.6100000000000002E-2,"33勝26敗"]
[1431,9305,"ヤマタネ",0.43369999999999997,-2.5700000000000001E-2,"36勝47敗",0.73909999999999998,3.1800000000000002E-2,"34勝12敗"]
[1432,9310,"日本トランスシティ",0.56920000000000004,-6.0999999999999999E-2,"37勝28敗",0.42,4.7699999999999999E-2,"21勝29敗"]
[1433,9319,"中央倉庫",0.443,-3.9800000000000002E-2,"35勝44敗",0.61109999999999998,2.3800000000000002E-2,"33勝21敗"]
[1434,9324,"安田倉庫",0.65849999999999997,-2.5100000000000001E-2,"54勝28敗",0.60529999999999995,3.0499999999999999E-2,"23勝15敗"]
[1435,9364,"上組",0.58330000000000004,-1.84E-2,"42勝30敗",0.60980000000000001,2.5899999999999999E-2,"25勝16敗"]
[1436,9381,"エーアイテイー",0.55289999999999995,-2.7699999999999999E-2,"47勝38敗",0.42220000000000002,3.0700000000000002E-2,"19勝26敗"]
[1437,9384,"内外トランスライン",0.51759999999999995,-2.5999999999999999E-2,"44勝41敗",0.45450000000000002,3.1399999999999997E-2,"25勝30敗"]
[1438,9386,"日本コンセプト",0.55259999999999998,-4.07E-2,"42勝34敗",0.48209999999999997,3.3000000000000002E-2,"27勝29敗"]
[1439,9401,"ＴＢＳホールディングス",0.48649999999999999,-3.32E-2,"36勝38敗",0.56820000000000004,3.4099999999999998E-2,"25勝19敗"]
[1440,9404,"日本テレビホールディングス",0.51280000000000003,-2.23E-2,"40勝38敗",0.46939999999999998,4.1300000000000003E-2,"23勝26敗"]
[1441,9405,"朝日放送グループホールディングス",0.5,-2.7699999999999999E-2,"34勝34敗",0.48980000000000001,2.69E-2,"24勝25敗"]
[1442,9409,"テレビ朝日ホールディングス",0.58730000000000004,-2.81E-2,"37勝26敗",0.52270000000000005,2.3099999999999999E-2,"23勝21敗"]
[1443,9412,"スカパーＪＳＡＴホールディングス",0.45779999999999998,-2.9600000000000001E-2,"38勝45敗",0.63460000000000005,3.5900000000000001E-2,"33勝19敗"]
[1444,9413,"テレビ東京ホールディングス",0.45590000000000003,-2.8899999999999999E-2,"31勝37敗",0.64,3.3799999999999997E-2,"32勝18敗"]
[1445,9416,"ビジョン",0.54549999999999998,-6.0900000000000003E-2,"30勝25敗",0.39660000000000001,5.8999999999999997E-2,"23勝35敗"]
[1446,9418,"Ｕ－ＮＥＸＴ　ＨＯＬＤＩＮＧＳ",0.58330000000000004,-4.4699999999999997E-2,"42勝30敗",0.60980000000000001,4.3400000000000001E-2,"25勝16敗"]
[1447,9424,"日本通信",0.56899999999999995,-5.5500000000000001E-2,"33勝25敗",0.52459999999999996,4.6399999999999997E-2,"32勝29敗"]
[1448,9432,"日本電信電話",0.51219999999999999,-1.5699999999999999E-2,"42勝40敗",0.61539999999999995,1.9E-2,"32勝20敗"]
[1449,9433,"ＫＤＤＩ",0.3412,-1.3299999999999999E-2,"29勝56敗",0.57630000000000003,2.9899999999999999E-2,"34勝25敗"]
[1450,9434,"ソフトバンク",0.51139999999999997,-1.55E-2,"45勝43敗",0.74419999999999997,2.2800000000000001E-2,"32勝11敗"]
[1451,9435,"光通信",0.52170000000000005,-2.1499999999999998E-2,"36勝33敗",0.49149999999999999,0.03,"29勝30敗"]
[1452,9438,"エムティーアイ",0.54930000000000001,-3.78E-2,"39勝32敗",0.39129999999999998,5.1299999999999998E-2,"27勝42敗"]
[1453,9449,"ＧＭＯインターネットグループ",0.5806,-3.6200000000000003E-2,"36勝26敗",0.65669999999999995,3.7499999999999999E-2,"44勝23敗"]
[1454,9450,"ファイバーゲート",0.58489999999999998,-4.5900000000000003E-2,"31勝22敗",0.45829999999999999,6.6000000000000003E-2,"33勝39敗"]
[1455,9468,"ＫＡＤＯＫＡＷＡ",0.41560000000000002,-3.2399999999999998E-2,"32勝45敗",0.46150000000000002,3.9399999999999998E-2,"30勝35敗"]
[1456,9470,"学研ホールディングス",0.5333,-3.1899999999999998E-2,"32勝28敗",0.57140000000000002,4.1300000000000003E-2,"40勝30敗"]
[1457,9474,"ゼンリン",0.52080000000000004,-3.4200000000000001E-2,"25勝23敗",0.51949999999999996,3.15E-2,"40勝37敗"]
[1458,9501,"東京電力ホールディングス",0.55410000000000004,-4.6699999999999998E-2,"41勝33敗",0.48330000000000001,4.6600000000000003E-2,"29勝31敗"]
[1459,9502,"中部電力",0.56759999999999999,-3.0700000000000002E-2,"42勝32敗",0.56599999999999995,2.47E-2,"30勝23敗"]
[1460,9503,"関西電力",0.52629999999999999,-2.76E-2,"40勝36敗",0.62260000000000004,3.3399999999999999E-2,"33勝20敗"]
[1461,9504,"中国電力",0.51249999999999996,-3.6999999999999998E-2,"41勝39敗",0.47139999999999999,4.02E-2,"33勝37敗"]
[1462,9505,"北陸電力",0.60260000000000002,-0.04,"47勝31敗",0.51919999999999999,4.0500000000000001E-2,"27勝25敗"]
[1463,9506,"東北電力",0.61539999999999995,-3.5000000000000003E-2,"48勝30敗",0.57889999999999997,3.7400000000000003E-2,"33勝24敗"]
[1464,9507,"四国電力",0.71619999999999995,-2.87E-2,"53勝21敗",0.58179999999999998,3.5900000000000001E-2,"32勝23敗"]
[1465,9508,"九州電力",0.67010000000000003,-3.61E-2,"65勝32敗",0.57779999999999998,4.6600000000000003E-2,"26勝19敗"]
[1466,9509,"北海道電力",0.58750000000000002,-3.9899999999999998E-2,"47勝33敗",0.51019999999999999,3.0099999999999998E-2,"25勝24敗"]
[1467,9511,"沖縄電力",0.53520000000000001,-3.1899999999999998E-2,"38勝33敗",0.36230000000000001,2.5700000000000001E-2,"25勝44敗"]
[1468,9513,"電源開発",0.55069999999999997,-2.6200000000000001E-2,"38勝31敗",0.44069999999999998,2.4400000000000002E-2,"26勝33敗"]
[1469,9517,"イーレックス",0.56920000000000004,-4.7699999999999999E-2,"37勝28敗",0.54049999999999998,6.6600000000000006E-2,"40勝34敗"]
[1470,9519,"レノバ",0.63009999999999999,-5.7200000000000001E-2,"46勝27敗",0.5333,5.8000000000000003E-2,"32勝28敗"]
[1471,9531,"東京瓦斯",0.45329999999999998,-2.93E-2,"34勝41敗",0.60940000000000005,3.39E-2,"39勝25敗"]
[1472,9532,"大阪瓦斯",0.45679999999999998,-2.5499999999999998E-2,"37勝44敗",0.41460000000000002,2.52E-2,"17勝24敗"]
[1473,9533,"東邦瓦斯",0.65749999999999997,-3.6400000000000002E-2,"48勝25敗",0.5,3.0499999999999999E-2,"28勝28敗"]
[{"$f":"ROW()-2","v":1474},9534,"北海道瓦斯",0.62160000000000004,-1.9699999999999999E-2,"46勝28敗",0.64710000000000001,2.58E-2,"22勝12敗"]
[1475,9535,"広島ガス",0.52049999999999996,-2.8400000000000002E-2,"38勝35敗",0.5625,2.2700000000000001E-2,"18勝14敗"]
[1476,9536,"西部ガスホールディングス",0.49180000000000001,-2.8000000000000001E-2,"30勝31敗",0.45760000000000001,2.1499999999999998E-2,"27勝32敗"]
[1477,9543,"静岡ガス",0.68420000000000003,-2.81E-2,"39勝18敗",0.46029999999999999,3.04E-2,"29勝34敗"]
[1478,9551,"メタウォーター",0.78569999999999995,-2.8000000000000001E-2,"44勝12敗",0.5857,2.6800000000000001E-2,"41勝29敗"]
[1479,9600,"アイネット",0.64470000000000005,-3.7499999999999999E-2,"49勝27敗",0.65380000000000005,3.6299999999999999E-2,"34勝18敗"]
[1480,9601,"松竹",0.61399999999999999,-2.24E-2,"35勝22敗",0.5,3.56E-2,"38勝38敗"]
[1481,9602,"東宝",0.5625,-2.1000000000000001E-2,"36勝28敗",0.53129999999999999,3.2399999999999998E-2,"34勝30敗"]
[1482,9603,"エイチ・アイ・エス",0.69810000000000005,-4.7699999999999999E-2,"37勝16敗",0.52239999999999998,6.3899999999999998E-2,"35勝32敗"]
[1483,9605,"東映",0.39389999999999997,-2.4799999999999999E-2,"26勝40敗",0.46150000000000002,2.5600000000000001E-2,"24勝28敗"]
[1484,9612,"ラックランド",0.51019999999999999,-1.38E-2,"25勝24敗",0.54120000000000001,3.1300000000000001E-2,"46勝39敗"]
[1485,9613,"ＮＴＴデータグループ",0.46579999999999999,-6.1600000000000002E-2,"34勝39敗",0.69810000000000005,4.19E-2,"37勝16敗"]
[1486,9616,"共立メンテナンス",0.39729999999999999,-3.0099999999999998E-2,"29勝44敗",0.66669999999999996,3.7499999999999999E-2,"46勝23敗"]
[1487,9619,"イチネンホールディングス",0.54549999999999998,-2.4299999999999999E-2,"36勝30敗",0.69769999999999999,3.8199999999999998E-2,"30勝13敗"]
[1488,9621,"建設技術研究所",0.5,-2.3E-2,"41勝41敗",0.54,3.4000000000000002E-2,"27勝23敗"]
[1489,9622,"スペース",0.55220000000000002,-5.11E-2,"37勝30敗",0.69389999999999996,2.4799999999999999E-2,"34勝15敗"]
[1490,9627,"アインホールディングス",0.53520000000000001,-3.2899999999999999E-2,"38勝33敗",0.56059999999999999,4.4600000000000001E-2,"37勝29敗"]
[1491,9628,"燦ホールディングス",0.63239999999999996,-3.1E-2,"43勝25敗",0.64290000000000003,3.9800000000000002E-2,"27勝15敗"]
[1492,9629,"ピー・シー・エー",0.52,-6.2600000000000003E-2,"39勝36敗",0.53849999999999998,4.5600000000000002E-2,"28勝24敗"]
[1493,9644,"タナベコンサルティンググループ",0.35870000000000002,-2.4400000000000002E-2,"33勝59敗",0.5,3.2899999999999999E-2,"28勝28敗"]
[1494,9658,"ビジネスブレイン太田昭和",0.73129999999999995,-3.6400000000000002E-2,"49勝18敗",0.49120000000000003,3.5400000000000001E-2,"28勝29敗"]
[1495,9663,"ナガワ",0.56920000000000004,-3.56E-2,"37勝28敗",0.52310000000000001,3.5200000000000002E-2,"34勝31敗"]
[1496,9672,"東京都競馬",0.52,-2.8199999999999999E-2,"39勝36敗",0.53420000000000001,3.1E-2,"39勝34敗"]
[1497,9678,"カナモト",0.47889999999999999,-2.24E-2,"34勝37敗",0.61539999999999995,2.9399999999999999E-2,"40勝25敗"]
[1498,9682,"ＤＴＳ",0.53620000000000001,-2.86E-2,"37勝32敗",0.68630000000000002,3.85E-2,"35勝16敗"]
[1499,9684,"スクウェア・エニックス・ホールディングス",0.60870000000000002,-0.04,"42勝27敗",0.56599999999999995,3.4099999999999998E-2,"30勝23敗"]
[1500,9692,"シーイーシー",0.39729999999999999,-3.1399999999999997E-2,"29勝44敗",0.58109999999999995,3.4200000000000001E-2,"43勝31敗"]
[1501,9697,"カプコン",0.51160000000000005,-2.7400000000000001E-2,"44勝42敗",0.57140000000000002,5.0599999999999999E-2,"28勝21敗"]
[1502,9699,"ニシオホールディングス",0.47270000000000001,-2.3300000000000001E-2,"26勝29敗",0.67210000000000003,2.7099999999999999E-2,"41勝20敗"]
[1503,9702,"アイ・エス・ビー",0.48859999999999998,-3.4799999999999998E-2,"43勝45敗",0.46029999999999999,3.1800000000000002E-2,"29勝34敗"]
[1504,9706,"日本空港ビルデング",0.5,-3.2099999999999997E-2,"32勝32敗",0.62709999999999999,4.2599999999999999E-2,"37勝22敗"]
[1505,9715,"トランス・コスモス",0.49249999999999999,-2.9399999999999999E-2,"33勝34敗",0.54790000000000005,4.3200000000000002E-2,"40勝33敗"]
[1506,9716,"乃村工藝社",0.38890000000000002,-3.7499999999999999E-2,"21勝33敗",0.54169999999999996,2.35E-2,"39勝33敗"]
[1507,9719,"ＳＣＳＫ",0.42249999999999999,-2.1499999999999998E-2,"30勝41敗",0.47060000000000002,2.9899999999999999E-2,"24勝27敗"]
[1508,9722,"藤田観光",0.48649999999999999,-4.02E-2,"36勝38敗",0.56340000000000001,5.1400000000000001E-2,"40勝31敗"]
[1509,9729,"トーカイ",0.59650000000000003,-3.1300000000000001E-2,"34勝23敗",0.50939999999999996,2.6100000000000002E-2,"27勝26敗"]
[1510,9735,"セコム",0.54239999999999999,-2.63E-2,"32勝27敗",0.50939999999999996,2.69E-2,"27勝26敗"]
[1511,9739,"ＮＳＷ",0.55559999999999998,-3.09E-2,"40勝32敗",0.47060000000000002,2.9700000000000001E-2,"24勝27敗"]
[1512,9740,"セントラル警備保障",0.4677,-2.3400000000000001E-2,"29勝33敗",0.38329999999999997,3.8699999999999998E-2,"23勝37敗"]
[1513,9742,"アイネス",0.47499999999999998,-2.06E-2,"38勝42敗",0.46150000000000002,3.56E-2,"24勝28敗"]
[1514,9743,"丹青社",0.49120000000000003,-3.73E-2,"28勝29敗",0.54430000000000001,4.1399999999999999E-2,"43勝36敗"]
[1515,9744,"メイテックグループホールディングス",0.48480000000000001,-1.9699999999999999E-2,"32勝34敗",0.62070000000000003,2.69E-2,"36勝22敗"]
[1516,9746,"ＴＫＣ",0.5,-5.1900000000000002E-2,"37勝37敗",0.36170000000000002,3.0099999999999998E-2,"17勝30敗"]
[1517,9755,"応用地質",0.50590000000000002,-2.5000000000000001E-2,"43勝42敗",0.65449999999999997,0.03,"36勝19敗"]
[1518,9757,"船井総研ホールディングス",0.6038,-3.27E-2,"32勝21敗",0.55379999999999996,2.4500000000000001E-2,"36勝29敗"]
[1519,9759,"ＮＳＤ",0.57809999999999995,-2.5499999999999998E-2,"37勝27敗",0.49149999999999999,2.63E-2,"29勝30敗"]
[1520,9765,"オオバ",0.5333,-2.76E-2,"32勝28敗",0.69810000000000005,3.27E-2,"37勝16敗"]
[1521,9766,"コナミグループ",0.35289999999999999,-2.6599999999999999E-2,"30勝55敗",0.63790000000000002,5.11E-2,"37勝21敗"]
[1522,9769,"学究社",0.44440000000000002,-2.6700000000000002E-2,"40勝50敗",0.64290000000000003,2.06E-2,"27勝15敗"]
[1523,9787,"イオンディライト",0.60870000000000002,-1.8800000000000001E-2,"42勝27敗",0.5,2.06E-2,"24勝24敗"]
[1524,9788,"ナック",0.64200000000000002,-1.5699999999999999E-2,"52勝29敗",0.64290000000000003,2.1600000000000001E-2,"27勝15敗"]
[1525,9790,"福井コンピュータホールディングス",0.46939999999999998,-4.0099999999999997E-2,"23勝26敗",0.55700000000000005,3.1800000000000002E-2,"44勝35敗"]
[1526,9793,"ダイセキ",0.56920000000000004,-2.86E-2,"37勝28敗",0.46029999999999999,3.1600000000000003E-2,"29勝34敗"]
[1527,9795,"ステップ",0.54169999999999996,-2.3E-2,"39勝33敗",0.71879999999999999,1.5299999999999999E-2,"23勝9敗"]
[1528,9824,"泉州電業",0.44119999999999998,-2.6200000000000001E-2,"30勝38敗",0.50849999999999995,4.8800000000000003E-2,"30勝29敗"]
[1529,9830,"トラスコ中山",0.53700000000000003,-3.1899999999999998E-2,"29勝25敗",0.51429999999999998,3.04E-2,"36勝34敗"]
[1530,9831,"ヤマダホールディングス",0.50790000000000002,-2.4400000000000002E-2,"32勝31敗",0.55069999999999997,2.52E-2,"38勝31敗"]
[1531,9832,"オートバックスセブン",0.6119,-2.6499999999999999E-2,"41勝26敗",0.55169999999999997,2.2599999999999999E-2,"32勝26敗"]
[1532,9837,"モリト",0.43840000000000001,-2.8500000000000001E-2,"32勝41敗",0.69769999999999999,4.5900000000000003E-2,"30勝13敗"]
[1533,9842,"アークランズ",0.54669999999999996,-3.3799999999999997E-2,"41勝34敗",0.64810000000000001,3.2000000000000001E-2,"35勝19敗"]
[1534,9843,"ニトリホールディングス",0.5968,-1.83E-2,"37勝25敗",0.4627,2.64E-2,"31勝36敗"]
[1535,9850,"グルメ杵屋",0.57410000000000005,-1.6400000000000001E-2,"31勝23敗",0.63460000000000005,2.3599999999999999E-2,"33勝19敗"]
[1536,9861,"吉野家ホールディングス",0.5323,-2.4799999999999999E-2,"33勝29敗",0.6,3.6900000000000002E-2,"36勝24敗"]
[1537,9869,"加藤産業",0.63380000000000003,-2.5000000000000001E-2,"45勝26敗",0.47539999999999999,2.0500000000000001E-2,"29勝32敗"]
[{"$f":"ROW()-2","v":1538},9880,"イノテック",0.4667,-3.5099999999999999E-2,"35勝40敗",0.55100000000000005,3.5900000000000001E-2,"27勝22敗"]
[1539,9882,"イエローハット",0.65329999999999999,-2.46E-2,"49勝26敗",0.48,2.35E-2,"24勝26敗"]
[1540,9887,"松屋フーズホールディングス",0.45450000000000002,-1.54E-2,"35勝42敗",0.57999999999999996,2.0299999999999999E-2,"29勝21敗"]
[1541,9889,"ＪＢＣＣホールディングス",0.51249999999999996,-3.1899999999999998E-2,"41勝39敗",0.65,2.3599999999999999E-2,"26勝14敗"]
[1542,9900,"サガミホールディングス",0.50670000000000004,-1.6299999999999999E-2,"38勝37敗",0.4844,2.5600000000000001E-2,"31勝33敗"]
[1543,9902,"日伝",0.52380000000000004,-3.6900000000000002E-2,"33勝30敗",0.61539999999999995,3.9300000000000002E-2,"32勝20敗"]
[1544,9928,"ミロク情報サービス",0.41670000000000001,-2.5999999999999999E-2,"25勝35敗",0.54649999999999999,3.7900000000000003E-2,"47勝39敗"]
[1545,9932,"杉本商事",0.56059999999999999,-3.7100000000000001E-2,"37勝29敗",0.55100000000000005,3.5400000000000001E-2,"27勝22敗"]
[1546,9934,"因幡電機産業",0.5181,-2.1899999999999999E-2,"43勝40敗",0.6875,2.86E-2,"33勝15敗"]
[1547,9936,"王将フードサービス",0.55130000000000001,-1.8200000000000001E-2,"43勝35敗",0.66669999999999996,2.52E-2,"28勝14敗"]
[1548,9946,"ミニストップ",0.50749999999999995,-1.4E-2,"34勝33敗",0.72340000000000004,3.95E-2,"34勝13敗"]
[1549,9948,"アークス",0.52110000000000001,-2.5700000000000001E-2,"37勝34敗",0.72,2.93E-2,"36勝14敗"]
[1550,9956,"バローホールディングス",0.46029999999999999,-2.9000000000000001E-2,"29勝34敗",0.42670000000000002,2.64E-2,"32勝43敗"]
[1551,9960,"東テク",0.4304,-2.4E-2,"34勝45敗",0.52500000000000002,4.1599999999999998E-2,"21勝19敗"]
[1552,9962,"ミスミグループ本社",0.51519999999999999,-3.15E-2,"34勝32敗",0.60870000000000002,3.4799999999999998E-2,"42勝27敗"]
[1553,9974,"ベルク",0.60319999999999996,-2.8299999999999999E-2,"38勝25敗",0.66,2.64E-2,"33勝17敗"]
[1554,9983,"ファーストリテイリング",0.5,-2.8400000000000002E-2,"41勝41敗",0.59650000000000003,4.7199999999999999E-2,"34勝23敗"]
[1555,9984,"ソフトバンクグループ",0.52239999999999998,-3.7699999999999997E-2,"35勝32敗",0.61899999999999999,6.7799999999999999E-2,"39勝24敗"]
[1556,9987,"スズケン",0.47220000000000001,-3.5400000000000001E-2,"34勝38敗",0.50819999999999999,2.46E-2,"31勝30敗"]
[1557,9989,"サンドラッグ",0.61399999999999999,-3.2099999999999997E-2,"35勝22敗",0.52,4.1799999999999997E-2,"26勝24敗"]
[1558,9990,"サックスバー　ホールディングス",0.57140000000000002,-3.6200000000000003E-2,"40勝30敗",0.54720000000000002,4.4699999999999997E-2,"29勝24敗"]
[1559,9991,"ジェコス",0.5373,-2.23E-2,"36勝31敗",0.53449999999999998,2.75E-2,"31勝27敗"]
[1560,9997,"ベルーナ",0.29310000000000003,-2.7E-2,"17勝41敗",0.50700000000000001,2.6800000000000001E-2,"36勝35敗"]

{"sheet":"利用方法説明","index":3,"n_rows":38,"n_cols":39,"rows_kept":38,"cut":false,"hidden":false,"merged":[[3,25,4,32],[17,1,18,17]]}
[]
[null,"利用方法　説明"]
[]
[null,"【　はじめに　】",null,null,null,null,null,null,null,null,null,null,null,null,null,null,null,null,null,null,null,null,null,null,null,"Ａ．　銘柄一覧シート"]
[null,"同エクセルシートは４枚のシートで構成されています。"]
[]
[]
[]
[]
[null,"Ａ","銘柄一覧シート",null,null,null,null,"取引時間帯にメインで利用する銘柄一覧です。"]
[null,null,null,null,null,null,null,"取引時間中に現在値などリアルタイムで更新します。"]
[null,"Ｂ","ヒストリカルデータ",null,null,null,null,"データのリフレッシュを常に行って頂くため、"]
[null,null,"取得シート",null,null,null,null,"Ｅｘｃｅｌを立ち上げたら、まずデータ取得を行ってい頂きます。"]
[null,"Ｃ","バックテストデータ",null,null,null,null,"定められた法則にそって取引をおこなったとき、"]
[null,null,"５Ｄ_5Y",null,null,null,null,"取引が“益（勝ち）”となったか“損（負け）”となったか検証した結果データです。"]
[null,"Ｄ","利用方法説明",null,null,null,null,"このシートです。"]
[]
[null,"Ｂ．　ヒストリカルデータ取得シート"]
[]
[null,null,"まず、ヒストリカルデータの最新状態を取得頂くことで、ボリンジャーバンド範囲の株価を算出します。"]
[]
[null,null,null,null,null,null,null,null,null,null,null,null,null,null,null,null,null,null,null,null,null,null,null,null,null,"①","１００件の銘柄コードを入力できます。デフォルトではＴＯＰＩＸ１００銘柄が入っています。"]
[null,null,null,null,null,null,null,null,null,null,null,null,null,null,null,null,null,null,null,null,null,null,null,null,null,null,"黄色セル（銘柄コード入力）は、自由に変更でき、別の銘柄情報を取得します。"]
[null,null,null,null,null,null,null,null,null,null,null,null,null,null,null,null,null,null,null,null,null,null,null,null,null,"②","ネオトレＡＰＩのワークシート関数を用いて、取引時間中に有効な銘柄情報を"]
[null,null,null,null,null,null,null,null,null,null,null,null,null,null,null,null,null,null,null,null,null,null,null,null,null,null,"リアルタイムで更新させます。"]
[null,null,null,null,null,null,null,null,null,null,null,null,null,null,null,null,null,null,null,null,null,null,null,null,null,"③","ネオトレＡＰＩのワークシート関数を用いて、取得したヒストリカルデータを元に"]
[null,null,null,null,null,null,null,null,null,null,null,null,null,null,null,null,null,null,null,null,null,null,null,null,null,null,"±２σのボリンジャーバンド帯を算出し、それぞれの計算値を表示させています。"]
[null,null,null,null,null,null,null,null,null,null,null,null,null,null,null,null,null,null,null,null,null,null,null,null,null,null,"「ゲージ」は、同銘柄の現在値が＋、－のどちらに傾いているかを一目できるようになっています。"]
[null,null,null,null,null,null,null,null,null,null,null,null,null,null,null,null,null,null,null,null,null,null,null,null,null,"④","対象銘柄が③エリアでボリンジャーバンドを超過した場合、Ｃシート（バックテストデータ５Ｄ_5Y)の"]
[null,null,null,null,null,null,null,null,null,null,null,null,null,null,null,null,null,null,null,null,null,null,null,null,null,null,"過去５年における勝敗結果を表示します。"]
[]
[null,null,null,null,null,null,null,null,null,null,null,null,null,null,null,null,null,null,null,null,null,null,null,null,"Ｃ．　バックテストデータ_5D_5Y"]
[null,null,null,null,null,null,null,null,null,null,null,null,null,null,null,null,null,null,null,null,null,null,null,null,null,null,"過去の日足データにルールを設けて、"]
[null,"⑤","データ取得は、「ヒストリカルデータ更新」ボタンを押下することで実行されます。",null,null,null,null,null,null,null,null,null,null,null,null,null,null,null,null,null,null,null,null,null,null,null,"シグナルが発生した時に逆張りをしたらどうなったかを検証したデータです。"]
[null,"⑥","実際の実行フラグは、Ａ８セルの数値が「１」となることでネオトレＡＰＩ関数が実行されます。",null,null,null,null,null,null,null,null,null,null,null,null,null,null,null,null,null,null,null,null,null,null,null,null,null,"ルール　１",null,null,"シグナルが発生した翌営業日の「寄付」で新規建てする。"]
[null,"⑦","日足のヒストリカルデータを取得するので、一日一回の取得で同エクセルは機能します。",null,null,null,null,null,null,null,null,null,null,null,null,null,null,null,null,null,null,null,null,null,null,null,null,null,null,null,null,"　下水準シグナルなら　買建て",null,null,null,null,null,null,"　上水準シグナルなら　売建て"]
[null,null,"取得が終わったら「データ取得完了」ボタンを押下し、起動フラグを止める事をお勧めします。",null,null,null,null,null,null,null,null,null,null,null,null,null,null,null,null,null,null,null,null,null,null,null,null,null,"ルール　２",null,null,"5営業日後の「終値」で決済する。"]
[null,"⑧","そのほか、【ご案内】の記載内容を確認下さい。",null,null,null,null,null,null,null,null,null,null,null,null,null,null,null,null,null,null,null,null,null,null,null,null,null,null,"　※　　ご利用にあたり、同シートを変更すると結果が正しく表示されなくなります。"]