{"text_format":"1","workbook":"xlsx","n_sheets":3,"sheets":["説明","ストキャスティクス表示シート","ストキャスティクス計算シート"],"not_rendered":{"charts":0,"images":2,"macros":1,"external_links":0,"defined_names":0,"comments":0,"pivot_tables":0},"unopened":[],"bounds":{"document_bytes":16777216,"sheet_cells":100000,"rows_first":2000,"rows_last":500,"rows_between":2000,"halvings":0,"cell_chars":16384,"cell_head_chars":4096},"cells_cut":0,"cells_raw":0,"read":"whole","date_system":"1900"}

{"sheet":"説明","index":0,"n_rows":43,"n_cols":19,"rows_kept":43,"cut":false,"hidden":false,"merged":[]}
[]
[null,"サンプルシートの説明"]
[]
[]
[]
[null,null,null,null,null,null,null,null,null,null,null,null,null,null,null,null,null,null,"■使用手順"]
[null,null,null,null,null,null,null,null,null,null,null,null,null,null,null,null,null,null,"①ストキャスティクス表示シートの銘柄コード欄に調べたい銘柄コードを入力します。"]
[]
{"$rows_left_out":36}
{"sheet":"ストキャスティクス表示シート","index":1,"n_rows":55,"n_cols":13,"rows_kept":55,"cut":false,"hidden":false,"merged":[]}
[]
[]
[]
[null,null,null,null,null,null,null,null,null,"閾値","%K %D共に",80,"以上になったら"]
["#","銘柄コード","銘柄名称","現値","％K","％D","閾値判定",null,null,"閾値","%K %D共に",20,"以下になったら"]
[1,"9405",{"$f":"IF($B6=\"\",\"← 銘柄コード\",_xll.SNT.StockInst($B6,\"銘柄名称\"))","v":"=IF($B6=\"\",\"← 銘柄コード\",SNT.StockInst($B6,\"銘柄名称\")) => 銘柄情報取得中"},{"$f":"IF(B6=\"\",\"\",_xll.SNT.StockInst(B6,$D$5))","v":"=IF(B6=\"\",\"\",SNT.StockInst(B6,$D$5)) => 銘柄情報取得中"},{"$f":"INDEX(ストキャスティクス計算シート!$E$27:$ZZ$27, 1, 1 + (ROW()-6)*6)","v":90.909090909090907},{"$f":"INDEX(ストキャスティクス計算シート!$E$28:$ZZ$28, 1, 1 + (ROW()-6)*6)","v":""},{"$f":"IF(OR(E6=\"\", F6=\"\"), \"\", IF(AND(E6>=$L$4, F6>=$L$4), 1, IF(AND(E6<=$L$5, F6<=$L$5), 2, \"\")))","v":""}]
[2,"4825",{"$f":"IF($B7=\"\",\"← 銘柄コード\",_xll.SNT.StockInst($B7,\"銘柄名称\"))","v":"=IF($B7=\"\",\"← 銘柄コード\",SNT.StockInst($B7,\"銘柄名称\")) => 銘柄情報取得中"},{"$f":"IF(B7=\"\",\"\",_xll.SNT.StockInst(B7,$D$5))","v":"=IF(B7=\"\",\"\",SNT.StockInst(B7,$D$5)) => 銘柄情報取得中"},{"$f":"INDEX(ストキャスティクス計算シート!$E$27:$ZZ$27, 1, 1 + (ROW()-6)*6)","v":10.309278350515463},{"$f":"INDEX(ストキャスティクス計算シート!$E$28:$ZZ$28, 1, 1 + (ROW()-6)*6)","v":11.340206185567011},{"$f":"IF(OR(E7=\"\", F7=\"\"), \"\", IF(AND(E7>=$L$4, F7>=$L$4), 1, IF(AND(E7<=$L$5, F7<=$L$5), 2, \"\")))","v":2}]
[3,"9946",{"$f":"IF($B8=\"\",\"← 銘柄コード\",_xll.SNT.StockInst($B8,\"銘柄名称\"))","v":"=IF($B8=\"\",\"← 銘柄コード\",SNT.StockInst($B8,\"銘柄名称\")) => 銘柄情報取得中"},{"$f":"IF(B8=\"\",\"\",_xll.SNT.StockInst(B8,$D$5))","v":"=IF(B8=\"\",\"\",SNT.StockInst(B8,$D$5)) => 銘柄情報取得中"},{"$f":"INDEX(ストキャスティクス計算シート!$E$27:$ZZ$27, 1, 1 + (ROW()-6)*6)","v":77.717391304347828},{"$f":"INDEX(ストキャスティクス計算シート!$E$28:$ZZ$28, 1, 1 + (ROW()-6)*6)","v":76.862514688601649},""]
{"$rows_left_out":48}
{"sheet":"ストキャスティクス計算シート","index":2,"n_rows":28,"n_cols":299,"rows_kept":28,"cut":false,"hidden":false,"merged":[]}
["ヒストリカルデータ　複数銘柄一括取得"]
["足種別","15m","取得本数",16,null,null,null,null,null,null,null,null,null,null,null,null,null,null,null,null,null,null,null,null,null,null,null,null,null,null,null,null,null,null,null,null,null,null,null,null,null,{"$f":"IF(MOD(COLUMN()-COLUMN($A$4),6)=0, INT((COLUMN()-COLUMN($A$4))/6)+1, \"\")","v":""}]
[]
[1,{"$f":"IFERROR(LEFT(A5,4),\"\")","v":"9405"},{"$f":"IFERROR(_xll.SNT.StockInst(B4,\"銘柄名称\"),\"\")","v":"=IFERROR(SNT.StockInst(B4,\"銘柄名称\"),\"\") => 銘柄情報取得中"},"","","",2,{"$f":"IFERROR(LEFT(G5,4),\"\")","v":"4825"},{"$f":"IFERROR(_xll.SNT.StockInst(H4,\"銘柄名称\"),\"\")","v":"=IFERROR(SNT.StockInst(H4,\"銘柄名称\"),\"\") => 銘柄情報取得中"},"","","",3,{"$f":"IFERROR(LEFT(M5,4),\"\")","v":"9946"},{"$f":"IFERROR(_xll.SNT.StockInst(N4,\"銘柄名称\"),\"\")","v":"=IFERROR(SNT.StockInst(N4,\"銘柄名称\"),\"\") => 銘柄情報取得中"},"","","",4,{"$f":"IFERROR(LEFT(S5,4),\"\")","v":"7730"},{"$f":"IFERROR(_xll.SNT.StockInst(T4,\"銘柄名称\"),\"\")","v":"=IFERROR(SNT.StockInst(T4,\"銘柄名称\"),\"\") => 銘柄情報取得中"},"","","",5,{"$f":"IFERROR(LEFT(Y5,4),\"\")","v":"2918"},{"$f":"IFERROR(_xll.SNT.StockInst(Z4,\"銘柄名称\"),\"\")","v":"わらべ日洋"},"","","",6,{"$f":"IFERROR(LEFT(AE5,4),\"\")","v":"4229"},{"$f":"IFERROR(_xll.SNT.StockInst(AF4,\"銘柄名称\"),\"\")","v":"=IFERROR(SNT.StockInst(AF4,\"銘柄名称\"),\"\") => 銘柄情報取得中"},"","","",7,{"$f":"IFERROR(LEFT(AK5,4),\"\")","v":"6844"},{"$f":"IFERROR(_xll.SNT.StockInst(AL4,\"銘柄名称\"),\"\")","v":"=IFERROR(SNT.StockInst(AL4,\"銘柄名称\"),\"\") => 銘柄情報取得中"},"","","",8,{"$f":"IFERROR(LEFT(AQ5,4),\"\")","v":"6157"},{"$f":"IFERROR(_xll.SNT.StockInst(AR4,\"銘柄名称\"),\"\")","v":"=IFERROR(SNT.StockInst(AR4,\"銘柄名称\"),\"\") => 銘柄情報取得中"},"","","",9,{"$f":"IFERROR(LEFT(AW5,4),\"\")","v":"8079"},{"$f":"IFERROR(_xll.SNT.StockInst(AX4,\"銘柄名称\"),\"\")","v":"=IFERROR(SNT.StockInst(AX4,\"銘柄名称\"),\"\") => 銘柄情報取得中"},"","","",10,{"$f":"IFERROR(LEFT(BC5,4),\"\")","v":"7244"},{"$f":"IFERROR(_xll.SNT.StockInst(BD4,\"銘柄名称\"),\"\")","v":"=IFERROR(SNT.StockInst(BD4,\"銘柄名称\"),\"\") => 銘柄情報取得中"},"","","",11,{"$f":"IFERROR(LEFT(BI5,4),\"\")","v":"2307"},{"$f":"IFERROR(_xll.SNT.StockInst(BJ4,\"銘柄名称\"),\"\")","v":"=IFERROR(SNT.StockInst(BJ4,\"銘柄名称\"),\"\") => 銘柄情報取得中"},"","","",12,{"$f":"IFERROR(LEFT(BO5,4),\"\")","v":"6183"},{"$f":"IFERROR(_xll.SNT.StockInst(BP4,\"銘柄名称\"),\"\")","v":"=IFERROR(SNT.StockInst(BP4,\"銘柄名称\"),\"\") => 銘柄情報取得中"},"","","",13,{"$f":"IFERROR(LEFT(BU5,4),\"\")","v":"2670"},{"$f":"IFERROR(_xll.SNT.StockInst(BV4,\"銘柄名称\"),\"\")","v":"ＡＢＣマート"},"","","",14,{"$f":"IFERROR(LEFT(CA5,4),\"\")","v":"7550"},{"$f":"IFERROR(_xll.SNT.StockInst(CB4,\"銘柄名称\"),\"\")","v":"=IFERROR(SNT.StockInst(CB4,\"銘柄名称\"),\"\") => 銘柄情報取得中"},"","","",15,{"$f":"IFERROR(LEFT(CG5,4),\"\")","v":"2540"},{"$f":"IFERROR(_xll.SNT.StockInst(CH4,\"銘柄名称\"),\"\")","v":"養命酒"},"","","",16,{"$f":"IFERROR(LEFT(CM5,4),\"\")","v":"4410"},{"$f":"IFERROR(_xll.SNT.StockInst(CN4,\"銘柄名称\"),\"\")","v":"=IFERROR(SNT.StockInst(CN4,\"銘柄名称\"),\"\") => 銘柄情報取得中"},"","","",17,{"$f":"IFERROR(LEFT(CS5,4),\"\")","v":"6590"},{"$f":"IFERROR(_xll.SNT.StockInst(CT4,\"銘柄名称\"),\"\")","v":"芝浦"},"","","",18,{"$f":"IFERROR(LEFT(CY5,4),\"\")","v":"9832"},{"$f":"IFERROR(_xll.SNT.StockInst(CZ4,\"銘柄名称\"),\"\")","v":"=IFERROR(SNT.StockInst(CZ4,\"銘柄名称\"),\"\") => 銘柄情報取得中"},"","","",19,{"$f":"IFERROR(LEFT(DE5,4),\"\")","v":"6740"},{"$f":"IFERROR(_xll.SNT.StockInst(DF4,\"銘柄名称\"),\"\")","v":"=IFERROR(SNT.StockInst(DF4,\"銘柄名称\"),\"\") => 銘柄情報取得中"},"","","",20,{"$f":"IFERROR(LEFT(DK5,4),\"\")","v":"3676"},{"$f":"IFERROR(_xll.SNT.StockInst(DL4,\"銘柄名称\"),\"\")","v":"=IFERROR(SNT.StockInst(DL4,\"銘柄名称\"),\"\") => 銘柄情報取得中"},"","","",21,{"$f":"IFERROR(LEFT(DQ5,4),\"\")","v":"5632"},{"$f":"IFERROR(_xll.SNT.StockInst(DR4,\"銘柄名称\"),\"\")","v":"=IFERROR(SNT.StockInst(DR4,\"銘柄名称\"),\"\") => 銘柄情報取得中"},"","","",22,{"$f":"IFERROR(LEFT(DW5,4),\"\")","v":"6387"},{"$f":"IFERROR(_xll.SNT.StockInst(DX4,\"銘柄名称\"),\"\")","v":"=IFERROR(SNT.StockInst(DX4,\"銘柄名称\"),\"\") => 銘柄情報取得中"},"","","",23,{"$f":"IFERROR(LEFT(EC5,4),\"\")","v":"9716"},{"$f":"IFERROR(_xll.SNT.StockInst(ED4,\"銘柄名称\"),\"\")","v":"=IFERROR(SNT.StockInst(ED4,\"銘柄名称\"),\"\") => 銘柄情報取得中"},"","","",24,{"$f":"IFERROR(LEFT(EI5,4),\"\")","v":"8095"},{"$f":"IFERROR(_xll.SNT.StockInst(EJ4,\"銘柄名称\"),\"\")","v":"=IFERROR(SNT.StockInst(EJ4,\"銘柄名称\"),\"\") => 銘柄情報取得中"},"","","",25,{"$f":"IFERROR(LEFT(EO5,4),\"\")","v":"3093"},{"$f":"IFERROR(_xll.SNT.StockInst(EP4,\"銘柄名称\"),\"\")","v":"トレファク"},"","","",26,{"$f":"IFERROR(LEFT(EU5,4),\"\")","v":"9536"},{"$f":"IFERROR(_xll.SNT.StockInst(EV4,\"銘柄名称\"),\"\")","v":"=IFERROR(SNT.StockInst(EV4,\"銘柄名称\"),\"\") => 銘柄情報取得中"},"","","",27,{"$f":"IFERROR(LEFT(FA5,4),\"\")","v":"7888"},{"$f":"IFERROR(_xll.SNT.StockInst(FB4,\"銘柄名称\"),\"\")","v":"=IFERROR(SNT.StockInst(FB4,\"銘柄名称\"),\"\") => 銘柄情報取得中"},"","","",28,{"$f":"IFERROR(LEFT(FG5,4),\"\")","v":"9247"},{"$f":"IFERROR(_xll.SNT.StockInst(FH4,\"銘柄名称\"),\"\")","v":"=IFERROR(SNT.StockInst(FH4,\"銘柄名称\"),\"\") => 銘柄情報取得中"},"","","",29,{"$f":"IFERROR(LEFT(FM5,4),\"\")","v":"8103"},{"$f":"IFERROR(_xll.SNT.StockInst(FN4,\"銘柄名称\"),\"\")","v":"=IFERROR(SNT.StockInst(FN4,\"銘柄名称\"),\"\") => 銘柄情報取得中"},"","","",30,{"$f":"IFERROR(LEFT(FS5,4),\"\")","v":"3179"},{"$f":"IFERROR(_xll.SNT.StockInst(FT4,\"銘柄名称\"),\"\")","v":"=IFERROR(SNT.StockInst(FT4,\"銘柄名称\"),\"\") => 銘柄情報取得中"},"","","",31,{"$f":"IFERROR(LEFT(FY5,4),\"\")","v":"3141"},{"$f":"IFERROR(_xll.SNT.StockInst(FZ4,\"銘柄名称\"),\"\")","v":"=IFERROR(SNT.StockInst(FZ4,\"銘柄名称\"),\"\") => 銘柄情報取得中"},"","","",32,{"$f":"IFERROR(LEFT(GE5,4),\"\")","v":"3546"},{"$f":"IFERROR(_xll.SNT.StockInst(GF4,\"銘柄名称\"),\"\")","v":"=IFERROR(SNT.StockInst(GF4,\"銘柄名称\"),\"\") => 銘柄情報取得中"},"","","",33,{"$f":"IFERROR(LEFT(GK5,4),\"\")","v":"2269"},{"$f":"IFERROR(_xll.SNT.StockInst(GL4,\"銘柄名称\"),\"\")","v":"明治ＨＤ"},"","","",34,{"$f":"IFERROR(LEFT(GQ5,4),\"\")","v":"2930"},{"$f":"IFERROR(_xll.SNT.StockInst(GR4,\"銘柄名称\"),\"\")","v":"北の達人"},"","","",35,{"$f":"IFERROR(LEFT(GW5,4),\"\")","v":"5032"},{"$f":"IFERROR(_xll.SNT.StockInst(GX4,\"銘柄名称\"),\"\")","v":"=IFERROR(SNT.StockInst(GX4,\"銘柄名称\"),\"\") => 銘柄情報取得中"},"","","",36,{"$f":"IFERROR(LEFT(HC5,4),\"\")","v":"3073"},{"$f":"IFERROR(_xll.SNT.StockInst(HD4,\"銘柄名称\"),\"\")","v":"ＤＤグループ"},"","","",37,{"$f":"IFERROR(LEFT(HI5,4),\"\")","v":"3679"},{"$f":"IFERROR(_xll.SNT.StockInst(HJ4,\"銘柄名称\"),\"\")","v":"じげん"},"","","",38,{"$f":"IFERROR(LEFT(HO5,4),\"\")","v":"2491"},{"$f":"IFERROR(_xll.SNT.StockInst(HP4,\"銘柄名称\"),\"\")","v":"=IFERROR(SNT.StockInst(HP4,\"銘柄名称\"),\"\") => 銘柄情報取得中"},"","","",39,{"$f":"IFERROR(LEFT(HU5,4),\"\")","v":"8919"},{"$f":"IFERROR(_xll.SNT.StockInst(HV4,\"銘柄名称\"),\"\")","v":"=IFERROR(SNT.StockInst(HV4,\"銘柄名称\"),\"\") => 銘柄情報取得中"},"","","",40,{"$f":"IFERROR(LEFT(IA5,4),\"\")","v":"4714"},{"$f":"IFERROR(_xll.SNT.StockInst(IB4,\"銘柄名称\"),\"\")","v":"リソー教育Ｇ"},"","","",41,{"$f":"IFERROR(LEFT(IG5,4),\"\")","v":"3543"},{"$f":"IFERROR(_xll.SNT.StockInst(IH4,\"銘柄名称\"),\"\")","v":"コメダ"},"","","",42,{"$f":"IFERROR(LEFT(IM5,4),\"\")","v":"7596"},{"$f":"IFERROR(_xll.SNT.StockInst(IN4,\"銘柄名称\"),\"\")","v":"=IFERROR(SNT.StockInst(IN4,\"銘柄名称\"),\"\") => 銘柄情報取得中"},"","","",43,{"$f":"IFERROR(LEFT(IS5,4),\"\")","v":"9715"},{"$f":"IFERROR(_xll.SNT.StockInst(IT4,\"銘柄名称\"),\"\")","v":"=IFERROR(SNT.StockInst(IT4,\"銘柄名称\"),\"\") => 銘柄情報取得中"},"","","",44,{"$f":"IFERROR(LEFT(IY5,4),\"\")","v":"9600"},{"$f":"IFERROR(_xll.SNT.StockInst(IZ4,\"銘柄名称\"),\"\")","v":"=IFERROR(SNT.StockInst(IZ4,\"銘柄名称\"),\"\") => 銘柄情報取得中"},"","","",45,{"$f":"IFERROR(LEFT(JE5,4),\"\")","v":"2791"},{"$f":"IFERROR(_xll.SNT.StockInst(JF4,\"銘柄名称\"),\"\")","v":"=IFERROR(SNT.StockInst(JF4,\"銘柄名称\"),\"\") => 銘柄情報取得中"},"","","",46,{"$f":"IFERROR(LEFT(JK5,4),\"\")","v":"4719"},{"$f":"IFERROR(_xll.SNT.StockInst(JL4,\"銘柄名称\"),\"\")","v":"=IFERROR(SNT.StockInst(JL4,\"銘柄名称\"),\"\") => 銘柄情報取得中"},"","","",47,{"$f":"IFERROR(LEFT(JQ5,4),\"\")","v":"6445"},{"$f":"IFERROR(_xll.SNT.StockInst(JR4,\"銘柄名称\"),\"\")","v":"=IFERROR(SNT.StockInst(JR4,\"銘柄名称\"),\"\") => 銘柄情報取得中"},"","","",48,{"$f":"IFERROR(LEFT(JW5,4),\"\")","v":"8203"},{"$f":"IFERROR(_xll.SNT.StockInst(JX4,\"銘柄名称\"),\"\")","v":"=IFERROR(SNT.StockInst(JX4,\"銘柄名称\"),\"\") => 銘柄情報取得中"},"","","",49,{"$f":"IFERROR(LEFT(KC5,4),\"\")","v":"6506"},{"$f":"IFERROR(_xll.SNT.StockInst(KD4,\"銘柄名称\"),\"\")","v":"=IFERROR(SNT.StockInst(KD4,\"銘柄名称\"),\"\") => 銘柄情報取得中"},"","","",50,{"$f":"IFERROR(LEFT(KI5,4),\"\")","v":"2471"},{"$f":"IFERROR(_xll.SNT.StockInst(KJ4,\"銘柄名称\"),\"\")","v":"=IFERROR(SNT.StockInst(KJ4,\"銘柄名称\"),\"\") => 銘柄情報取得中"},"",""]
["9405:日付","9405:始値","9405:高値","9405:安値","9405:終値",null,"4825:日付","4825:始値","4825:高値","4825:安値","4825:終値",null,"9946:日付","9946:始値","9946:高値","9946:安値","9946:終値",null,"7730:日付","7730:始値","7730:高値","7730:安値","7730:終値",null,"2918:日付","2918:始値","2918:高値","2918:安値","2918:終値",null,"4229:日付","4229:始値","4229:高値","4229:安値","4229:終値",null,"6844:日付","6844:始値","6844:高値","6844:安値","6844:終値",null,"6157:日付","6157:始値","6157:高値","6157:安値","6157:終値",null,"8079:日付","8079:始値","8079:高値","8079:安値","8079:終値",null,"7244:日付","7244:始値","7244:高値","7244:安値","7244:終値",null,"2307:日付","2307:始値","2307:高値","2307:安値","2307:終値",null,"6183:日付","6183:始値","6183:高値","6183:安値","6183:終値",null,"2670:日付","2670:始値","2670:高値","2670:安値","2670:終値",null,"75505:日付","75505:始値","75505:高値","75505:安値","75505:終値",null,"2540:日付","2540:始値","2540:高値","2540:安値","2540:終値",null,"4410:日付","4410:始値","4410:高値","4410:安値","4410:終値",null,"6590:日付","6590:始値","6590:高値","6590:安値","6590:終値",null,"9832:日付","9832:始値","9832:高値","9832:安値","9832:終値",null,"6740:日付","6740:始値","6740:高値","6740:安値","6740:終値",null,"3676:日付","3676:始値","3676:高値","3676:安値","3676:終値",null,"5632:日付","5632:始値","5632:高値","5632:安値","5632:終値",null,"6387:日付","6387:始値","6387:高値","6387:安値","6387:終値",null,"9716:日付","9716:始値","9716:高値","9716:安値","9716:終値",null,"8095:日付","8095:始値","8095:高値","8095:安値","8095:終値",null,"3093:日付","3093:始値","3093:高値","3093:安値","3093:終値",null,"9536:日付","9536:始値","9536:高値","9536:安値","9536:終値",null,"7888:日付","7888:始値","7888:高値","7888:安値","7888:終値",null,"9247:日付","9247:始値","9247:高値","9247:安値","9247:終値",null,"8103:日付","8103:始値","8103:高値","8103:安値","8103:終値",null,"3179:日付","3179:始値","3179:高値","3179:安値","3179:終値",null,"3141:日付","3141:始値","3141:高値","3141:安値","3141:終値",null,"3546:日付","3546:始値","3546:高値","3546:安値","3546:終値",null,"2269:日付","2269:始値","2269:高値","2269:安値","2269:終値",null,"2930:日付","2930:始値","2930:高値","2930:安値","2930:終値",null,"5032:日付","5032:始値","5032:高値","5032:安値","5032:終値",null,"3073:日付","3073:始値","3073:高値","3073:安値","3073:終値",null,"3679:日付","3679:始値","3679:高値","3679:安値","3679:終値",null,"2491:日付","2491:始値","2491:高値","2491:安値","2491:終値",null,"8919:日付","8919:始値","8919:高値","8919:安値","8919:終値",null,"4714:日付","4714:始値","4714:高値","4714:安値","4714:終値",null,"3543:日付","3543:始値","3543:高値","3543:安値","3543:終値",null,"7596:日付","7596:始値","7596:高値","7596:安値","7596:終値",null,"9715:日付","9715:始値","9715:高値","9715:安値","9715:終値",null,"9600:日付","9600:始値","9600:高値","9600:安値","9600:終値",null,"2791:日付","2791:始値","2791:高値","2791:安値","2791:終値",null,"4719:日付","4719:始値","4719:高値","4719:安値","4719:終値",null,"6445:日付","6445:始値","6445:高値","6445:安値","6445:終値",null,"8203:日付","8203:始値","8203:高値","8203:安値","8203:終値",null,"6506:日付","6506:始値","6506:高値","6506:安値","6506:終値",null,"2471:日付","2471:始値","2471:高値","2471:安値","2471:終値"]
["2025-10-08T15:00:00",746,746,744,745,null,"2025-10-08T15:00:00",4765,4785,4760,4765,null,"2025-10-08T15:00:00",1959,1960,1955,1960,null,"2025-10-08T15:00:00",1296.5,1301,1295,1300.5,null,"2025-10-08T15:00:00",null,null,null,null,null,"2025-10-08T14:45:00",3330,3330,3330,3330,null,"2025-10-08T15:00:00",3255,3260,3255,3260,null,"2025-10-08T15:00:00",782,783,782,783,null,"2025-10-08T15:00:00",4190,4195,4185,4185,null,"2025-10-08T15:00:00",443,443,442,443,null,"2025-10-08T15:00:00",1155,1155,1154,1155,null,"2025-10-08T15:00:00",1342,1344,1340,1344,null,"2025-10-08T15:00:00",2913,2917,2910,2911,null,"2025-10-08T11:15:00",null,null,null,null,null,"2025-10-08T15:00:00",3990,3990,3980,3985,null,"2025-10-08T15:00:00",892,893,892,892,null,"2025-10-08T15:00:00",14930,14940,14870,14870,null,"2025-10-08T15:00:00",1545,1545,1543,1543,null,"2025-10-08T15:00:00",19,20,18,18,null,"2025-10-08T15:00:00",981,981,977,978,null,"2025-10-08T15:00:00",1921,1928,1914,1916,null,"2025-10-08T15:00:00",4045,4045,4025,4025,null,"2025-10-08T15:00:00",1061,1061,1055,1055,null,"2025-10-08T15:00:00",525,525,523,523,null,"2025-10-08T15:00:00",1796,1796,1789,1789,null,"2025-10-08T14:45:00",1946,1946,1945,1945,null,"2025-10-08T15:00:00",903,903,898,900,null,"2025-10-08T15:00:00",1516,1516,1511,1511,null,"2025-10-08T15:00:00",844,845,842,843,null,"2025-10-08T15:00:00",1254,1254,1254,1254,null,"2025-10-08T15:00:00",2712.5,2716.5,2705.5,2707,null,"2025-10-08T15:00:00",1059,1060,1059,1059,null,"2025-10-08T15:00:00",3029,3030,3022,3022,null,"2025-10-08T15:00:00",144,145,144,144,null,"2025-10-08T15:00:00",5760,5760,5730,5740,null,"2025-10-08T15:00:00",1690,1690,1690,1690,null,"2025-10-08T15:00:00",536,536,534,535,null,"2025-10-08T15:00:00",747,748,747,747,null,"2025-10-08T15:00:00",2741,2742,2735,2735,null,"2025-10-08T15:00:00",217,218,217,217,null,"2025-10-08T15:00:00",3060,3065,3055,3055,null,"2025-10-08T15:00:00",2376,2376,2375,2375,null,"2025-10-08T15:00:00",3630,3635,3625,3630,null,"2025-10-08T15:00:00",2529,2529,2528,2528,null,"2025-10-08T14:45:00",7060,7060,7050,7050,null,"2025-10-08T15:00:00",3720,3720,3705,3715,null,"2025-10-08T15:00:00",1116,1117,1116,1116,null,"2025-10-08T15:00:00",878,879,877,877,null,"2025-10-08T15:00:00",3663,3667,3647,3657,null,"2025-10-08T15:00:00",345,345,344,344]
["2025-10-08T15:15:00",745,747,745,746,null,"2025-10-08T15:15:00",4765,4790,4750,4785,null,"2025-10-08T15:15:00",1959,1962,1958,1960,null,"2025-10-08T15:15:00",1301,1304,1298,1302,null,"2025-10-08T15:15:00",null,null,null,null,null,"2025-10-08T15:00:00",3330,3330,3325,3325,null,"2025-10-08T15:15:00",3255,3265,3255,3260,null,"2025-10-08T15:15:00",782,782,781,782,null,"2025-10-08T15:15:00",4190,4195,4190,4190,null,"2025-10-08T15:15:00",442,442,442,442,null,"2025-10-08T15:15:00",1155,1159,1155,1159,null,"2025-10-08T15:15:00",1344,1349,1342,1349,null,"2025-10-08T15:15:00",2910.5,2918,2907.5,2918,null,"2025-10-08T11:30:00",null,null,null,null,null,"2025-10-08T15:15:00",3980,3980,3975,3980,null,"2025-10-08T15:15:00",892,893,892,893,null,"2025-10-08T15:15:00",14870,14900,14860,14880,null,"2025-10-08T15:15:00",1543,1544,1541,1544,null,"2025-10-08T15:15:00",18,19,18,19,null,"2025-10-08T15:15:00",980,984,980,984,null,"2025-10-08T15:15:00",1917,1924,1916,1923,null,"2025-10-08T15:15:00",4030,4035,4025,4035,null,"2025-10-08T15:15:00",1055,1057,1052,1052,null,"2025-10-08T15:15:00",523,523,523,523,null,"2025-10-08T15:15:00",1789,1796,1785,1794,null,"2025-10-08T15:00:00",1945,1945,1944,1945,null,"2025-10-08T15:15:00",900,904,900,902,null,"2025-10-08T15:15:00",1511,1512,1506,1509,null,"2025-10-08T15:15:00",843,844,841,844,null,"2025-10-08T15:15:00",1254,1255,1253,1255,null,"2025-10-08T15:15:00",2707.5,2717.5,2707,2714.5,null,"2025-10-08T15:15:00",1058,1058,1056,1058,null,"2025-10-08T15:15:00",3022,3023,3020,3021,null,"2025-10-08T15:15:00",144,145,144,145,null,"2025-10-08T15:15:00",5740,5760,5740,5750,null,"2025-10-08T15:15:00",1689,1689,1689,1689,null,"2025-10-08T15:15:00",534,536,534,536,null,"2025-10-08T15:15:00",747,747,746,747,null,"2025-10-08T15:15:00",2735,2736,2727,2729,null,"2025-10-08T15:15:00",217,218,217,217,null,"2025-10-08T15:15:00",3055,3065,3055,3060,null,"2025-10-08T15:15:00",2375,2376,2372,2375,null,"2025-10-08T15:15:00",3630,3635,3625,3635,null,"2025-10-08T15:15:00",2528,2529,2528,2529,null,"2025-10-08T15:00:00",7050,7050,7040,7050,null,"2025-10-08T15:15:00",3710,3710,3710,3710,null,"2025-10-08T15:15:00",1116,1117,1116,1116,null,"2025-10-08T15:15:00",877,877,875,877,null,"2025-10-08T15:15:00",3656,3700,3655,3699,null,"2025-10-08T15:15:00",345,345,344,345]
["2025-10-08T15:30:00",746,746,746,746,null,"2025-10-08T15:30:00",4790,4790,4790,4790,null,"2025-10-08T15:30:00",1956,1956,1956,1956,null,"2025-10-08T15:30:00",1307.5,1307.5,1307.5,1307.5,null,"2025-10-08T15:30:00",3460,3460,3460,3460,null,"2025-10-08T15:15:00",3325,3325,3325,3325,null,"2025-10-08T15:30:00",3255,3255,3255,3255,null,"2025-10-08T15:30:00",781,781,781,781,null,"2025-10-08T15:30:00",4185,4185,4185,4185,null,"2025-10-08T15:30:00",442,442,442,442,null,"2025-10-08T15:30:00",1158,1158,1158,1158,null,"2025-10-08T15:30:00",1348,1348,1348,1348,null,"2025-10-08T15:30:00",2906,2906,2906,2906,null,"2025-10-08T12:30:00",null,null,null,null,null,"2025-10-08T15:30:00",3990,3990,3990,3990,null,"2025-10-08T15:30:00",892,892,892,892,null,"2025-10-08T15:30:00",14910,14910,14910,14910,null,"2025-10-08T15:30:00",1545,1545,1545,1545,null,"2025-10-08T15:30:00",19,19,19,19,null,"2025-10-08T15:30:00",987,987,987,987,null,"2025-10-08T15:30:00",1923,1923,1923,1923,null,"2025-10-08T15:30:00",4040,4040,4040,4040,null,"2025-10-08T15:30:00",1050,1050,1050,1050,null,"2025-10-08T15:30:00",523,523,523,523,null,"2025-10-08T15:30:00",1791,1791,1791,1791,null,"2025-10-08T15:15:00",1944,1946,1944,1945,null,"2025-10-08T15:30:00",900,900,900,900,null,"2025-10-08T15:30:00",1506,1506,1506,1506,null,"2025-10-08T15:30:00",840,840,840,840,null,"2025-10-08T15:30:00",1252,1252,1252,1252,null,"2025-10-08T15:30:00",2699.5,2699.5,2699.5,2699.5,null,"2025-10-08T15:30:00",1056,1056,1056,1056,null,"2025-10-08T15:30:00",3016,3016,3016,3016,null,"2025-10-08T15:30:00",144,144,144,144,null,"2025-10-08T15:30:00",5770,5770,5770,5770,null,"2025-10-08T15:30:00",1689,1689,1689,1689,null,"2025-10-08T15:30:00",534,534,534,534,null,"2025-10-08T15:30:00",745,745,745,745,null,"2025-10-08T15:30:00",2729,2729,2729,2729,null,"2025-10-08T15:30:00",217,217,217,217,null,"2025-10-08T15:30:00",3050,3050,3050,3050,null,"2025-10-08T15:30:00",2372,2372,2372,2372,null,"2025-10-08T15:30:00",3650,3650,3650,3650,null,"2025-10-08T15:30:00",2528,2528,2528,2528,null,"2025-10-08T15:15:00",7040,7050,7030,7030,null,"2025-10-08T15:30:00",3720,3720,3720,3720,null,"2025-10-08T15:30:00",1116,1116,1116,1116,null,"2025-10-08T15:30:00",875,875,875,875,null,"2025-10-08T15:30:00",3680,3680,3680,3680,null,"2025-10-08T15:30:00",345,345,345,345]
{"$rows_left_out":20}