{"text_format":"1","workbook":"xlsx","n_sheets":9,"sheets":["Hidden","説明","ETFリスト","逆指値注文一覧","トレール","注文照会","呼値の単位","TOPIX500","注文管理ID"],"not_rendered":{"charts":0,"images":13,"macros":1,"external_links":0,"defined_names":3,"comments":0,"pivot_tables":0},"unopened":[],"bounds":{"document_bytes":16777216,"sheet_cells":100000,"rows_first":2000,"rows_last":500,"rows_between":2000,"halvings":0,"cell_chars":16384,"cell_head_chars":4096},"cells_cut":0,"cells_raw":0,"read":"whole","date_system":"1900"}

{"sheet":"Hidden","index":0,"n_rows":0,"n_cols":0,"rows_kept":0,"cut":false,"hidden":true,"merged":[]}

{"sheet":"説明","index":1,"n_rows":250,"n_cols":5,"rows_kept":250,"cut":false,"hidden":false,"merged":[[1,1,3,19]]}
[]
[null,"サンプルシートの説明"]
[]
[]
[null,"Ver1.0.0 2026年5月1日時点"]
[]
[null,"■特徴"]
[null,"信用取引の返済逆指値S注文において、株価が自分にとって有利な方向に動いた場合、高値または安値を更新する毎に逆指値条件を自動訂正するトレール設定を行うことができます。"]
[null,"本サンプルシートでは最大5つまで同時にトレール設定が可能です。"]
[]
[]
[]
[]
[]
[]
[]
[]
[]
[]
[]
[]
[]
[]
[]
[null,"■手順"]
[null,"1.「ETFリスト」シートの更新を行う。Ver1.0.0は2026年5月1日にJPXより取得したデータです。"]
[null,"※「ETFリスト」シートはETF銘柄の呼値の算出に使用しているシートです。"]
[null,"※ETF銘柄の返済逆指値S注文においてトレール設定をご利用される方のみ実施が必要な手順です。該当しない方は、手順2へお進みください。"]
[null,"※「ETFリスト」シートの内容が最新の状態でない場合、一部のETF銘柄で正しい呼値のトレールが行われない可能性があります。"]
[null,"　また、呼値が正しくないことにより、訂正注文時にエラーが発生するおそれがありますのでご注意ください。"]
[]
[null,"①JPXのETF気配提示・取引状況のファイルが格納されているサイトにアクセスします。"]
[null,"※ファイル格納先の変更等により、最新ファイルが取得できない場合は、一部のETF銘柄で正しい呼値のトレールが行われなかったり、訂正注文時にエラーが発生するおそれがありますのでご注意ください。"]
[null,"※ファイル格納先が変更になった場合は、上記リンク先を変更した最新バージョンをDLサイトで公開いたします。"]
[null,"②最新のファイルを取得します。"]
[null,"※取得されるファイルは時間帯により前営業日または前々営業の情報が反映されたファイルです。"]
[null,"　そのため、新規上場した銘柄が反映されていない場合、該当銘柄で正しい呼値でのトレールが行われない可能性や訂正注文時にエラーが発生するおそれがありますのでご注意ください。"]
[]
[]
[]
[]
[]
[]
[]
[]
[]
[]
[]
[]
[]
[]
[]
[]
[null,"③ダウンロードしたファイルを開き、B列を全選択し、コピーします。"]
[]
[]
[]
[]
[]
[]
[]
[]
[]
[]
[]
[]
[]
[]
[null,"④「ETFリスト」シートのセルE1から値で貼り付けます。"]
[null,"※JPXが公開するファイル形式が変更され、当サンプルシートの「ETFリスト」シートの仕様が変更になった場合、最新バージョンをDLサイトで公開いたします。"]
[null,"※最新バージョンをご利用されていない場合や最新バージョン公開後から次回更新の間にJPXが公開するファイル形式が変更された場合、一部の銘柄で正しい呼値のトレールが行われない可能性があります。"]
[null,"　また、呼値が正しくないことにより、訂正注文時にエラーが発生するおそれがありますのでご注意ください。"]
[null,"※「ETFリスト」に正しく貼付けができていない場合、ETF銘柄で正しい呼値のトレールが行われない可能性や訂正注文時にエラーが発生するおそれがありますのでご注意ください。"]
[]
[]
[]
[]
[]
[]
[]
[]
[]
[]
[]
[]
[]
[]
[]
[null,"⑤「ETFリスト」シートの「ETFコード取得ボタン」をクリックします。"]
[]
[]
[]
[]
[]
[]
[]
[]
[null,"2.「逆指値注文一覧」シートでトレール設定を行いたい返済逆指値S注文の登録をする。"]
[null,"※トレールが設定できる対象は、注文区分が逆指値Sの返済注文です。"]
[null,"　そのため、ご利用の際は、事前に返済逆指値S注文を発注しておく必要があります。"]
[]
[]
[]
[]
[]
[]
[]
[]
[]
[]
[]
[]
[]
[]
[]
[]
[]
[]
[null,"①対象注文抽出ボタンをクリックします。"]
[null,"トレール設定の対象となる返済逆指値S注文が抽出されます。"]
[]
[null,"②銘柄コードで絞り込みたい場合は「銘柄抽出」欄に銘柄コードを入力し、「対象注文抽出」ボタンをクリックします。"]
[]
[null,"③対象選定欄に1～5の数値を入力します。(5つまで選択可能)"]
[null,"この操作で、トレール設定を行う返済逆指値S注文を選定します。"]
[null,"入力した数値をすべて削除したい場合は、「数値クリア」ボタンをクリックします。"]
[]
[null,"④「リストアップ」ボタンをクリックします。"]
[null,"選定した返済逆指値S注文がトレール設定の対象として登録されます。"]
[null,"※登録した返済逆指値S注文を変更・削除する場合は、対象選定欄の数値を削除または変更し、再度「リストアップ」ボタンをクリックしてください。"]
[]
[null,"⑤登録した返済逆指値S注文をすべて解除したい場合は、「リストクリア」ボタンをクリックします。"]
[]
[]
[]
[]
[null,"3.「トレール」シートでトレール設定および実行"]
[]
[]
[]
[]
[]
[]
[]
[]
[]
[]
[]
[]
[]
[]
[]
[]
[]
[]
[]
[]
[]
[]
[]
[]
[]
[]
[]
[]
[]
[]
[]
[]
[]
[]
[]
[]
[]
[]
[]
[]
[null,"①「発注不可」となっている場合はクリックし、「発注可」の状態にします。"]
[]
[]
[]
[null,null,null,"→"]
[]
[]
[]
[]
[null,"②設定をクリックし、取引パスワードを入力します。"]
[]
[]
[]
[]
[]
[]
[]
[]
[]
[]
[]
[]
[]
[]
[]
[]
[]
[]
[]
[]
[]
[]
[]
[]
[null,"③高値・安値を監視する間隔を設定します。"]
[null,"　また、設定した監視時間と実際の監視時間との乖離時間が表示されますので、正常に動作しているかを確認する際の目安としてご利用ください。"]
[null,"※本サンプルシートでは、トレール開始後、株価の高値や安値が更新されると、それにあわせて逆指値条件が自動訂正される仕組みになっています。"]
[null,"※動作の負荷を考慮し、監視間隔は2秒未満に設定することはできません。(2秒/3秒/5秒から選択可能)"]
[null,"※高値または安値の更新が監視間隔中に発生した場合、逆指値条件の自動訂正は即時には行われず、次回の監視タイミングにおける高値・安値に基づいて自動訂正されます。"]
[]
[null,"④トレール幅設定を行います(トレール開始後に更新された当日の高値・安値-逆指値条件の価格差)"]
[]
[null,"例：1株100円の買いポジションに対し、逆指値条件90円の返済注文を設定している。現値100円(呼値1円)、逆指値90円、当日の高値100円、トレール幅設定に10と入力した場合"]
[null,"トレール開始後、当日の高値100円を超え、101円になった場合に逆指値条件が訂正されます。"]
[null,"101-10(呼値1円×10Ticks)=91　よって、逆指値条件が91円に訂正される。"]
[]
[null,"⑤「トレールGo」ボタンをクリックします(トレール注文が開始されます)。"]
[null,"※トレールは取引時間内のみ実行可能です。取引時間外に「トレールGo」ボタンをクリックしてもトレールは実行されません。"]
[null,"※「逆指値注文一覧」シートで対象注文を変更した場合は、「トレール停止」→「トレールクリア」→「トレールGo」の順にボタンをクリックして再実行してください。"]
[]
[null,"⑥動作環境や負荷状況により、注文管理IDが付与されなかった場合または既に使用済となっている場合は、「注文管理IDクリア」→「注文管理ID付与」の順にボタンをクリックしてください。"]
[null,"※注文管理IDは自動でランダムに付与されますが、動作環境や負荷状況によって正しく付与されない場合に備えた機能です。"]
[]
[null,"⑦逆指値条件はトレール情報に記載されます。"]
[]
[]
[null,"■各ワークシートの説明"]
[null,"※以下のシートは変更されないようご注意ください。"]
[null,"※以下に記載している各シートの説明と注意事項をご確認の上、本サンプルシートをご利用ください。"]
[]
[]
[null,"・「注文照会」シート・・・注文状況を収集しているシートです。"]
[]
[null,"・「呼値の単位」シート・・・呼値を設定するために使用しているシートです。"]
[]
[null,"・「TOPIX500」シート・・・TOPIX500銘柄かその他の銘柄かどうかを判断し、呼値を算出するために使用しているシートです。Ver1.0.0は2026年5月1日時点のデータです。"]
[null,"　※構成銘柄に変更があった場合は当サンプルシートを更新し、最新バージョンをDLサイトで公開します。"]
[null,"　※最新バージョンをご利用されていない場合や最新バージョン公開後から次回更新の間に構成銘柄の更新があった場合は、一部の銘柄で正しい呼値のトレールが行われない可能性があります。"]
[null,"　　また、呼値が正しくないことにより、訂正注文時にエラーが発生するおそれがありますのでご注意ください。"]
[]
[null,"・「注文管理ID」シート・・・注文管理ID附番時に使用するシートです。"]
[null,null,null,null,"・フラグクリアボタンをクリックすると使用済フラグ「１」が全て削除されます。"]
[null,null,null,null,"・注文管理IDはExcel全体を終了し、再起動することで再利用可能になります。再利用可能な状態になってから、使用済フラグクリアボタンをクリックしてください。"]

{"sheet":"ETFリスト","index":2,"n_rows":426,"n_cols":5,"rows_kept":426,"cut":false,"hidden":false,"merged":[]}
[]
[null,null,null,null,"ETFの気配提示状況"]
[]
[null,null,null,null,"取引日"]
[]
["TEXT化"]
["銘柄コード",null,null,null,"コード"]
["1305","ETF",null,null,"1305"]
["1306","ETF",null,null,"1306"]
["1308","ETF",null,null,"1308"]
["1309","ETF",null,null,"1309"]
["1311","ETF",null,null,"1311"]
["1319","ETF",null,null,"1319"]
["1320","ETF",null,null,"1320"]
["1321","ETF",null,null,"1321"]
["1322","ETF",null,null,"1322"]
["1325","ETF",null,null,"1325"]
["1326","ETF",null,null,"1326"]
["1328","ETF",null,null,"1328"]
["1329","ETF",null,null,"1329"]
["1330","ETF",null,null,"1330"]
["133A","ETF",null,null,"133A"]
["1343","ETF",null,null,"1343"]
["1345","ETF",null,null,"1345"]
["1346","ETF",null,null,"1346"]
["1348","ETF",null,null,"1348"]
["1349","ETF",null,null,"1349"]
["1356","ETF",null,null,"1356"]
["1357","ETF",null,null,"1357"]
["1358","ETF",null,null,"1358"]
["1360","ETF",null,null,"1360"]
["1364","ETF",null,null,"1364"]
["1365","ETF",null,null,"1365"]
["1366","ETF",null,null,"1366"]
["1367","ETF",null,null,"1367"]
["1368","ETF",null,null,"1368"]
["1369","ETF",null,null,"1369"]
["1397","ETF",null,null,"1397"]
["1398","ETF",null,null,"1398"]
["1399","ETF",null,null,"1399"]
["140A","ETF",null,null,"140A"]
["1456","ETF",null,null,"1456"]
["1457","ETF",null,null,"1457"]
["1458","ETF",null,null,"1458"]
["1459","ETF",null,null,"1459"]
["1466","ETF",null,null,"1466"]
["1469","ETF",null,null,"1469"]
["1472","ETF",null,null,"1472"]
["1473","ETF",null,null,"1473"]
["1474","ETF",null,null,"1474"]
["1475","ETF",null,null,"1475"]
["1476","ETF",null,null,"1476"]
["1477","ETF",null,null,"1477"]
["1478","ETF",null,null,"1478"]
["1479","ETF",null,null,"1479"]
["1480","ETF",null,null,"1480"]
["1481","ETF",null,null,"1481"]
["1482","ETF",null,null,"1482"]
["1483","ETF",null,null,"1483"]
["1484","ETF",null,null,"1484"]
["1485","ETF",null,null,"1485"]
["1486","ETF",null,null,"1486"]
["1487","ETF",null,null,"1487"]
["1488","ETF",null,null,"1488"]
["1489","ETF",null,null,"1489"]
["1490","ETF",null,null,"1490"]
["1493","ETF",null,null,"1493"]
["1494","ETF",null,null,"1494"]
["1495","ETF",null,null,"1495"]
["1496","ETF",null,null,"1496"]
["1497","ETF",null,null,"1497"]
["1498","ETF",null,null,"1498"]
["1499","ETF",null,null,"1499"]
["1540","ETF",null,null,"1540"]
["1541","ETF",null,null,"1541"]
["1542","ETF",null,null,"1542"]
["1543","ETF",null,null,"1543"]
["1545","ETF",null,null,"1545"]
["1546","ETF",null,null,"1546"]
["1547","ETF",null,null,"1547"]
["1550","ETF",null,null,"1550"]
["1551","ETF",null,null,"1551"]
["1554","ETF",null,null,"1554"]
["1555","ETF",null,null,"1555"]
["1557","ETF",null,null,"1557"]
["1559","ETF",null,null,"1559"]
["1560","ETF",null,null,"1560"]
["1563","ETF",null,null,"1563"]
["1566","ETF",null,null,"1566"]
["1568","ETF",null,null,"1568"]
["1569","ETF",null,null,"1569"]
["1570","ETF",null,null,"1570"]
["1571","ETF",null,null,"1571"]
["1572","ETF",null,null,"1572"]
["1573","ETF",null,null,"1573"]
["1577","ETF",null,null,"1577"]
["1578","ETF",null,null,"1578"]
["1579","ETF",null,null,"1579"]
["1580","ETF",null,null,"1580"]
["1585","ETF",null,null,"1585"]
["1586","ETF",null,null,"1586"]
["1591","ETF",null,null,"1591"]
["1592","ETF",null,null,"1592"]
["1593","ETF",null,null,"1593"]
["1595","ETF",null,null,"1595"]
["1596","ETF",null,null,"1596"]
["1597","ETF",null,null,"1597"]
["1599","ETF",null,null,"1599"]
["159A","ETF",null,null,"159A"]
["1615","ETF",null,null,"1615"]
["1617","ETF",null,null,"1617"]
["1618","ETF",null,null,"1618"]
["1619","ETF",null,null,"1619"]
["1620","ETF",null,null,"1620"]
["1621","ETF",null,null,"1621"]
["1622","ETF",null,null,"1622"]
["1623","ETF",null,null,"1623"]
["1624","ETF",null,null,"1624"]
["1625","ETF",null,null,"1625"]
["1626","ETF",null,null,"1626"]
["1627","ETF",null,null,"1627"]
["1628","ETF",null,null,"1628"]
["1629","ETF",null,null,"1629"]
["1630","ETF",null,null,"1630"]
["1631","ETF",null,null,"1631"]
["1632","ETF",null,null,"1632"]
["1633","ETF",null,null,"1633"]
["1651","ETF",null,null,"1651"]
["1652","ETF",null,null,"1652"]
["1653","ETF",null,null,"1653"]
["1654","ETF",null,null,"1654"]
["1655","ETF",null,null,"1655"]
["1656","ETF",null,null,"1656"]
["1657","ETF",null,null,"1657"]
["1658","ETF",null,null,"1658"]
["1659","ETF",null,null,"1659"]
["1660","ETF",null,null,"1660"]
["1671","ETF",null,null,"1671"]
["1672","ETF",null,null,"1672"]
["1673","ETF",null,null,"1673"]
["1674","ETF",null,null,"1674"]
["1675","ETF",null,null,"1675"]
["1676","ETF",null,null,"1676"]
["1677","ETF",null,null,"1677"]
["1678","ETF",null,null,"1678"]
["1679","ETF",null,null,"1679"]
["1680","ETF",null,null,"1680"]
["1681","ETF",null,null,"1681"]
["1684","ETF",null,null,"1684"]
["1685","ETF",null,null,"1685"]
["1686","ETF",null,null,"1686"]
["1687","ETF",null,null,"1687"]
["1688","ETF",null,null,"1688"]
["1689","ETF",null,null,"1689"]
["1690","ETF",null,null,"1690"]
["1691","ETF",null,null,"1691"]
["1692","ETF",null,null,"1692"]
["1693","ETF",null,null,"1693"]
["1694","ETF",null,null,"1694"]
["1695","ETF",null,null,"1695"]
["1696","ETF",null,null,"1696"]
["1697","ETF",null,null,"1697"]
["1698","ETF",null,null,"1698"]
["1699","ETF",null,null,"1699"]
["170A","ETF",null,null,"170A"]
["178A","ETF",null,null,"178A"]
["179A","ETF",null,null,"179A"]
["180A","ETF",null,null,"180A"]
["181A","ETF",null,null,"181A"]
["182A","ETF",null,null,"182A"]
["183A","ETF",null,null,"183A"]
["188A","ETF",null,null,"188A"]
["200A","ETF",null,null,"200A"]
["2011","ETF",null,null,"2011"]
["2012","ETF",null,null,"2012"]
["2013","ETF",null,null,"2013"]
["2014","ETF",null,null,"2014"]
["2015","ETF",null,null,"2015"]
["2016","ETF",null,null,"2016"]
["2017","ETF",null,null,"2017"]
["2018","ETF",null,null,"2018"]
["2019","ETF",null,null,"2019"]
["201A","ETF",null,null,"201A"]
["2080","ETF",null,null,"2080"]
["2081","ETF",null,null,"2081"]
["2082","ETF",null,null,"2082"]
["2083","ETF",null,null,"2083"]
["2084","ETF",null,null,"2084"]
["2085","ETF",null,null,"2085"]
["2086","ETF",null,null,"2086"]
["2087","ETF",null,null,"2087"]
["2088","ETF",null,null,"2088"]
["2089","ETF",null,null,"2089"]
["2090","ETF",null,null,"2090"]
["2091","ETF",null,null,"2091"]
["2092","ETF",null,null,"2092"]
["2093","ETF",null,null,"2093"]
["2094","ETF",null,null,"2094"]
["2095","ETF",null,null,"2095"]
["2096","ETF",null,null,"2096"]
["2097","ETF",null,null,"2097"]
["2098","ETF",null,null,"2098"]
["210A","ETF",null,null,"210A"]
["213A","ETF",null,null,"213A"]
["221A","ETF",null,null,"221A"]
["2235","ETF",null,null,"2235"]
["2236","ETF",null,null,"2236"]
["2237","ETF",null,null,"2237"]
["2238","ETF",null,null,"2238"]
["2239","ETF",null,null,"2239"]
["223A","ETF",null,null,"223A"]
["2240","ETF",null,null,"2240"]
["2241","ETF",null,null,"2241"]
["2242","ETF",null,null,"2242"]
["2243","ETF",null,null,"2243"]
["2244","ETF",null,null,"2244"]
["2245","ETF",null,null,"2245"]
["2246","ETF",null,null,"2246"]
["2247","ETF",null,null,"2247"]
["2248","ETF",null,null,"2248"]
["2249","ETF",null,null,"2249"]
["224A","ETF",null,null,"224A"]
["2250","ETF",null,null,"2250"]
["2251","ETF",null,null,"2251"]
["2252","ETF",null,null,"2252"]
["2253","ETF",null,null,"2253"]
["2254","ETF",null,null,"2254"]
["2255","ETF",null,null,"2255"]
["2256","ETF",null,null,"2256"]
["2257","ETF",null,null,"2257"]
["2258","ETF",null,null,"2258"]
["2259","ETF",null,null,"2259"]
["233A","ETF",null,null,"233A"]
["234A","ETF",null,null,"234A"]
["235A","ETF",null,null,"235A"]
["236A","ETF",null,null,"236A"]
["237A","ETF",null,null,"237A"]
["238A","ETF",null,null,"238A"]
["2510","ETF",null,null,"2510"]
["2511","ETF",null,null,"2511"]
["2512","ETF",null,null,"2512"]
["2513","ETF",null,null,"2513"]
["2514","ETF",null,null,"2514"]
["2515","ETF",null,null,"2515"]
["2516","ETF",null,null,"2516"]
["2517","ETF",null,null,"2517"]
["2518","ETF",null,null,"2518"]
["2519","ETF",null,null,"2519"]
["2520","ETF",null,null,"2520"]
["2521","ETF",null,null,"2521"]
["2522","ETF",null,null,"2522"]
["2523","ETF",null,null,"2523"]
["2524","ETF",null,null,"2524"]
["2525","ETF",null,null,"2525"]
["2526","ETF",null,null,"2526"]
["2527","ETF",null,null,"2527"]
["2528","ETF",null,null,"2528"]
["2529","ETF",null,null,"2529"]
["2530","ETF",null,null,"2530"]
["2552","ETF",null,null,"2552"]
["2553","ETF",null,null,"2553"]
["2554","ETF",null,null,"2554"]
["2555","ETF",null,null,"2555"]
["2556","ETF",null,null,"2556"]
["2557","ETF",null,null,"2557"]
["2558","ETF",null,null,"2558"]
["2559","ETF",null,null,"2559"]
["2560","ETF",null,null,"2560"]
["2561","ETF",null,null,"2561"]
["2562","ETF",null,null,"2562"]
["2563","ETF",null,null,"2563"]
["2564","ETF",null,null,"2564"]
["2565","ETF",null,null,"2565"]
["2566","ETF",null,null,"2566"]
["2567","ETF",null,null,"2567"]
["2568","ETF",null,null,"2568"]
["2569","ETF",null,null,"2569"]
["257A","ETF",null,null,"257A"]
["258A","ETF",null,null,"258A"]
["2620","ETF",null,null,"2620"]
["2621","ETF",null,null,"2621"]
["2622","ETF",null,null,"2622"]
["2623","ETF",null,null,"2623"]
["2624","ETF",null,null,"2624"]
["2625","ETF",null,null,"2625"]
["2626","ETF",null,null,"2626"]
["2627","ETF",null,null,"2627"]
["2628","ETF",null,null,"2628"]
["2629","ETF",null,null,"2629"]
["2630","ETF",null,null,"2630"]
["2631","ETF",null,null,"2631"]
["2632","ETF",null,null,"2632"]
["2633","ETF",null,null,"2633"]
["2634","ETF",null,null,"2634"]
["2636","ETF",null,null,"2636"]
["2637","ETF",null,null,"2637"]
["2638","ETF",null,null,"2638"]
["2639","ETF",null,null,"2639"]
["2640","ETF",null,null,"2640"]
["2641","ETF",null,null,"2641"]
["2642","ETF",null,null,"2642"]
["2643","ETF",null,null,"2643"]
["2644","ETF",null,null,"2644"]
["2645","ETF",null,null,"2645"]
["2646","ETF",null,null,"2646"]
["2647","ETF",null,null,"2647"]
["2648","ETF",null,null,"2648"]
["2649","ETF",null,null,"2649"]
["273A","ETF",null,null,"273A"]
["282A","ETF",null,null,"282A"]
["2836","ETF",null,null,"2836"]
["2837","ETF",null,null,"2837"]
["2838","ETF",null,null,"2838"]
["2839","ETF",null,null,"2839"]
["283A","ETF",null,null,"283A"]
["2840","ETF",null,null,"2840"]
["2841","ETF",null,null,"2841"]
["2842","ETF",null,null,"2842"]
["2843","ETF",null,null,"2843"]
["2844","ETF",null,null,"2844"]
["2845","ETF",null,null,"2845"]
["2846","ETF",null,null,"2846"]
["2847","ETF",null,null,"2847"]
["2848","ETF",null,null,"2848"]
["2849","ETF",null,null,"2849"]
["2851","ETF",null,null,"2851"]
["2852","ETF",null,null,"2852"]
["2853","ETF",null,null,"2853"]
["2854","ETF",null,null,"2854"]
["2855","ETF",null,null,"2855"]
["2856","ETF",null,null,"2856"]
["2857","ETF",null,null,"2857"]
["2858","ETF",null,null,"2858"]
["2859","ETF",null,null,"2859"]
["2860","ETF",null,null,"2860"]
["2861","ETF",null,null,"2861"]
["2862","ETF",null,null,"2862"]
["2864","ETF",null,null,"2864"]
["2865","ETF",null,null,"2865"]
["2866","ETF",null,null,"2866"]
["2867","ETF",null,null,"2867"]
["2868","ETF",null,null,"2868"]
["2869","ETF",null,null,"2869"]
["2870","ETF",null,null,"2870"]
["294A","ETF",null,null,"294A"]
["295A","ETF",null,null,"295A"]
["313A","ETF",null,null,"313A"]
["314A","ETF",null,null,"314A"]
["315A","ETF",null,null,"315A"]
["316A","ETF",null,null,"316A"]
["318A","ETF",null,null,"318A"]
["328A","ETF",null,null,"328A"]
["346A","ETF",null,null,"346A"]
["348A","ETF",null,null,"348A"]
["349A","ETF",null,null,"349A"]
["354A","ETF",null,null,"354A"]
["356A","ETF",null,null,"356A"]
["360A","ETF",null,null,"360A"]
["363A","ETF",null,null,"363A"]
["364A","ETF",null,null,"364A"]
["376A","ETF",null,null,"376A"]
["379A","ETF",null,null,"379A"]
["380A","ETF",null,null,"380A"]
["381A","ETF",null,null,"381A"]
["382A","ETF",null,null,"382A"]
["383A","ETF",null,null,"383A"]
["392A","ETF",null,null,"392A"]
["394A","ETF",null,null,"394A"]
["395A","ETF",null,null,"395A"]
["396A","ETF",null,null,"396A"]
["399A","ETF",null,null,"399A"]
["404A","ETF",null,null,"404A"]
["408A","ETF",null,null,"408A"]
["412A","ETF",null,null,"412A"]
["413A","ETF",null,null,"413A"]
["424A","ETF",null,null,"424A"]
["425A","ETF",null,null,"425A"]
["426A","ETF",null,null,"426A"]
["435A","ETF",null,null,"435A"]
["443A","ETF",null,null,"443A"]
["447A","ETF",null,null,"447A"]
["448A","ETF",null,null,"448A"]
["449A","ETF",null,null,"449A"]
["450A","ETF",null,null,"450A"]
["451A","ETF",null,null,"451A"]
["452A","ETF",null,null,"452A"]
["453A","ETF",null,null,"453A"]
["459A","ETF",null,null,"459A"]
["461A","ETF",null,null,"461A"]
["465A","ETF",null,null,"465A"]
["466A","ETF",null,null,"466A"]
["467A","ETF",null,null,"467A"]
["468A","ETF",null,null,"468A"]
["473A","ETF",null,null,"473A"]
["486A","ETF",null,null,"486A"]
["487A","ETF",null,null,"487A"]
["488A","ETF",null,null,"488A"]
["489A","ETF",null,null,"489A"]
["491A","ETF",null,null,"491A"]
["492A","ETF",null,null,"492A"]
["493A","ETF",null,null,"493A"]
["494A","ETF",null,null,"494A"]
["495A","ETF",null,null,"495A"]
["496A","ETF",null,null,"496A"]
["502A","ETF",null,null,"502A"]
["512A","ETF",null,null,"512A"]
["513A","ETF",null,null,"513A"]
["515A","ETF",null,null,"515A"]
["516A","ETF",null,null,"516A"]
["517A","ETF",null,null,"517A"]
["518A","ETF",null,null,"518A"]
["521A","ETF",null,null,"521A"]
["526A","ETF",null,null,"526A"]
["530A","ETF",null,null,"530A"]
["531A","ETF",null,null,"531A"]
["532A","ETF",null,null,"532A"]
["533A","ETF",null,null,"533A"]
["534A","ETF",null,null,"534A"]
["535A","ETF",null,null,"535A"]
["536A","ETF",null,null,"536A"]
["537A","ETF",null,null,"537A"]
["538A","ETF",null,null,"538A"]
["539A","ETF",null,null,"539A"]
["540A","ETF",null,null,"540A"]
["541A","ETF",null,null,"541A"]
["552A","ETF",null,null,"552A"]

{"sheet":"逆指値注文一覧","index":3,"n_rows":509,"n_cols":28,"rows_kept":509,"cut":false,"hidden":false,"merged":[]}
[]
[null,null,null,null,null,null,null,null,null,null,null,null,null,null,null,"＜トレール対象注文ピックアップ＞"]
[null,null,null,null,null,null,null,null,null,null,null,null,null,null,null,"＃","注文ID","銘柄コード","銘柄名称","取引\n区分","注文\n区分","注文数量","逆指値\nトリガー状況","逆指値\n条件単価","発動時\n注文区分","逆指値\n注文単価","注文期限","訂正可能\nフラグ"]
[null,null,null,null,null,null,null,null,null,null,null,null,null,null,null,"銘柄 1"]
[null,null,"銘柄抽出",null,null,null,null,null,null,null,null,null,null,null,null,"銘柄 2"]
[null,null,null," 銘柄コードでソートができます。",null,null,null,null,null,null,null,null,null,null,null,"銘柄 3"]
[null,null,null,null,null,null,null,null,null,null,null,null,null,null,null,"銘柄 4"]
[null,null,null,null,null,null,null,null,null,null,null,null,null,null,null,"銘柄 5"]
["#","注文ID","銘柄コード","銘柄名称","取引\n区分","注文\n区分","注文数量","逆指値\nトリガー状況","逆指値\n条件単価","発動時\n注文区分","逆指値\n注文単価","注文期限","訂正可能\nフラグ","対象\n選定"]
[1]
[2]
[3]
[4]
[5]
[6]
[7]
[8]
[9]
[10]
[11]
[12]
[13]
[14]
[15]
[16]
[17]
[18]
[19]
[20]
[21]
[22]
[23]
[24]
[25]
[26]
[27]
[28]
[29]
[30]
[31]
[32]
[33]
[34]
[35]
[36]
[37]
[38]
[39]
[40]
[41]
[42]
[43]
[44]
[45]
[46]
[47]
[48]
[49]
[50]
[51]
[52]
[53]
[54]
[55]
[56]
[57]
[58]
[59]
[60]
[61]
[62]
[63]
[64]
[65]
[66]
[67]
[68]
[69]
[70]
[71]
[72]
[73]
[74]
[75]
[76]
[77]
[78]
[79]
[80]
[81]
[82]
[83]
[84]
[85]
[86]
[87]
[88]
[89]
[90]
[91]
[92]
[93]
[94]
[95]
[96]
[97]
[98]
[99]
[100]
[101]
[102]
[103]
[104]
[105]
[106]
[107]
[108]
[109]
[110]
[111]
[112]
[113]
[114]
[115]
[116]
[117]
[118]
[119]
[120]
[121]
[122]
[123]
[124]
[125]
[126]
[127]
[128]
[129]
[130]
[131]
[132]
[133]
[134]
[135]
[136]
[137]
[138]
[139]
[140]
[141]
[142]
[143]
[144]
[145]
[146]
[147]
[148]
[149]
[150]
[151]
[152]
[153]
[154]
[155]
[156]
[157]
[158]
[159]
[160]
[161]
[162]
[163]
[164]
[165]
[166]
[167]
[168]
[169]
[170]
[171]
[172]
[173]
[174]
[175]
[176]
[177]
[178]
[179]
[180]
[181]
[182]
[183]
[184]
[185]
[186]
[187]
[188]
[189]
[190]
[191]
[192]
[193]
[194]
[195]
[196]
[197]
[198]
[199]
[200]
[201]
[202]
[203]
[204]
[205]
[206]
[207]
[208]
[209]
[210]
[211]
[212]
[213]
[214]
[215]
[216]
[217]
[218]
[219]
[220]
[221]
[222]
[223]
[224]
[225]
[226]
[227]
[228]
[229]
[230]
[231]
[232]
[233]
[234]
[235]
[236]
[237]
[238]
[239]
[240]
[241]
[242]
[243]
[244]
[245]
[246]
[247]
[248]
[249]
[250]
[251]
[252]
[253]
[254]
[255]
[256]
[257]
[258]
[259]
[260]
[261]
[262]
[263]
[264]
[265]
[266]
[267]
[268]
[269]
[270]
[271]
[272]
[273]
[274]
[275]
[276]
[277]
[278]
[279]
[280]
[281]
[282]
[283]
[284]
[285]
[286]
[287]
[288]
[289]
[290]
[291]
[292]
[293]
[294]
[295]
[296]
[297]
[298]
[299]
[300]
[301]
[302]
[303]
[304]
[305]
[306]
[307]
[308]
[309]
[310]
[311]
[312]
[313]
[314]
[315]
[316]
[317]
[318]
[319]
[320]
[321]
[322]
[323]
[324]
[325]
[326]
[327]
[328]
[329]
[330]
[331]
[332]
[333]
[334]
[335]
[336]
[337]
[338]
[339]
[340]
[341]
[342]
[343]
[344]
[345]
[346]
[347]
[348]
[349]
[350]
[351]
[352]
[353]
[354]
[355]
[356]
[357]
[358]
[359]
[360]
[361]
[362]
[363]
[364]
[365]
[366]
[367]
[368]
[369]
[370]
[371]
[372]
[373]
[374]
[375]
[376]
[377]
[378]
[379]
[380]
[381]
[382]
[383]
[384]
[385]
[386]
[387]
[388]
[389]
[390]
[391]
[392]
[393]
[394]
[395]
[396]
[397]
[398]
[399]
[400]
[401]
[402]
[403]
[404]
[405]
[406]
[407]
[408]
[409]
[410]
[411]
[412]
[413]
[414]
[415]
[416]
[417]
[418]
[419]
[420]
[421]
[422]
[423]
[424]
[425]
[426]
[427]
[428]
[429]
[430]
[431]
[432]
[433]
[434]
[435]
[436]
[437]
[438]
[439]
[440]
[441]
[442]
[443]
[444]
[445]
[446]
[447]
[448]
[449]
[450]
[451]
[452]
[453]
[454]
[455]
[456]
[457]
[458]
[459]
[460]
[461]
[462]
[463]
[464]
[465]
[466]
[467]
[468]
[469]
[470]
[471]
[472]
[473]
[474]
[475]
[476]
[477]
[478]
[479]
[480]
[481]
[482]
[483]
[484]
[485]
[486]
[487]
[488]
[489]
[490]
[491]
[492]
[493]
[494]
[495]
[496]
[497]
[498]
[499]
[500]

{"sheet":"トレール","index":4,"n_rows":35,"n_cols":22,"rows_kept":35,"cut":false,"hidden":false,"merged":[[8,4,8,5],[8,8,8,9],[8,12,8,13],[8,16,8,17],[8,20,8,21]]}
[{"$f":"NOW()","v":"2026-05-08T13:02:33.020"},null,null,"銘柄 1",null,null,null,"銘柄 2",null,null,null,"銘柄 3",null,null,null,"銘柄 4",null,null,null,"銘柄 5"]
[null,null,null,{"$f":"IF(逆指値注文一覧!$R$4=\"\",\"Wait\",TEXT(逆指値注文一覧!$R$4,0))","v":"Wait"},{"$f":"IF(D2=\"wait\",\"\",_xlfn.SINGLE(_xll.SNT.StockInst(D2,\"銘柄名称\")))","v":""},null,null,{"$f":"IF(逆指値注文一覧!$R$5=\"\",\"Wait\",TEXT(逆指値注文一覧!$R$5,0))","v":"Wait"},{"$f":"IF(H2=\"wait\",\"\",_xlfn.SINGLE(_xll.SNT.StockInst(H2,\"銘柄名称\")))","v":""},null,null,{"$f":"IF(逆指値注文一覧!$R$6=\"\",\"Wait\",TEXT(逆指値注文一覧!$R$6,0))","v":"Wait"},{"$f":"IF(L2=\"wait\",\"\",_xlfn.SINGLE(_xll.SNT.StockInst(L2,\"銘柄名称\")))","v":""},null,null,{"$f":"IF(逆指値注文一覧!$R$7=\"\",\"Wait\",TEXT(逆指値注文一覧!$R$7,0))","v":"Wait"},{"$f":"IF(P2=\"wait\",\"\",_xlfn.SINGLE(_xll.SNT.StockInst(P2,\"銘柄名称\")))","v":""},null,null,{"$f":"IF(逆指値注文一覧!$R$8=\"\",\"Wait\",TEXT(逆指値注文一覧!$R$8,0))","v":"Wait"},{"$f":"IF(T2=\"wait\",\"\",_xlfn.SINGLE(_xll.SNT.StockInst(T2,\"銘柄名称\")))","v":""}]
[null,null,null,{"$f":"IF($D$2=\"wait\",\"\",IFERROR(VLOOKUP($D$2,ETFリスト!$A:$B,2,FALSE),\"\"))","v":""},null,{"$f":"IFERROR(VLOOKUP($D$2,TOPIX500!$G$1:$H$1674,2,FALSE),\"\")","v":""},null,{"$f":"IF($H$2=\"wait\",\"\",IFERROR(VLOOKUP($H$2,ETFリスト!$A:$B,2,FALSE),\"\"))","v":""},null,{"$f":"IFERROR(VLOOKUP($H$2,TOPIX500!$G$1:$H$1674,2,FALSE),\"\")","v":""},null,{"$f":"IF($L$2=\"wait\",\"\",IFERROR(VLOOKUP($L$2,ETFリスト!$A:$B,2,FALSE),\"\"))","v":""},null,{"$f":"IFERROR(VLOOKUP($L$2,TOPIX500!$G$1:$H$1674,2,FALSE),\"\")","v":""},null,{"$f":"IF($P$2=\"wait\",\"\",IFERROR(VLOOKUP($P$2,ETFリスト!$A:$B,2,FALSE),\"\"))","v":""},null,{"$f":"IFERROR(VLOOKUP($P$2,TOPIX500!$G$1:$H$1674,2,FALSE),\"\")","v":""},null,{"$f":"IF($T$2=\"wait\",\"\",IFERROR(VLOOKUP($T$2,ETFリスト!$A:$B,2,FALSE),\"\"))","v":""},null,{"$f":"IFERROR(VLOOKUP($T$2,TOPIX500!$G$1:$H$1674,2,FALSE),\"\")","v":""}]
[null,null,null,"現値",{"$f":"_xll.SNT.StockInst($D$2,\"現値\")","v":"=@SNT.StockInst($D$2,\"現値\") => 接続待ち"},{"$f":"MID(_xll.SNT.StockInst($D$2,\"現値日時\"),12,5)","v":"tockI"},null,"現値",{"$f":"_xll.SNT.StockInst($H$2,\"現値\")","v":"=@SNT.StockInst($H$2,\"現値\") => 接続待ち"},{"$f":"MID(_xll.SNT.StockInst($H$2,\"現値日時\"),12,5)","v":"tockI"},null,"現値",{"$f":"_xll.SNT.StockInst($L$2,\"現値\")","v":"=@SNT.StockInst($L$2,\"現値\") => 接続待ち"},{"$f":"MID(_xll.SNT.StockInst($L$2,\"現値日時\"),12,5)","v":"tockI"},null,"現値",{"$f":"_xll.SNT.StockInst($P$2,\"現値\")","v":"=@SNT.StockInst($P$2,\"現値\") => 接続待ち"},{"$f":"MID(_xll.SNT.StockInst($P$2,\"現値日時\"),12,5)","v":"tockI"},null,"現値",{"$f":"_xll.SNT.StockInst($T$2,\"現値\")","v":"=@SNT.StockInst($T$2,\"現値\") => 接続待ち"},{"$f":"MID(_xll.SNT.StockInst($T$2,\"現値日時\"),12,5)","v":"tockI"}]
[null,null,null,"前日比",{"$f":"IFERROR(IF(_xll.SNT.StockInst($D$2,\"前日終値\")=0,0,E4-_xll.SNT.StockInst($D$2,\"前日終値\")),\"\")","v":""},null,null,"前日比",{"$f":"IFERROR(IF(_xll.SNT.StockInst($H$2,\"前日終値\")=0,0,I4-_xll.SNT.StockInst($H$2,\"前日終値\")),\"\")","v":""},null,null,"前日比",{"$f":"IFERROR(IF(_xll.SNT.StockInst($L$2,\"前日終値\")=0,0,M4-_xll.SNT.StockInst($L$2,\"前日終値\")),\"\")","v":""},null,null,"前日比",{"$f":"IFERROR(IF(_xll.SNT.StockInst($P$2,\"前日終値\")=0,0,Q4-_xll.SNT.StockInst($P$2,\"前日終値\")),\"\")","v":""},null,null,"前日比",{"$f":"IFERROR(IF(_xll.SNT.StockInst($T$2,\"前日終値\")=0,0,U4-_xll.SNT.StockInst($T$2,\"前日終値\")),\"\")","v":""}]
[null,null,null,"始値",{"$f":"_xll.SNT.StockInst($D$2,\"始値\")","v":"=@SNT.StockInst($D$2,\"始値\") => 接続待ち"},{"$f":"MID(_xll.SNT.StockInst($D$2,\"始値時刻\"),12,5)","v":"tockI"},null,"始値",{"$f":"_xll.SNT.StockInst($H$2,\"始値\")","v":"=@SNT.StockInst($H$2,\"始値\") => 接続待ち"},{"$f":"MID(_xll.SNT.StockInst($H$2,\"始値時刻\"),12,5)","v":"tockI"},null,"始値",{"$f":"_xll.SNT.StockInst($L$2,\"始値\")","v":"=@SNT.StockInst($L$2,\"始値\") => 接続待ち"},{"$f":"MID(_xll.SNT.StockInst($L$2,\"始値時刻\"),12,5)","v":"tockI"},null,"始値",{"$f":"_xll.SNT.StockInst($P$2,\"始値\")","v":"=@SNT.StockInst($P$2,\"始値\") => 接続待ち"},{"$f":"MID(_xll.SNT.StockInst($P$2,\"始値時刻\"),12,5)","v":"tockI"},null,"始値",{"$f":"_xll.SNT.StockInst($T$2,\"始値\")","v":"=@SNT.StockInst($T$2,\"始値\") => 接続待ち"},{"$f":"MID(_xll.SNT.StockInst($T$2,\"始値時刻\"),12,5)","v":"tockI"}]
[null,null,null,"高値",{"$f":"_xll.SNT.StockInst($D$2,\"高値\")","v":"=@SNT.StockInst($D$2,\"高値\") => 接続待ち"},{"$f":"MID(_xll.SNT.StockInst($D$2,\"高値時刻\"),12,5)","v":"tockI"},null,"高値",{"$f":"_xll.SNT.StockInst($H$2,\"高値\")","v":"=@SNT.StockInst($H$2,\"高値\") => 接続待ち"},{"$f":"MID(_xll.SNT.StockInst($H$2,\"高値時刻\"),12,5)","v":"tockI"},null,"高値",{"$f":"_xll.SNT.StockInst($L$2,\"高値\")","v":"=@SNT.StockInst($L$2,\"高値\") => 接続待ち"},{"$f":"MID(_xll.SNT.StockInst($L$2,\"高値時刻\"),12,5)","v":"tockI"},null,"高値",{"$f":"_xll.SNT.StockInst($P$2,\"高値\")","v":"=@SNT.StockInst($P$2,\"高値\") => 接続待ち"},{"$f":"MID(_xll.SNT.StockInst($P$2,\"高値時刻\"),12,5)","v":"tockI"},null,"高値",{"$f":"_xll.SNT.StockInst($T$2,\"高値\")","v":"=@SNT.StockInst($T$2,\"高値\") => 接続待ち"},{"$f":"MID(_xll.SNT.StockInst($T$2,\"高値時刻\"),12,5)","v":"tockI"}]
[null,null,null,"安値",{"$f":"_xll.SNT.StockInst($D$2,\"安値\")","v":"=@SNT.StockInst($D$2,\"安値\") => 接続待ち"},{"$f":"MID(_xll.SNT.StockInst($D$2,\"安値時刻\"),12,5)","v":"tockI"},null,"安値",{"$f":"_xll.SNT.StockInst($H$2,\"安値\")","v":"=@SNT.StockInst($H$2,\"安値\") => 接続待ち"},{"$f":"MID(_xll.SNT.StockInst($H$2,\"安値時刻\"),12,5)","v":"tockI"},null,"安値",{"$f":"_xll.SNT.StockInst($L$2,\"安値\")","v":"=@SNT.StockInst($L$2,\"安値\") => 接続待ち"},{"$f":"MID(_xll.SNT.StockInst($L$2,\"安値時刻\"),12,5)","v":"tockI"},null,"安値",{"$f":"_xll.SNT.StockInst($P$2,\"安値\")","v":"=@SNT.StockInst($P$2,\"安値\") => 接続待ち"},{"$f":"MID(_xll.SNT.StockInst($P$2,\"安値時刻\"),12,5)","v":"tockI"},null,"安値",{"$f":"_xll.SNT.StockInst($T$2,\"安値\")","v":"=@SNT.StockInst($T$2,\"安値\") => 接続待ち"},{"$f":"MID(_xll.SNT.StockInst($T$2,\"安値時刻\"),12,5)","v":"tockI"}]
[null,"高安　監視間隔（秒）",null,"売買高",{"$f":"_xll.SNT.StockInst($D$2,\"売買高\")","v":"=@SNT.StockInst($D$2,\"売買高\") => 接続待ち"},null,null,"売買高",{"$f":"_xll.SNT.StockInst($H$2,\"売買高\")","v":"=@SNT.StockInst($H$2,\"売買高\") => 接続待ち"},null,null,"売買高",{"$f":"_xll.SNT.StockInst($L$2,\"売買高\")","v":"=@SNT.StockInst($L$2,\"売買高\") => 接続待ち"},null,null,"売買高",{"$f":"_xll.SNT.StockInst($P$2,\"売買高\")","v":"=@SNT.StockInst($P$2,\"売買高\") => 接続待ち"},null,null,"売買高",{"$f":"_xll.SNT.StockInst($T$2,\"売買高\")","v":"=@SNT.StockInst($T$2,\"売買高\") => 接続待ち"}]
[null,3,null,"売数量","値段","買数量",null,"売数量","値段","買数量",null,"売数量","値段","買数量",null,"売数量","値段","買数量",null,"売数量","値段","買数量"]
[null,null,null,{"$f":"_xll.SNT.StockInst($D$2,\"売気配数量_5本目\")","v":"=@SNT.StockInst($D$2,\"売気配数量_5本目\") => 接続待ち"},{"$f":"_xll.SNT.StockInst($D$2,\"売気配価格_5本目\")","v":"=@SNT.StockInst($D$2,\"売気配価格_5本目\") => 接続待ち"},null,null,{"$f":"_xll.SNT.StockInst($H$2,\"売気配数量_5本目\")","v":"=@SNT.StockInst($H$2,\"売気配数量_5本目\") => 接続待ち"},{"$f":"_xll.SNT.StockInst($H$2,\"売気配価格_5本目\")","v":"=@SNT.StockInst($H$2,\"売気配価格_5本目\") => 接続待ち"},null,null,{"$f":"_xll.SNT.StockInst($L$2,\"売気配数量_5本目\")","v":"=@SNT.StockInst($L$2,\"売気配数量_5本目\") => 接続待ち"},{"$f":"_xll.SNT.StockInst($L$2,\"売気配価格_5本目\")","v":"=@SNT.StockInst($L$2,\"売気配価格_5本目\") => 接続待ち"},null,null,{"$f":"_xll.SNT.StockInst($P$2,\"売気配数量_5本目\")","v":"=@SNT.StockInst($P$2,\"売気配数量_5本目\") => 接続待ち"},{"$f":"_xll.SNT.StockInst($P$2,\"売気配価格_5本目\")","v":"=@SNT.StockInst($P$2,\"売気配価格_5本目\") => 接続待ち"},null,null,{"$f":"_xll.SNT.StockInst($T$2,\"売気配数量_5本目\")","v":"=@SNT.StockInst($T$2,\"売気配数量_5本目\") => 接続待ち"},{"$f":"_xll.SNT.StockInst($T$2,\"売気配価格_5本目\")","v":"=@SNT.StockInst($T$2,\"売気配価格_5本目\") => 接続待ち"}]
[null,"監視時間乖離（秒）",null,{"$f":"_xll.SNT.StockInst($D$2,\"売気配数量_4本目\")","v":"=@SNT.StockInst($D$2,\"売気配数量_4本目\") => 接続待ち"},{"$f":"_xll.SNT.StockInst($D$2,\"売気配価格_4本目\")","v":"=@SNT.StockInst($D$2,\"売気配価格_4本目\") => 接続待ち"},null,null,{"$f":"_xll.SNT.StockInst($H$2,\"売気配数量_4本目\")","v":"=@SNT.StockInst($H$2,\"売気配数量_4本目\") => 接続待ち"},{"$f":"_xll.SNT.StockInst($H$2,\"売気配価格_4本目\")","v":"=@SNT.StockInst($H$2,\"売気配価格_4本目\") => 接続待ち"},null,null,{"$f":"_xll.SNT.StockInst($L$2,\"売気配数量_4本目\")","v":"=@SNT.StockInst($L$2,\"売気配数量_4本目\") => 接続待ち"},{"$f":"_xll.SNT.StockInst($L$2,\"売気配価格_4本目\")","v":"=@SNT.StockInst($L$2,\"売気配価格_4本目\") => 接続待ち"},null,null,{"$f":"_xll.SNT.StockInst($P$2,\"売気配数量_4本目\")","v":"=@SNT.StockInst($P$2,\"売気配数量_4本目\") => 接続待ち"},{"$f":"_xll.SNT.StockInst($P$2,\"売気配価格_4本目\")","v":"=@SNT.StockInst($P$2,\"売気配価格_4本目\") => 接続待ち"},null,null,{"$f":"_xll.SNT.StockInst($T$2,\"売気配数量_4本目\")","v":"=@SNT.StockInst($T$2,\"売気配数量_4本目\") => 接続待ち"},{"$f":"_xll.SNT.StockInst($T$2,\"売気配価格_4本目\")","v":"=@SNT.StockInst($T$2,\"売気配価格_4本目\") => 接続待ち"}]
[{"$f":"IFERROR(IF(B13=\"\",\"\",IF(B13>180,\"監視停止可能性あり\",\"\")),\"\")","v":""},{"$f":"IF(COUNT(D34,H34,L34,P34,T34)=0,\"\",ABS(A1-MAX(D34,H34,L34,P34,T34))*86400)","v":""},null,{"$f":"_xll.SNT.StockInst($D$2,\"売気配数量_3本目\")","v":"=@SNT.StockInst($D$2,\"売気配数量_3本目\") => 接続待ち"},{"$f":"_xll.SNT.StockInst($D$2,\"売気配価格_3本目\")","v":"=@SNT.StockInst($D$2,\"売気配価格_3本目\") => 接続待ち"},null,null,{"$f":"_xll.SNT.StockInst($H$2,\"売気配数量_3本目\")","v":"=@SNT.StockInst($H$2,\"売気配数量_3本目\") => 接続待ち"},{"$f":"_xll.SNT.StockInst($H$2,\"売気配価格_3本目\")","v":"=@SNT.StockInst($H$2,\"売気配価格_3本目\") => 接続待ち"},null,null,{"$f":"_xll.SNT.StockInst($L$2,\"売気配数量_3本目\")","v":"=@SNT.StockInst($L$2,\"売気配数量_3本目\") => 接続待ち"},{"$f":"_xll.SNT.StockInst($L$2,\"売気配価格_3本目\")","v":"=@SNT.StockInst($L$2,\"売気配価格_3本目\") => 接続待ち"},null,null,{"$f":"_xll.SNT.StockInst($P$2,\"売気配数量_3本目\")","v":"=@SNT.StockInst($P$2,\"売気配数量_3本目\") => 接続待ち"},{"$f":"_xll.SNT.StockInst($P$2,\"売気配価格_3本目\")","v":"=@SNT.StockInst($P$2,\"売気配価格_3本目\") => 接続待ち"},null,null,{"$f":"_xll.SNT.StockInst($T$2,\"売気配数量_3本目\")","v":"=@SNT.StockInst($T$2,\"売気配数量_3本目\") => 接続待ち"},{"$f":"_xll.SNT.StockInst($T$2,\"売気配価格_3本目\")","v":"=@SNT.StockInst($T$2,\"売気配価格_3本目\") => 接続待ち"}]
[null,null,null,{"$f":"_xll.SNT.StockInst($D$2,\"売気配数量_2本目\")","v":"=@SNT.StockInst($D$2,\"売気配数量_2本目\") => 接続待ち"},{"$f":"_xll.SNT.StockInst($D$2,\"売気配価格_2本目\")","v":"=@SNT.StockInst($D$2,\"売気配価格_2本目\") => 接続待ち"},null,null,{"$f":"_xll.SNT.StockInst($H$2,\"売気配数量_2本目\")","v":"=@SNT.StockInst($H$2,\"売気配数量_2本目\") => 接続待ち"},{"$f":"_xll.SNT.StockInst($H$2,\"売気配価格_2本目\")","v":"=@SNT.StockInst($H$2,\"売気配価格_2本目\") => 接続待ち"},null,null,{"$f":"_xll.SNT.StockInst($L$2,\"売気配数量_2本目\")","v":"=@SNT.StockInst($L$2,\"売気配数量_2本目\") => 接続待ち"},{"$f":"_xll.SNT.StockInst($L$2,\"売気配価格_2本目\")","v":"=@SNT.StockInst($L$2,\"売気配価格_2本目\") => 接続待ち"},null,null,{"$f":"_xll.SNT.StockInst($P$2,\"売気配数量_2本目\")","v":"=@SNT.StockInst($P$2,\"売気配数量_2本目\") => 接続待ち"},{"$f":"_xll.SNT.StockInst($P$2,\"売気配価格_2本目\")","v":"=@SNT.StockInst($P$2,\"売気配価格_2本目\") => 接続待ち"},null,null,{"$f":"_xll.SNT.StockInst($T$2,\"売気配数量_2本目\")","v":"=@SNT.StockInst($T$2,\"売気配数量_2本目\") => 接続待ち"},{"$f":"_xll.SNT.StockInst($T$2,\"売気配価格_2本目\")","v":"=@SNT.StockInst($T$2,\"売気配価格_2本目\") => 接続待ち"}]
[null,null,null,{"$f":"_xll.SNT.StockInst($D$2,\"売気配数量_1本目\")","v":"=@SNT.StockInst($D$2,\"売気配数量_1本目\") => 接続待ち"},{"$f":"_xll.SNT.StockInst($D$2,\"売気配価格_1本目\")","v":"=@SNT.StockInst($D$2,\"売気配価格_1本目\") => 接続待ち"},null,null,{"$f":"_xll.SNT.StockInst($H$2,\"売気配数量_1本目\")","v":"=@SNT.StockInst($H$2,\"売気配数量_1本目\") => 接続待ち"},{"$f":"_xll.SNT.StockInst($H$2,\"売気配価格_1本目\")","v":"=@SNT.StockInst($H$2,\"売気配価格_1本目\") => 接続待ち"},null,null,{"$f":"_xll.SNT.StockInst($L$2,\"売気配数量_1本目\")","v":"=@SNT.StockInst($L$2,\"売気配数量_1本目\") => 接続待ち"},{"$f":"_xll.SNT.StockInst($L$2,\"売気配価格_1本目\")","v":"=@SNT.StockInst($L$2,\"売気配価格_1本目\") => 接続待ち"},null,null,{"$f":"_xll.SNT.StockInst($P$2,\"売気配数量_1本目\")","v":"=@SNT.StockInst($P$2,\"売気配数量_1本目\") => 接続待ち"},{"$f":"_xll.SNT.StockInst($P$2,\"売気配価格_1本目\")","v":"=@SNT.StockInst($P$2,\"売気配価格_1本目\") => 接続待ち"},null,null,{"$f":"_xll.SNT.StockInst($T$2,\"売気配数量_1本目\")","v":"=@SNT.StockInst($T$2,\"売気配数量_1本目\") => 接続待ち"},{"$f":"_xll.SNT.StockInst($T$2,\"売気配価格_1本目\")","v":"=@SNT.StockInst($T$2,\"売気配価格_1本目\") => 接続待ち"}]
[null,null,null,null,{"$f":"_xll.SNT.StockInst($D$2,\"買気配価格_1本目\")","v":"=@SNT.StockInst($D$2,\"買気配価格_1本目\") => 接続待ち"},{"$f":"_xll.SNT.StockInst($D$2,\"買気配数量_1本目\")","v":"=@SNT.StockInst($D$2,\"買気配数量_1本目\") => 接続待ち"},null,null,{"$f":"_xll.SNT.StockInst($H$2,\"買気配価格_1本目\")","v":"=@SNT.StockInst($H$2,\"買気配価格_1本目\") => 接続待ち"},{"$f":"_xll.SNT.StockInst($H$2,\"買気配数量_1本目\")","v":"=@SNT.StockInst($H$2,\"買気配数量_1本目\") => 接続待ち"},null,null,{"$f":"_xll.SNT.StockInst($L$2,\"買気配価格_1本目\")","v":"=@SNT.StockInst($L$2,\"買気配価格_1本目\") => 接続待ち"},{"$f":"_xll.SNT.StockInst($L$2,\"買気配数量_1本目\")","v":"=@SNT.StockInst($L$2,\"買気配数量_1本目\") => 接続待ち"},null,null,{"$f":"_xll.SNT.StockInst($P$2,\"買気配価格_1本目\")","v":"=@SNT.StockInst($P$2,\"買気配価格_1本目\") => 接続待ち"},{"$f":"_xll.SNT.StockInst($P$2,\"買気配数量_1本目\")","v":"=@SNT.StockInst($P$2,\"買気配数量_1本目\") => 接続待ち"},null,null,{"$f":"_xll.SNT.StockInst($T$2,\"買気配価格_1本目\")","v":"=@SNT.StockInst($T$2,\"買気配価格_1本目\") => 接続待ち"},{"$f":"_xll.SNT.StockInst($T$2,\"買気配数量_1本目\")","v":"=@SNT.StockInst($T$2,\"買気配数量_1本目\") => 接続待ち"}]
[null,null,null,null,{"$f":"_xll.SNT.StockInst($D$2,\"買気配価格_2本目\")","v":"=@SNT.StockInst($D$2,\"買気配価格_2本目\") => 接続待ち"},{"$f":"_xll.SNT.StockInst($D$2,\"買気配数量_2本目\")","v":"=@SNT.StockInst($D$2,\"買気配数量_2本目\") => 接続待ち"},null,null,{"$f":"_xll.SNT.StockInst($H$2,\"買気配価格_2本目\")","v":"=@SNT.StockInst($H$2,\"買気配価格_2本目\") => 接続待ち"},{"$f":"_xll.SNT.StockInst($H$2,\"買気配数量_2本目\")","v":"=@SNT.StockInst($H$2,\"買気配数量_2本目\") => 接続待ち"},null,null,{"$f":"_xll.SNT.StockInst($L$2,\"買気配価格_2本目\")","v":"=@SNT.StockInst($L$2,\"買気配価格_2本目\") => 接続待ち"},{"$f":"_xll.SNT.StockInst($L$2,\"買気配数量_2本目\")","v":"=@SNT.StockInst($L$2,\"買気配数量_2本目\") => 接続待ち"},null,null,{"$f":"_xll.SNT.StockInst($P$2,\"買気配価格_2本目\")","v":"=@SNT.StockInst($P$2,\"買気配価格_2本目\") => 接続待ち"},{"$f":"_xll.SNT.StockInst($P$2,\"買気配数量_2本目\")","v":"=@SNT.StockInst($P$2,\"買気配数量_2本目\") => 接続待ち"},null,null,{"$f":"_xll.SNT.StockInst($T$2,\"買気配価格_2本目\")","v":"=@SNT.StockInst($T$2,\"買気配価格_2本目\") => 接続待ち"},{"$f":"_xll.SNT.StockInst($T$2,\"買気配数量_2本目\")","v":"=@SNT.StockInst($T$2,\"買気配数量_2本目\") => 接続待ち"}]
[null,null,null,null,{"$f":"_xll.SNT.StockInst($D$2,\"買気配価格_3本目\")","v":"=@SNT.StockInst($D$2,\"買気配価格_3本目\") => 接続待ち"},{"$f":"_xll.SNT.StockInst($D$2,\"買気配数量_3本目\")","v":"=@SNT.StockInst($D$2,\"買気配数量_3本目\") => 接続待ち"},null,null,{"$f":"_xll.SNT.StockInst($H$2,\"買気配価格_3本目\")","v":"=@SNT.StockInst($H$2,\"買気配価格_3本目\") => 接続待ち"},{"$f":"_xll.SNT.StockInst($H$2,\"買気配数量_3本目\")","v":"=@SNT.StockInst($H$2,\"買気配数量_3本目\") => 接続待ち"},null,null,{"$f":"_xll.SNT.StockInst($L$2,\"買気配価格_3本目\")","v":"=@SNT.StockInst($L$2,\"買気配価格_3本目\") => 接続待ち"},{"$f":"_xll.SNT.StockInst($L$2,\"買気配数量_3本目\")","v":"=@SNT.StockInst($L$2,\"買気配数量_3本目\") => 接続待ち"},null,null,{"$f":"_xll.SNT.StockInst($P$2,\"買気配価格_3本目\")","v":"=@SNT.StockInst($P$2,\"買気配価格_3本目\") => 接続待ち"},{"$f":"_xll.SNT.StockInst($P$2,\"買気配数量_3本目\")","v":"=@SNT.StockInst($P$2,\"買気配数量_3本目\") => 接続待ち"},null,null,{"$f":"_xll.SNT.StockInst($T$2,\"買気配価格_3本目\")","v":"=@SNT.StockInst($T$2,\"買気配価格_3本目\") => 接続待ち"},{"$f":"_xll.SNT.StockInst($T$2,\"買気配数量_3本目\")","v":"=@SNT.StockInst($T$2,\"買気配数量_3本目\") => 接続待ち"}]
[null,null,null,null,{"$f":"_xll.SNT.StockInst($D$2,\"買気配価格_4本目\")","v":"=@SNT.StockInst($D$2,\"買気配価格_4本目\") => 接続待ち"},{"$f":"_xll.SNT.StockInst($D$2,\"買気配数量_4本目\")","v":"=@SNT.StockInst($D$2,\"買気配数量_4本目\") => 接続待ち"},null,null,{"$f":"_xll.SNT.StockInst($H$2,\"買気配価格_4本目\")","v":"=@SNT.StockInst($H$2,\"買気配価格_4本目\") => 接続待ち"},{"$f":"_xll.SNT.StockInst($H$2,\"買気配数量_4本目\")","v":"=@SNT.StockInst($H$2,\"買気配数量_4本目\") => 接続待ち"},null,null,{"$f":"_xll.SNT.StockInst($L$2,\"買気配価格_4本目\")","v":"=@SNT.StockInst($L$2,\"買気配価格_4本目\") => 接続待ち"},{"$f":"_xll.SNT.StockInst($L$2,\"買気配数量_4本目\")","v":"=@SNT.StockInst($L$2,\"買気配数量_4本目\") => 接続待ち"},null,null,{"$f":"_xll.SNT.StockInst($P$2,\"買気配価格_4本目\")","v":"=@SNT.StockInst($P$2,\"買気配価格_4本目\") => 接続待ち"},{"$f":"_xll.SNT.StockInst($P$2,\"買気配数量_4本目\")","v":"=@SNT.StockInst($P$2,\"買気配数量_4本目\") => 接続待ち"},null,null,{"$f":"_xll.SNT.StockInst($T$2,\"買気配価格_4本目\")","v":"=@SNT.StockInst($T$2,\"買気配価格_4本目\") => 接続待ち"},{"$f":"_xll.SNT.StockInst($T$2,\"買気配数量_4本目\")","v":"=@SNT.StockInst($T$2,\"買気配数量_4本目\") => 接続待ち"}]
[null,null,null,null,{"$f":"_xll.SNT.StockInst($D$2,\"買気配価格_5本目\")","v":"=@SNT.StockInst($D$2,\"買気配価格_5本目\") => 接続待ち"},{"$f":"_xll.SNT.StockInst($D$2,\"買気配数量_5本目\")","v":"=@SNT.StockInst($D$2,\"買気配数量_5本目\") => 接続待ち"},null,null,{"$f":"_xll.SNT.StockInst($H$2,\"買気配価格_5本目\")","v":"=@SNT.StockInst($H$2,\"買気配価格_5本目\") => 接続待ち"},{"$f":"_xll.SNT.StockInst($H$2,\"買気配数量_5本目\")","v":"=@SNT.StockInst($H$2,\"買気配数量_5本目\") => 接続待ち"},null,null,{"$f":"_xll.SNT.StockInst($L$2,\"買気配価格_5本目\")","v":"=@SNT.StockInst($L$2,\"買気配価格_5本目\") => 接続待ち"},{"$f":"_xll.SNT.StockInst($L$2,\"買気配数量_5本目\")","v":"=@SNT.StockInst($L$2,\"買気配数量_5本目\") => 接続待ち"},null,null,{"$f":"_xll.SNT.StockInst($P$2,\"買気配価格_5本目\")","v":"=@SNT.StockInst($P$2,\"買気配価格_5本目\") => 接続待ち"},{"$f":"_xll.SNT.StockInst($P$2,\"買気配数量_5本目\")","v":"=@SNT.StockInst($P$2,\"買気配数量_5本目\") => 接続待ち"},null,null,{"$f":"_xll.SNT.StockInst($T$2,\"買気配価格_5本目\")","v":"=@SNT.StockInst($T$2,\"買気配価格_5本目\") => 接続待ち"},{"$f":"_xll.SNT.StockInst($T$2,\"買気配数量_5本目\")","v":"=@SNT.StockInst($T$2,\"買気配数量_5本目\") => 接続待ち"}]
[null,null,null,null,"呼値",{"$f":"IFERROR(IF($F$3=\"T500\",VLOOKUP(E4,呼値の単位!$A$4:$D$19,4,TRUE),IF($D$3=\"ETF\",VLOOKUP(E4,呼値の単位!$A$4:$E$19,5,TRUE),VLOOKUP(E4,呼値の単位!$A$4:$C$19,3,TRUE))),1)","v":1},null,null,"呼値",{"$f":"IFERROR(IF($J$3=\"T500\",VLOOKUP(I4,呼値の単位!$A$4:$D$19,4,TRUE),IF($H$3=\"ETF\",VLOOKUP(I4,呼値の単位!$A$4:$E$19,5,TRUE),VLOOKUP(I4,呼値の単位!$A$4:$C$19,3,TRUE))),1)","v":1},null,null,"呼値",{"$f":"IFERROR(IF($N$3=\"T500\",VLOOKUP(M4,呼値の単位!$A$4:$D$19,4,TRUE),IF($L$3=\"ETF\",VLOOKUP(M4,呼値の単位!$A$4:$E$19,5,TRUE),VLOOKUP(M4,呼値の単位!$A$4:$C$19,3,TRUE))),1)","v":1},null,null,"呼値",{"$f":"IFERROR(IF($R$3=\"T500\",VLOOKUP(Q4,呼値の単位!$A$4:$D$19,4,TRUE),IF($P$3=\"ETF\",VLOOKUP(Q4,呼値の単位!$A$4:$E$19,5,TRUE),VLOOKUP(Q4,呼値の単位!$A$4:$C$19,3,TRUE))),1)","v":1},null,null,"呼値",{"$f":"IFERROR(IF($V$3=\"T500\",VLOOKUP(U4,呼値の単位!$A$4:$D$19,4,TRUE),IF($T$3=\"ETF\",VLOOKUP(U4,呼値の単位!$A$4:$E$19,5,TRUE),VLOOKUP(U4,呼値の単位!$A$4:$C$19,3,TRUE))),1)","v":1}]
[null,null,null,null,"決済方向",{"$f":"_xlfn.IFS(F$25=\"返済売\",1,F$25=\"返済買\",3,F$25=0,0)","v":0},null,null,"決済方向",{"$f":"_xlfn.IFS(J$25=\"返済売\",1,J$25=\"返済買\",3,J$25=0,0)","v":0},null,null,"決済方向",{"$f":"_xlfn.IFS(N$25=\"返済売\",1,N$25=\"返済買\",3,N$25=0,0)","v":0},null,null,"決済方向",{"$f":"_xlfn.IFS(R$25=\"返済売\",1,R$25=\"返済買\",3,R$25=0,0)","v":0},null,null,"決済方向",{"$f":"_xlfn.IFS(V$25=\"返済売\",1,V$25=\"返済買\",3,V$25=0,0)","v":0}]
[]
[null,null,null,"逆指情報","注文ID",{"$f":"IF(逆指値注文一覧!$Q$4=\"\",\"\",TEXT(逆指値注文一覧!$Q$4,0))","v":""},null,"逆指情報","注文ID",{"$f":"IF(逆指値注文一覧!$Q$5=\"\",\"\",TEXT(逆指値注文一覧!$Q$5,0))","v":""},null,"逆指情報","注文ID",{"$f":"IF(逆指値注文一覧!$Q$6=\"\",\"\",TEXT(逆指値注文一覧!$Q$6,0))","v":""},null,"逆指情報","注文ID",{"$f":"IF(逆指値注文一覧!$Q$7=\"\",\"\",TEXT(逆指値注文一覧!$Q$7,0))","v":""},null,"逆指情報","注文ID",{"$f":"IF(逆指値注文一覧!$Q$8=\"\",\"\",TEXT(逆指値注文一覧!$Q$8,0))","v":""}]
[null,null,null,null,"区分",{"$f":"逆指値注文一覧!$T$4","v":0},null,null,"区分",{"$f":"逆指値注文一覧!$T$5","v":0},null,null,"区分",{"$f":"逆指値注文一覧!$T$6","v":0},null,null,"区分",{"$f":"逆指値注文一覧!$T$7","v":0},null,null,"区分",{"$f":"逆指値注文一覧!$T$8","v":0}]
[null,null,null,null,"条件単価",{"$f":"逆指値注文一覧!$X$4","v":0},null,null,"条件単価",{"$f":"逆指値注文一覧!$X$5","v":0},null,null,"条件単価",{"$f":"逆指値注文一覧!$X$6","v":0},null,null,"条件単価",{"$f":"逆指値注文一覧!$X$7","v":0},null,null,"条件単価",{"$f":"逆指値注文一覧!$X$8","v":0}]
[null,null,null,null,"数量",{"$f":"逆指値注文一覧!$V$4","v":0},null,null,"数量",{"$f":"逆指値注文一覧!$V$5","v":0},null,null,"数量",{"$f":"逆指値注文一覧!$V$6","v":0},null,null,"数量",{"$f":"逆指値注文一覧!$V$7","v":0},null,null,"数量",{"$f":"逆指値注文一覧!$V$8","v":0}]
[null,null,null,null,"注文期限",{"$f":"逆指値注文一覧!$AA$4","v":0},null,null,"注文期限",{"$f":"逆指値注文一覧!$AA$5","v":0},null,null,"注文期限",{"$f":"逆指値注文一覧!$AA$6","v":0},null,null,"注文期限",{"$f":"逆指値注文一覧!$AA$7","v":0},null,null,"注文期限",{"$f":"逆指値注文一覧!$AA$8","v":0}]
[]
[null,null,null,"トレール幅　設定",null,15,null,"トレール幅　設定",null,5,null,"トレール幅　設定",null,5,null,"トレール幅　設定",null,10,null,"トレール幅　設定",null,10]
[null,null,null,"注文管理ID",null,40,null,"注文管理ID",null,55,null,"注文管理ID",null,53,null,"注文管理ID",null,35,null,"注文管理ID",null,54]
[null,"トレール情報"]
[null,"実行開始時間"]
[]
[null,null,null,"＜訂正結果＞",null,null,null,"＜訂正結果＞",null,null,null,"＜訂正結果＞",null,null,null,"＜訂正結果＞",null,null,null,"＜訂正結果＞"]

{"sheet":"注文照会","index":5,"n_rows":507,"n_cols":16,"rows_kept":507,"cut":false,"hidden":false,"merged":[]}
[]
["信用取引　信用注文約定照会"]
[null,null,null,null,"ソート"]
["出力数",null,null,null,"銘柄コード","約定状態"]
[60]
[]
["＃","注文ID","銘柄コード","銘柄名称","口座区分","取引区分","注文区分","執行条件","注文数量","注文単価区分","注文単価","約定状態","失効状態","約定数量","未約定数量","注文日時"]
[1]
[2]
[3]
[4]
[5]
[6]
[7]
[8]
[9]
[10]
[11]
[12]
[13]
[14]
[15]
[16]
[17]
[18]
[19]
[20]
[21]
[22]
[23]
[24]
[25]
[26]
[27]
[28]
[29]
[30]
[31]
[32]
[33]
[34]
[35]
[36]
[37]
[38]
[39]
[40]
[41]
[42]
[43]
[44]
[45]
[46]
[47]
[48]
[49]
[50]
[51]
[52]
[53]
[54]
[55]
[56]
[57]
[58]
[59]
[60]
[61]
[62]
[63]
[64]
[65]
[66]
[67]
[68]
[69]
[70]
[71]
[72]
[73]
[74]
[75]
[76]
[77]
[78]
[79]
[80]
[81]
[82]
[83]
[84]
[85]
[86]
[87]
[88]
[89]
[90]
[91]
[92]
[93]
[94]
[95]
[96]
[97]
[98]
[99]
[100]
[101]
[102]
[103]
[104]
[105]
[106]
[107]
[108]
[109]
[110]
[111]
[112]
[113]
[114]
[115]
[116]
[117]
[118]
[119]
[120]
[121]
[122]
[123]
[124]
[125]
[126]
[127]
[128]
[129]
[130]
[131]
[132]
[133]
[134]
[135]
[136]
[137]
[138]
[139]
[140]
[141]
[142]
[143]
[144]
[145]
[146]
[147]
[148]
[149]
[150]
[151]
[152]
[153]
[154]
[155]
[156]
[157]
[158]
[159]
[160]
[161]
[162]
[163]
[164]
[165]
[166]
[167]
[168]
[169]
[170]
[171]
[172]
[173]
[174]
[175]
[176]
[177]
[178]
[179]
[180]
[181]
[182]
[183]
[184]
[185]
[186]
[187]
[188]
[189]
[190]
[191]
[192]
[193]
[194]
[195]
[196]
[197]
[198]
[199]
[200]
[201]
[202]
[203]
[204]
[205]
[206]
[207]
[208]
[209]
[210]
[211]
[212]
[213]
[214]
[215]
[216]
[217]
[218]
[219]
[220]
[221]
[222]
[223]
[224]
[225]
[226]
[227]
[228]
[229]
[230]
[231]
[232]
[233]
[234]
[235]
[236]
[237]
[238]
[239]
[240]
[241]
[242]
[243]
[244]
[245]
[246]
[247]
[248]
[249]
[250]
[251]
[252]
[253]
[254]
[255]
[256]
[257]
[258]
[259]
[260]
[261]
[262]
[263]
[264]
[265]
[266]
[267]
[268]
[269]
[270]
[271]
[272]
[273]
[274]
[275]
[276]
[277]
[278]
[279]
[280]
[281]
[282]
[283]
[284]
[285]
[286]
[287]
[288]
[289]
[290]
[291]
[292]
[293]
[294]
[295]
[296]
[297]
[298]
[299]
[300]
[301]
[302]
[303]
[304]
[305]
[306]
[307]
[308]
[309]
[310]
[311]
[312]
[313]
[314]
[315]
[316]
[317]
[318]
[319]
[320]
[321]
[322]
[323]
[324]
[325]
[326]
[327]
[328]
[329]
[330]
[331]
[332]
[333]
[334]
[335]
[336]
[337]
[338]
[339]
[340]
[341]
[342]
[343]
[344]
[345]
[346]
[347]
[348]
[349]
[350]
[351]
[352]
[353]
[354]
[355]
[356]
[357]
[358]
[359]
[360]
[361]
[362]
[363]
[364]
[365]
[366]
[367]
[368]
[369]
[370]
[371]
[372]
[373]
[374]
[375]
[376]
[377]
[378]
[379]
[380]
[381]
[382]
[383]
[384]
[385]
[386]
[387]
[388]
[389]
[390]
[391]
[392]
[393]
[394]
[395]
[396]
[397]
[398]
[399]
[400]
[401]
[402]
[403]
[404]
[405]
[406]
[407]
[408]
[409]
[410]
[411]
[412]
[413]
[414]
[415]
[416]
[417]
[418]
[419]
[420]
[421]
[422]
[423]
[424]
[425]
[426]
[427]
[428]
[429]
[430]
[431]
[432]
[433]
[434]
[435]
[436]
[437]
[438]
[439]
[440]
[441]
[442]
[443]
[444]
[445]
[446]
[447]
[448]
[449]
[450]
[451]
[452]
[453]
[454]
[455]
[456]
[457]
[458]
[459]
[460]
[461]
[462]
[463]
[464]
[465]
[466]
[467]
[468]
[469]
[470]
[471]
[472]
[473]
[474]
[475]
[476]
[477]
[478]
[479]
[480]
[481]
[482]
[483]
[484]
[485]
[486]
[487]
[488]
[489]
[490]
[491]
[492]
[493]
[494]
[495]
[496]
[497]
[498]
[499]
[500]

{"sheet":"呼値の単位","index":6,"n_rows":19,"n_cols":5,"rows_kept":19,"cut":false,"hidden":false,"merged":[]}
[]
["＜値刻み設定＞"]
["以上","以下","一般単位","TOPIX単位","ETF"]
[1,1000,1,0.1,1]
[1000.1,3000,1,0.5,1]
[3000.5,5000,5,1,1]
[5001,10000,10,1,1]
[10001,30000,10,5,5]
[30001,50000,50,10,10]
[50001,100000,100,10,10]
[100001,300000,100,50,50]
[300001,500000,500,100,100]
[500001,1000000,1000,100,100]
[1000001,3000000,1000,500,500]
[3000001,5000000,5000,1000,1000]
[5000001,10000000,10000,1000,1000]
[10000001,30000000,10000,5000,5000]
[30000001,50000000,50000,10000,10000]
[50000001,null,100000,10000,10000]

{"sheet":"TOPIX500","index":7,"n_rows":1692,"n_cols":21,"rows_kept":1692,"cut":false,"hidden":false,"merged":[]}
["日付","銘柄名","コード","業種","TOPIXに占める個別銘柄のウエイト","ニューインデックス区分","TEXTコード","flag",null,null,"構成銘柄情報",null,"https://www.jpx.co.jp/markets/indices/topix/index.html#heading_5",null,null,null,null,null,null,null,"2026年5月1日時点データ"]
[20251230,"極洋",1301,"水産・農林業",5.8999999999999998E-5,"TOPIX Small 1",{"$f":"TEXT(C2,0)","v":"1301"},{"$f":"IFERROR(_xlfn.IFS(F2=$K$4,\"T500\",F2=$K$5,\"T500\",F2=$K$6,\"T500\"),\"\")","v":""}]
[20251230,"ニッスイ",1332,"水産・農林業",3.0499999999999999E-4,"TOPIX Mid400",{"$f":"TEXT(C3,0)","v":"1332"},{"$f":"IFERROR(_xlfn.IFS(F3=$K$4,\"T500\",F3=$K$5,\"T500\",F3=$K$6,\"T500\"),\"\")","v":"T500"},null,null,"＜フラグピック区分＞"]
[20251230,"マルハニチロ",1333,"水産・農林業",1.8100000000000001E-4,"TOPIX Mid400","1333",{"$f":"IFERROR(_xlfn.IFS(F4=$K$4,\"T500\",F4=$K$5,\"T500\",F4=$K$6,\"T500\"),\"\")","v":"T500"},null,null,"TOPIX Core30"]
[20251230,"ユキグニファクトリー",1375,"水産・農林業",2.5999999999999998E-5,"TOPIX Small 2","1375",{"$f":"IFERROR(_xlfn.IFS(F5=$K$4,\"T500\",F5=$K$5,\"T500\",F5=$K$6,\"T500\"),\"\")","v":""},null,null,"TOPIX Large70"]
[20251230,"カネコ種苗",1376,"水産・農林業",1.2999999999999999E-5,"TOPIX Small 2","1376",{"$f":"IFERROR(_xlfn.IFS(F6=$K$4,\"T500\",F6=$K$5,\"T500\",F6=$K$6,\"T500\"),\"\")","v":""},null,null,"TOPIX Mid400"]
[20251230,"サカタのタネ",1377,"水産・農林業",1.4999999999999999E-4,"TOPIX Small 1","1377",{"$f":"IFERROR(_xlfn.IFS(F7=$K$4,\"T500\",F7=$K$5,\"T500\",F7=$K$6,\"T500\"),\"\")","v":""}]
[20251230,"ホクト",1379,"水産・農林業",5.1999999999999997E-5,"TOPIX Small 2","1379",{"$f":"IFERROR(_xlfn.IFS(F8=$K$4,\"T500\",F8=$K$5,\"T500\",F8=$K$6,\"T500\"),\"\")","v":""}]
[20251230,"ショーボンドホールディングス",1414,"建設業",2.02E-4,"TOPIX Mid400","1414",{"$f":"IFERROR(_xlfn.IFS(F9=$K$4,\"T500\",F9=$K$5,\"T500\",F9=$K$6,\"T500\"),\"\")","v":"T500"}]
[20251230,"ミライト・ワン",1417,"建設業",3.4699999999999998E-4,"TOPIX Mid400","1417",{"$f":"IFERROR(_xlfn.IFS(F10=$K$4,\"T500\",F10=$K$5,\"T500\",F10=$K$6,\"T500\"),\"\")","v":"T500"}]
[20251230,"タマホーム",1419,"建設業",6.4999999999999994E-5,"TOPIX Small 1","1419",{"$f":"IFERROR(_xlfn.IFS(F11=$K$4,\"T500\",F11=$K$5,\"T500\",F11=$K$6,\"T500\"),\"\")","v":""}]
[20251230,"ｒｏｂｏｔ　ｈｏｍｅ",1435,"不動産業",1.0000000000000001E-5,"TOPIX Small 2","1435",{"$f":"IFERROR(_xlfn.IFS(F12=$K$4,\"T500\",F12=$K$5,\"T500\",F12=$K$6,\"T500\"),\"\")","v":""}]
[20251230,"住石ホールディングス",1514,"鉱業",1.4E-5,"TOPIX Small 2","1514",{"$f":"IFERROR(_xlfn.IFS(F13=$K$4,\"T500\",F13=$K$5,\"T500\",F13=$K$6,\"T500\"),\"\")","v":""}]
[20251230,"日鉄鉱業",1515,"鉱業",1.25E-4,"TOPIX Small 1","1515",{"$f":"IFERROR(_xlfn.IFS(F14=$K$4,\"T500\",F14=$K$5,\"T500\",F14=$K$6,\"T500\"),\"\")","v":""}]
[20251230,"三井松島ホールディングス",1518,"その他製品",5.0000000000000002E-5,"TOPIX Small 1","1518",{"$f":"IFERROR(_xlfn.IFS(F15=$K$4,\"T500\",F15=$K$5,\"T500\",F15=$K$6,\"T500\"),\"\")","v":""}]
[20251230,"ＩＮＰＥＸ",1605,"鉱業",3.052E-3,"TOPIX Mid400","1605",{"$f":"IFERROR(_xlfn.IFS(F16=$K$4,\"T500\",F16=$K$5,\"T500\",F16=$K$6,\"T500\"),\"\")","v":"T500"}]
[20251230,"石油資源開発",1662,"鉱業",2.81E-4,"TOPIX Small 1","1662",{"$f":"IFERROR(_xlfn.IFS(F17=$K$4,\"T500\",F17=$K$5,\"T500\",F17=$K$6,\"T500\"),\"\")","v":""}]
[20251230,"Ｋ＆Ｏエナジーグループ",1663,"鉱業",5.0000000000000002E-5,"TOPIX Small 1","1663",{"$f":"IFERROR(_xlfn.IFS(F18=$K$4,\"T500\",F18=$K$5,\"T500\",F18=$K$6,\"T500\"),\"\")","v":""}]
[20251230,"リョーサン菱洋ホールディングス","167A","卸売業",1.2999999999999999E-4,"TOPIX Small 1","167A",{"$f":"IFERROR(_xlfn.IFS(F19=$K$4,\"T500\",F19=$K$5,\"T500\",F19=$K$6,\"T500\"),\"\")","v":""}]
[20251230,"第一カッター興業",1716,"建設業",1.0000000000000001E-5,"TOPIX Small 2","1716",{"$f":"IFERROR(_xlfn.IFS(F20=$K$4,\"T500\",F20=$K$5,\"T500\",F20=$K$6,\"T500\"),\"\")","v":""}]
[20251230,"安藤・間",1719,"建設業",2.92E-4,"TOPIX Mid400","1719",{"$f":"IFERROR(_xlfn.IFS(F21=$K$4,\"T500\",F21=$K$5,\"T500\",F21=$K$6,\"T500\"),\"\")","v":"T500"}]
[20251230,"東急建設",1720,"建設業",1.1900000000000001E-4,"TOPIX Small 1","1720",{"$f":"IFERROR(_xlfn.IFS(F22=$K$4,\"T500\",F22=$K$5,\"T500\",F22=$K$6,\"T500\"),\"\")","v":""}]
[20251230,"コムシスホールディングス",1721,"建設業",4.6900000000000002E-4,"TOPIX Mid400","1721",{"$f":"IFERROR(_xlfn.IFS(F23=$K$4,\"T500\",F23=$K$5,\"T500\",F23=$K$6,\"T500\"),\"\")","v":"T500"}]
[20251230,"ビーアールホールディングス",1726,"建設業",1.5E-5,"TOPIX Small 2","1726",{"$f":"IFERROR(_xlfn.IFS(F24=$K$4,\"T500\",F24=$K$5,\"T500\",F24=$K$6,\"T500\"),\"\")","v":""}]
[20251230,"高松コンストラクショングループ",1762,"建設業",8.7000000000000001E-5,"TOPIX Small 2","1762",{"$f":"IFERROR(_xlfn.IFS(F25=$K$4,\"T500\",F25=$K$5,\"T500\",F25=$K$6,\"T500\"),\"\")","v":""}]
[20251230,"東建コーポレーション",1766,"建設業",9.2E-5,"TOPIX Small 1","1766",{"$f":"IFERROR(_xlfn.IFS(F26=$K$4,\"T500\",F26=$K$5,\"T500\",F26=$K$6,\"T500\"),\"\")","v":""}]
[20251230,"ヤマウラ",1780,"建設業",2.4000000000000001E-5,"TOPIX Small 2","1780",{"$f":"IFERROR(_xlfn.IFS(F27=$K$4,\"T500\",F27=$K$5,\"T500\",F27=$K$6,\"T500\"),\"\")","v":""}]
[20251230,"オリエンタル白石",1786,"建設業",4.5000000000000003E-5,"TOPIX Small 2","1786",{"$f":"IFERROR(_xlfn.IFS(F28=$K$4,\"T500\",F28=$K$5,\"T500\",F28=$K$6,\"T500\"),\"\")","v":""}]
[20251230,"大成建設",1801,"建設業",2.251E-3,"TOPIX Mid400","1801",{"$f":"IFERROR(_xlfn.IFS(F29=$K$4,\"T500\",F29=$K$5,\"T500\",F29=$K$6,\"T500\"),\"\")","v":"T500"}]
[20251230,"大林組",1802,"建設業",2.1489999999999999E-3,"TOPIX Mid400","1802",{"$f":"IFERROR(_xlfn.IFS(F30=$K$4,\"T500\",F30=$K$5,\"T500\",F30=$K$6,\"T500\"),\"\")","v":"T500"}]
[20251230,"清水建設",1803,"建設業",1.482E-3,"TOPIX Mid400","1803",{"$f":"IFERROR(_xlfn.IFS(F31=$K$4,\"T500\",F31=$K$5,\"T500\",F31=$K$6,\"T500\"),\"\")","v":"T500"}]
[20251230,"長谷工コーポレーション",1808,"建設業",5.8E-4,"TOPIX Mid400","1808",{"$f":"IFERROR(_xlfn.IFS(F32=$K$4,\"T500\",F32=$K$5,\"T500\",F32=$K$6,\"T500\"),\"\")","v":"T500"}]
[20251230,"松井建設",1810,"建設業",2.5000000000000001E-5,"TOPIX Small 2","1810",{"$f":"IFERROR(_xlfn.IFS(F33=$K$4,\"T500\",F33=$K$5,\"T500\",F33=$K$6,\"T500\"),\"\")","v":""}]
[20251230,"鹿島建設",1812,"建設業",2.63E-3,"TOPIX Mid400","1812",{"$f":"IFERROR(_xlfn.IFS(F34=$K$4,\"T500\",F34=$K$5,\"T500\",F34=$K$6,\"T500\"),\"\")","v":"T500"}]
[20251230,"不動テトラ",1813,"建設業",3.1000000000000001E-5,"TOPIX Small 2","1813",{"$f":"IFERROR(_xlfn.IFS(F35=$K$4,\"T500\",F35=$K$5,\"T500\",F35=$K$6,\"T500\"),\"\")","v":""}]
[20251230,"鉄建建設",1815,"建設業",5.8E-5,"TOPIX Small 2","1815",{"$f":"IFERROR(_xlfn.IFS(F36=$K$4,\"T500\",F36=$K$5,\"T500\",F36=$K$6,\"T500\"),\"\")","v":""}]
[20251230,"西松建設",1820,"建設業",1.85E-4,"TOPIX Mid400","1820",{"$f":"IFERROR(_xlfn.IFS(F37=$K$4,\"T500\",F37=$K$5,\"T500\",F37=$K$6,\"T500\"),\"\")","v":"T500"}]
[20251230,"大豊建設",1822,"建設業",2.1999999999999999E-5,"TOPIX Small 2","1822",{"$f":"IFERROR(_xlfn.IFS(F38=$K$4,\"T500\",F38=$K$5,\"T500\",F38=$K$6,\"T500\"),\"\")","v":""}]
[20251230,"奥村組",1833,"建設業",2.04E-4,"TOPIX Small 1","1833",{"$f":"IFERROR(_xlfn.IFS(F39=$K$4,\"T500\",F39=$K$5,\"T500\",F39=$K$6,\"T500\"),\"\")","v":""}]
[20251230,"東鉄工業",1835,"建設業",1.02E-4,"TOPIX Small 1","1835",{"$f":"IFERROR(_xlfn.IFS(F40=$K$4,\"T500\",F40=$K$5,\"T500\",F40=$K$6,\"T500\"),\"\")","v":""}]
[20251230,"淺沼組",1852,"建設業",8.2999999999999998E-5,"TOPIX Small 1","1852",{"$f":"IFERROR(_xlfn.IFS(F41=$K$4,\"T500\",F41=$K$5,\"T500\",F41=$K$6,\"T500\"),\"\")","v":""}]
[20251230,"戸田建設",1860,"建設業",3.1700000000000001E-4,"TOPIX Mid400","1860",{"$f":"IFERROR(_xlfn.IFS(F42=$K$4,\"T500\",F42=$K$5,\"T500\",F42=$K$6,\"T500\"),\"\")","v":"T500"}]
[20251230,"熊谷組",1861,"建設業",1.8699999999999999E-4,"TOPIX Small 1","1861",{"$f":"IFERROR(_xlfn.IFS(F43=$K$4,\"T500\",F43=$K$5,\"T500\",F43=$K$6,\"T500\"),\"\")","v":""}]
[20251230,"矢作建設工業",1870,"建設業",8.8999999999999995E-5,"TOPIX Small 1","1870",{"$f":"IFERROR(_xlfn.IFS(F44=$K$4,\"T500\",F44=$K$5,\"T500\",F44=$K$6,\"T500\"),\"\")","v":""}]
[20251230,"ピーエス・コンストラクション",1871,"建設業",5.3000000000000001E-5,"TOPIX Small 2","1871",{"$f":"IFERROR(_xlfn.IFS(F45=$K$4,\"T500\",F45=$K$5,\"T500\",F45=$K$6,\"T500\"),\"\")","v":""}]
[20251230,"日本ハウスホールディングス",1873,"建設業",1.4E-5,"TOPIX Small 2","1873",{"$f":"IFERROR(_xlfn.IFS(F46=$K$4,\"T500\",F46=$K$5,\"T500\",F46=$K$6,\"T500\"),\"\")","v":""}]
[20251230,"大東建託",1878,"不動産業",1.0369999999999999E-3,"TOPIX Mid400","1878",{"$f":"IFERROR(_xlfn.IFS(F47=$K$4,\"T500\",F47=$K$5,\"T500\",F47=$K$6,\"T500\"),\"\")","v":"T500"}]
[20251230,"新日本建設",1879,"建設業",5.8E-5,"TOPIX Small 2","1879",{"$f":"IFERROR(_xlfn.IFS(F48=$K$4,\"T500\",F48=$K$5,\"T500\",F48=$K$6,\"T500\"),\"\")","v":""}]
[20251230,"東亜道路工業",1882,"建設業",5.3999999999999998E-5,"TOPIX Small 1","1882",{"$f":"IFERROR(_xlfn.IFS(F49=$K$4,\"T500\",F49=$K$5,\"T500\",F49=$K$6,\"T500\"),\"\")","v":""}]
[20251230,"東亜建設工業",1885,"建設業",2.12E-4,"TOPIX Small 1","1885",{"$f":"IFERROR(_xlfn.IFS(F50=$K$4,\"T500\",F50=$K$5,\"T500\",F50=$K$6,\"T500\"),\"\")","v":""}]
[20251230,"日本国土開発",1887,"建設業",3.4E-5,"TOPIX Small 2","1887",{"$f":"IFERROR(_xlfn.IFS(F51=$K$4,\"T500\",F51=$K$5,\"T500\",F51=$K$6,\"T500\"),\"\")","v":""}]
[20251230,"若築建設",1888,"建設業",2.9E-5,"TOPIX Small 2","1888",{"$f":"IFERROR(_xlfn.IFS(F52=$K$4,\"T500\",F52=$K$5,\"T500\",F52=$K$6,\"T500\"),\"\")","v":""}]
[20251230,"五洋建設",1893,"建設業",4.5399999999999998E-4,"TOPIX Mid400","1893",{"$f":"IFERROR(_xlfn.IFS(F53=$K$4,\"T500\",F53=$K$5,\"T500\",F53=$K$6,\"T500\"),\"\")","v":"T500"}]
[20251230,"世紀東急工業",1898,"建設業",5.3000000000000001E-5,"TOPIX Small 1","1898",{"$f":"IFERROR(_xlfn.IFS(F54=$K$4,\"T500\",F54=$K$5,\"T500\",F54=$K$6,\"T500\"),\"\")","v":""}]
[20251230,"福田組",1899,"建設業",5.1999999999999997E-5,"TOPIX Small 2","1899",{"$f":"IFERROR(_xlfn.IFS(F55=$K$4,\"T500\",F55=$K$5,\"T500\",F55=$K$6,\"T500\"),\"\")","v":""}]
[20251230,"住友林業",1911,"建設業",8.4599999999999996E-4,"TOPIX Mid400","1911",{"$f":"IFERROR(_xlfn.IFS(F56=$K$4,\"T500\",F56=$K$5,\"T500\",F56=$K$6,\"T500\"),\"\")","v":"T500"}]
[20251230,"大和ハウス工業",1925,"建設業",2.9229999999999998E-3,"TOPIX Large70","1925",{"$f":"IFERROR(_xlfn.IFS(F57=$K$4,\"T500\",F57=$K$5,\"T500\",F57=$K$6,\"T500\"),\"\")","v":"T500"}]
[20251230,"ライト工業",1926,"建設業",1.3100000000000001E-4,"TOPIX Small 1","1926",{"$f":"IFERROR(_xlfn.IFS(F58=$K$4,\"T500\",F58=$K$5,\"T500\",F58=$K$6,\"T500\"),\"\")","v":""}]
[20251230,"積水ハウス",1928,"建設業",2.1570000000000001E-3,"TOPIX Large70","1928",{"$f":"IFERROR(_xlfn.IFS(F59=$K$4,\"T500\",F59=$K$5,\"T500\",F59=$K$6,\"T500\"),\"\")","v":"T500"}]
[20251230,"日特建設",1929,"建設業",2.5000000000000001E-5,"TOPIX Small 2","1929",{"$f":"IFERROR(_xlfn.IFS(F60=$K$4,\"T500\",F60=$K$5,\"T500\",F60=$K$6,\"T500\"),\"\")","v":""}]
[20251230,"北陸電気工事",1930,"建設業",1.7E-5,"TOPIX Small 2","1930",{"$f":"IFERROR(_xlfn.IFS(F61=$K$4,\"T500\",F61=$K$5,\"T500\",F61=$K$6,\"T500\"),\"\")","v":""}]
[20251230,"ユアテック",1934,"建設業",1.18E-4,"TOPIX Small 1","1934",{"$f":"IFERROR(_xlfn.IFS(F62=$K$4,\"T500\",F62=$K$5,\"T500\",F62=$K$6,\"T500\"),\"\")","v":""}]
[20251230,"日本リーテック",1938,"建設業",3.6000000000000001E-5,"TOPIX Small 2","1938",{"$f":"IFERROR(_xlfn.IFS(F63=$K$4,\"T500\",F63=$K$5,\"T500\",F63=$K$6,\"T500\"),\"\")","v":""}]
[20251230,"四電工",1939,"建設業",4.0000000000000003E-5,"TOPIX Small 2","1939",{"$f":"IFERROR(_xlfn.IFS(F64=$K$4,\"T500\",F64=$K$5,\"T500\",F64=$K$6,\"T500\"),\"\")","v":""}]
[20251230,"中電工",1941,"建設業",1.22E-4,"TOPIX Small 1","1941",{"$f":"IFERROR(_xlfn.IFS(F65=$K$4,\"T500\",F65=$K$5,\"T500\",F65=$K$6,\"T500\"),\"\")","v":""}]
[20251230,"関電工",1942,"建設業",5.5999999999999995E-4,"TOPIX Mid400","1942",{"$f":"IFERROR(_xlfn.IFS(F66=$K$4,\"T500\",F66=$K$5,\"T500\",F66=$K$6,\"T500\"),\"\")","v":"T500"}]
[20251230,"きんでん",1944,"建設業",9.4700000000000003E-4,"TOPIX Mid400",{"$f":"TEXT(C67,0)","v":"1944"},{"$f":"IFERROR(_xlfn.IFS(F67=$K$4,\"T500\",F67=$K$5,\"T500\",F67=$K$6,\"T500\"),\"\")","v":"T500"}]
[20251230,"東京エネシス",1945,"建設業",3.4999999999999997E-5,"TOPIX Small 2","1945",{"$f":"IFERROR(_xlfn.IFS(F68=$K$4,\"T500\",F68=$K$5,\"T500\",F68=$K$6,\"T500\"),\"\")","v":""}]
[20251230,"トーエネック",1946,"建設業",7.6000000000000004E-5,"TOPIX Small 2","1946",{"$f":"IFERROR(_xlfn.IFS(F69=$K$4,\"T500\",F69=$K$5,\"T500\",F69=$K$6,\"T500\"),\"\")","v":""}]
[20251230,"住友電設",1949,"建設業",5.3000000000000001E-5,"TOPIX Small 1","1949",{"$f":"IFERROR(_xlfn.IFS(F70=$K$4,\"T500\",F70=$K$5,\"T500\",F70=$K$6,\"T500\"),\"\")","v":""}]
[20251230,"日本電設工業",1950,"建設業",1.26E-4,"TOPIX Small 1","1950",{"$f":"IFERROR(_xlfn.IFS(F71=$K$4,\"T500\",F71=$K$5,\"T500\",F71=$K$6,\"T500\"),\"\")","v":""}]
[20251230,"エクシオグループ",1951,"建設業",5.04E-4,"TOPIX Mid400","1951",{"$f":"IFERROR(_xlfn.IFS(F72=$K$4,\"T500\",F72=$K$5,\"T500\",F72=$K$6,\"T500\"),\"\")","v":"T500"}]
[20251230,"新日本空調",1952,"建設業",8.2999999999999998E-5,"TOPIX Small 1","1952",{"$f":"IFERROR(_xlfn.IFS(F73=$K$4,\"T500\",F73=$K$5,\"T500\",F73=$K$6,\"T500\"),\"\")","v":""}]
[20251230,"クラフティア",1959,"建設業",3.3799999999999998E-4,"TOPIX Mid400","1959",{"$f":"IFERROR(_xlfn.IFS(F74=$K$4,\"T500\",F74=$K$5,\"T500\",F74=$K$6,\"T500\"),\"\")","v":"T500"}]
[20251230,"三機工業",1961,"建設業",2.3900000000000001E-4,"TOPIX Small 1","1961",{"$f":"IFERROR(_xlfn.IFS(F75=$K$4,\"T500\",F75=$K$5,\"T500\",F75=$K$6,\"T500\"),\"\")","v":""}]
[20251230,"日揮ホールディングス",1963,"建設業",4.2099999999999999E-4,"TOPIX Mid400","1963",{"$f":"IFERROR(_xlfn.IFS(F76=$K$4,\"T500\",F76=$K$5,\"T500\",F76=$K$6,\"T500\"),\"\")","v":"T500"}]
[20251230,"中外炉工業",1964,"建設業",2.4000000000000001E-5,"TOPIX Small 2","1964",{"$f":"IFERROR(_xlfn.IFS(F77=$K$4,\"T500\",F77=$K$5,\"T500\",F77=$K$6,\"T500\"),\"\")","v":""}]
[20251230,"太平電業",1968,"建設業",8.7000000000000001E-5,"TOPIX Small 1","1968",{"$f":"IFERROR(_xlfn.IFS(F78=$K$4,\"T500\",F78=$K$5,\"T500\",F78=$K$6,\"T500\"),\"\")","v":""}]
[20251230,"高砂熱学工業",1969,"建設業",4.8299999999999998E-4,"TOPIX Mid400","1969",{"$f":"IFERROR(_xlfn.IFS(F79=$K$4,\"T500\",F79=$K$5,\"T500\",F79=$K$6,\"T500\"),\"\")","v":"T500"}]
[20251230,"朝日工業社",1975,"建設業",7.2999999999999999E-5,"TOPIX Small 1","1975",{"$f":"IFERROR(_xlfn.IFS(F80=$K$4,\"T500\",F80=$K$5,\"T500\",F80=$K$6,\"T500\"),\"\")","v":""}]
[20251230,"明星工業",1976,"建設業",5.8E-5,"TOPIX Small 2","1976",{"$f":"IFERROR(_xlfn.IFS(F81=$K$4,\"T500\",F81=$K$5,\"T500\",F81=$K$6,\"T500\"),\"\")","v":""}]
[20251230,"大氣社",1979,"建設業",1.7200000000000001E-4,"TOPIX Small 1","1979",{"$f":"IFERROR(_xlfn.IFS(F82=$K$4,\"T500\",F82=$K$5,\"T500\",F82=$K$6,\"T500\"),\"\")","v":""}]
[20251230,"ダイダン",1980,"建設業",2.9100000000000003E-4,"TOPIX Small 1","1980",{"$f":"IFERROR(_xlfn.IFS(F83=$K$4,\"T500\",F83=$K$5,\"T500\",F83=$K$6,\"T500\"),\"\")","v":""}]
[20251230,"日比谷総合設備",1982,"建設業",6.9999999999999994E-5,"TOPIX Small 2","1982",{"$f":"IFERROR(_xlfn.IFS(F84=$K$4,\"T500\",F84=$K$5,\"T500\",F84=$K$6,\"T500\"),\"\")","v":""}]
[20251230,"ニップン",2001,"食料品",1.7200000000000001E-4,"TOPIX Small 1","2001",{"$f":"IFERROR(_xlfn.IFS(F85=$K$4,\"T500\",F85=$K$5,\"T500\",F85=$K$6,\"T500\"),\"\")","v":""}]
[20251230,"日清製粉グループ本社",2002,"食料品",3.8999999999999999E-4,"TOPIX Mid400","2002",{"$f":"IFERROR(_xlfn.IFS(F86=$K$4,\"T500\",F86=$K$5,\"T500\",F86=$K$6,\"T500\"),\"\")","v":"T500"}]
[20251230,"日東富士製粉",2003,"食料品",2.5999999999999998E-5,"TOPIX Small 2","2003",{"$f":"IFERROR(_xlfn.IFS(F87=$K$4,\"T500\",F87=$K$5,\"T500\",F87=$K$6,\"T500\"),\"\")","v":""}]
[20251230,"昭和産業",2004,"食料品",5.1999999999999997E-5,"TOPIX Small 2","2004",{"$f":"IFERROR(_xlfn.IFS(F88=$K$4,\"T500\",F88=$K$5,\"T500\",F88=$K$6,\"T500\"),\"\")","v":""}]
[20251230,"中部飼料",2053,"食料品",4.5000000000000003E-5,"TOPIX Small 2","2053",{"$f":"IFERROR(_xlfn.IFS(F89=$K$4,\"T500\",F89=$K$5,\"T500\",F89=$K$6,\"T500\"),\"\")","v":""}]
[20251230,"フィード・ワン",2060,"食料品",2.8E-5,"TOPIX Small 2","2060",{"$f":"IFERROR(_xlfn.IFS(F90=$K$4,\"T500\",F90=$K$5,\"T500\",F90=$K$6,\"T500\"),\"\")","v":""}]
[20251230,"日本甜菜製糖",2108,"食料品",3.4E-5,"TOPIX Small 2","2108",{"$f":"IFERROR(_xlfn.IFS(F91=$K$4,\"T500\",F91=$K$5,\"T500\",F91=$K$6,\"T500\"),\"\")","v":""}]
[20251230,"ＤＭ三井製糖",2109,"食料品",5.7000000000000003E-5,"TOPIX Small 1","2109",{"$f":"IFERROR(_xlfn.IFS(F92=$K$4,\"T500\",F92=$K$5,\"T500\",F92=$K$6,\"T500\"),\"\")","v":""}]
[20251230,"ウェルネオシュガー",2117,"食料品",3.1999999999999999E-5,"TOPIX Small 2","2117",{"$f":"IFERROR(_xlfn.IFS(F93=$K$4,\"T500\",F93=$K$5,\"T500\",F93=$K$6,\"T500\"),\"\")","v":""}]
[20251230,"ＬＩＦＵＬＬ",2120,"サービス業",1.1E-5,"TOPIX Small 2","2120",{"$f":"IFERROR(_xlfn.IFS(F94=$K$4,\"T500\",F94=$K$5,\"T500\",F94=$K$6,\"T500\"),\"\")","v":""}]
[20251230,"ＭＩＸＩ",2121,"情報・通信業",1.06E-4,"TOPIX Small 1","2121",{"$f":"IFERROR(_xlfn.IFS(F95=$K$4,\"T500\",F95=$K$5,\"T500\",F95=$K$6,\"T500\"),\"\")","v":""}]
[20251230,"ジェイエイシーリクルートメント",2124,"サービス業",8.2000000000000001E-5,"TOPIX Small 1","2124",{"$f":"IFERROR(_xlfn.IFS(F96=$K$4,\"T500\",F96=$K$5,\"T500\",F96=$K$6,\"T500\"),\"\")","v":""}]
[20251230,"日本Ｍ＆Ａセンターホールディングス",2127,"サービス業",2.4499999999999999E-4,"TOPIX Mid400","2127",{"$f":"IFERROR(_xlfn.IFS(F97=$K$4,\"T500\",F97=$K$5,\"T500\",F97=$K$6,\"T500\"),\"\")","v":"T500"}]
[20251230,"フィットイージー","212A","サービス業",1.2999999999999999E-5,"TOPIX Small 2","212A",{"$f":"IFERROR(_xlfn.IFS(F98=$K$4,\"T500\",F98=$K$5,\"T500\",F98=$K$6,\"T500\"),\"\")","v":""}]
[20251230,"メンバーズ",2130,"サービス業",9.0000000000000002E-6,"TOPIX Small 2","2130",{"$f":"IFERROR(_xlfn.IFS(F99=$K$4,\"T500\",F99=$K$5,\"T500\",F99=$K$6,\"T500\"),\"\")","v":""}]
[20251230,"ＵＴグループ",2146,"サービス業",8.2999999999999998E-5,"TOPIX Small 1","2146",{"$f":"IFERROR(_xlfn.IFS(F100=$K$4,\"T500\",F100=$K$5,\"T500\",F100=$K$6,\"T500\"),\"\")","v":""}]
[20251230,"アイティメディア",2148,"サービス業",1.8E-5,"TOPIX Small 2","2148",{"$f":"IFERROR(_xlfn.IFS(F101=$K$4,\"T500\",F101=$K$5,\"T500\",F101=$K$6,\"T500\"),\"\")","v":""}]
[20251230,"Ｅ・Ｊホールディングス",2153,"サービス業",2.5000000000000001E-5,"TOPIX Small 2","2153",{"$f":"IFERROR(_xlfn.IFS(F102=$K$4,\"T500\",F102=$K$5,\"T500\",F102=$K$6,\"T500\"),\"\")","v":""}]
[20251230,"オープンアップグループ",2154,"サービス業",1.3100000000000001E-4,"TOPIX Small 1","2154",{"$f":"IFERROR(_xlfn.IFS(F103=$K$4,\"T500\",F103=$K$5,\"T500\",F103=$K$6,\"T500\"),\"\")","v":""}]
[20251230,"コシダカホールディングス",2157,"サービス業",7.2000000000000002E-5,"TOPIX Small 1","2157",{"$f":"IFERROR(_xlfn.IFS(F104=$K$4,\"T500\",F104=$K$5,\"T500\",F104=$K$6,\"T500\"),\"\")","v":""}]
[20251230,"パソナグループ",2168,"サービス業",5.0000000000000002E-5,"TOPIX Small 1","2168",{"$f":"IFERROR(_xlfn.IFS(F105=$K$4,\"T500\",F105=$K$5,\"T500\",F105=$K$6,\"T500\"),\"\")","v":""}]
[20251230,"リンクアンドモチベーション",2170,"サービス業",2.5999999999999998E-5,"TOPIX Small 2","2170",{"$f":"IFERROR(_xlfn.IFS(F106=$K$4,\"T500\",F106=$K$5,\"T500\",F106=$K$6,\"T500\"),\"\")","v":""}]
[20251230,"エス・エム・エス",2175,"サービス業",1.1E-4,"TOPIX Small 1","2175",{"$f":"IFERROR(_xlfn.IFS(F107=$K$4,\"T500\",F107=$K$5,\"T500\",F107=$K$6,\"T500\"),\"\")","v":""}]
[20251230,"パーソルホールディングス",2181,"サービス業",5.6400000000000005E-4,"TOPIX Mid400","2181",{"$f":"IFERROR(_xlfn.IFS(F108=$K$4,\"T500\",F108=$K$5,\"T500\",F108=$K$6,\"T500\"),\"\")","v":"T500"}]
[20251230,"クックパッド",2193,"サービス業",6.0000000000000002E-6,"TOPIX Small 2","2193",{"$f":"IFERROR(_xlfn.IFS(F109=$K$4,\"T500\",F109=$K$5,\"T500\",F109=$K$6,\"T500\"),\"\")","v":""}]
[20251230,"森永製菓",2201,"食料品",2.13E-4,"TOPIX Mid400","2201",{"$f":"IFERROR(_xlfn.IFS(F110=$K$4,\"T500\",F110=$K$5,\"T500\",F110=$K$6,\"T500\"),\"\")","v":"T500"}]
[20251230,"中村屋",2204,"食料品",1.5999999999999999E-5,"TOPIX Small 2","2204",{"$f":"IFERROR(_xlfn.IFS(F111=$K$4,\"T500\",F111=$K$5,\"T500\",F111=$K$6,\"T500\"),\"\")","v":""}]
[20251230,"江崎グリコ",2206,"食料品",3.1599999999999998E-4,"TOPIX Mid400","2206",{"$f":"IFERROR(_xlfn.IFS(F112=$K$4,\"T500\",F112=$K$5,\"T500\",F112=$K$6,\"T500\"),\"\")","v":"T500"}]
[20251230,"ｍｅｉｔｏ",2207,"食料品",2.1999999999999999E-5,"TOPIX Small 2","2207",{"$f":"IFERROR(_xlfn.IFS(F113=$K$4,\"T500\",F113=$K$5,\"T500\",F113=$K$6,\"T500\"),\"\")","v":""}]
[20251230,"井村屋グループ",2209,"食料品",2.9E-5,"TOPIX Small 2","2209",{"$f":"IFERROR(_xlfn.IFS(F114=$K$4,\"T500\",F114=$K$5,\"T500\",F114=$K$6,\"T500\"),\"\")","v":""}]
[20251230,"不二家",2211,"食料品",3.4999999999999997E-5,"TOPIX Small 2","2211",{"$f":"IFERROR(_xlfn.IFS(F115=$K$4,\"T500\",F115=$K$5,\"T500\",F115=$K$6,\"T500\"),\"\")","v":""}]
[20251230,"山崎製パン",2212,"食料品",4.4999999999999999E-4,"TOPIX Mid400","2212",{"$f":"IFERROR(_xlfn.IFS(F116=$K$4,\"T500\",F116=$K$5,\"T500\",F116=$K$6,\"T500\"),\"\")","v":"T500"}]
[20251230,"モロゾフ",2217,"食料品",3.0000000000000001E-5,"TOPIX Small 2","2217",{"$f":"IFERROR(_xlfn.IFS(F117=$K$4,\"T500\",F117=$K$5,\"T500\",F117=$K$6,\"T500\"),\"\")","v":""}]
[20251230,"亀田製菓",2220,"食料品",5.1E-5,"TOPIX Small 1","2220",{"$f":"IFERROR(_xlfn.IFS(F118=$K$4,\"T500\",F118=$K$5,\"T500\",F118=$K$6,\"T500\"),\"\")","v":""}]
[20251230,"寿スピリッツ",2222,"食料品",1.9900000000000001E-4,"TOPIX Mid400","2222",{"$f":"IFERROR(_xlfn.IFS(F119=$K$4,\"T500\",F119=$K$5,\"T500\",F119=$K$6,\"T500\"),\"\")","v":"T500"}]
[20251230,"カルビー",2229,"食料品",2.7900000000000001E-4,"TOPIX Mid400","2229",{"$f":"IFERROR(_xlfn.IFS(F120=$K$4,\"T500\",F120=$K$5,\"T500\",F120=$K$6,\"T500\"),\"\")","v":"T500"}]
[20251230,"森永乳業",2264,"食料品",2.8299999999999999E-4,"TOPIX Mid400","2264",{"$f":"IFERROR(_xlfn.IFS(F121=$K$4,\"T500\",F121=$K$5,\"T500\",F121=$K$6,\"T500\"),\"\")","v":"T500"}]
[20251230,"六甲バター",2266,"食料品",2.0000000000000002E-5,"TOPIX Small 2","2266",{"$f":"IFERROR(_xlfn.IFS(F122=$K$4,\"T500\",F122=$K$5,\"T500\",F122=$K$6,\"T500\"),\"\")","v":""}]
[20251230,"ヤクルト本社",2267,"食料品",6.9300000000000004E-4,"TOPIX Mid400","2267",{"$f":"IFERROR(_xlfn.IFS(F123=$K$4,\"T500\",F123=$K$5,\"T500\",F123=$K$6,\"T500\"),\"\")","v":"T500"}]
[20251230,"明治ホールディングス",2269,"食料品",9.9099999999999991E-4,"TOPIX Mid400","2269",{"$f":"IFERROR(_xlfn.IFS(F124=$K$4,\"T500\",F124=$K$5,\"T500\",F124=$K$6,\"T500\"),\"\")","v":"T500"}]
[20251230,"雪印メグミルク",2270,"食料品",1.7699999999999999E-4,"TOPIX Small 1","2270",{"$f":"IFERROR(_xlfn.IFS(F125=$K$4,\"T500\",F125=$K$5,\"T500\",F125=$K$6,\"T500\"),\"\")","v":""}]
[20251230,"プリマハム",2281,"食料品",7.2999999999999999E-5,"TOPIX Small 1","2281",{"$f":"IFERROR(_xlfn.IFS(F126=$K$4,\"T500\",F126=$K$5,\"T500\",F126=$K$6,\"T500\"),\"\")","v":""}]
[20251230,"日本ハム",2282,"食料品",5.04E-4,"TOPIX Mid400","2282",{"$f":"IFERROR(_xlfn.IFS(F127=$K$4,\"T500\",F127=$K$5,\"T500\",F127=$K$6,\"T500\"),\"\")","v":"T500"}]
[20251230,"丸大食品",2288,"食料品",4.5000000000000003E-5,"TOPIX Small 2","2288",{"$f":"IFERROR(_xlfn.IFS(F128=$K$4,\"T500\",F128=$K$5,\"T500\",F128=$K$6,\"T500\"),\"\")","v":""}]
[20251230,"Ｓ　Ｆｏｏｄｓ",2292,"食料品",6.0999999999999999E-5,"TOPIX Small 1","2292",{"$f":"IFERROR(_xlfn.IFS(F129=$K$4,\"T500\",F129=$K$5,\"T500\",F129=$K$6,\"T500\"),\"\")","v":""}]
[20251230,"柿安本店",2294,"食料品",2.3E-5,"TOPIX Small 2","2294",{"$f":"IFERROR(_xlfn.IFS(F130=$K$4,\"T500\",F130=$K$5,\"T500\",F130=$K$6,\"T500\"),\"\")","v":""}]
[20251230,"伊藤ハム米久ホールディングス",2296,"食料品",2.0000000000000001E-4,"TOPIX Small 1",{"$f":"TEXT(C131,0)","v":"2296"},{"$f":"IFERROR(_xlfn.IFS(F131=$K$4,\"T500\",F131=$K$5,\"T500\",F131=$K$6,\"T500\"),\"\")","v":""}]
[20251230,"学情",2301,"サービス業",1.7E-5,"TOPIX Small 2","2301",{"$f":"IFERROR(_xlfn.IFS(F132=$K$4,\"T500\",F132=$K$5,\"T500\",F132=$K$6,\"T500\"),\"\")","v":""}]
[20251230,"スタジオアリス",2305,"サービス業",2.0999999999999999E-5,"TOPIX Small 2","2305",{"$f":"IFERROR(_xlfn.IFS(F133=$K$4,\"T500\",F133=$K$5,\"T500\",F133=$K$6,\"T500\"),\"\")","v":""}]
[20251230,"クロスキャット",2307,"情報・通信業",1.2999999999999999E-5,"TOPIX Small 2","2307",{"$f":"IFERROR(_xlfn.IFS(F134=$K$4,\"T500\",F134=$K$5,\"T500\",F134=$K$6,\"T500\"),\"\")","v":""}]
[20251230,"システナ",2317,"情報・通信業",1.5300000000000001E-4,"TOPIX Small 1","2317",{"$f":"IFERROR(_xlfn.IFS(F135=$K$4,\"T500\",F135=$K$5,\"T500\",F135=$K$6,\"T500\"),\"\")","v":""}]
[20251230,"ＮＪＳ",2325,"サービス業",2.4000000000000001E-5,"TOPIX Small 2","2325",{"$f":"IFERROR(_xlfn.IFS(F136=$K$4,\"T500\",F136=$K$5,\"T500\",F136=$K$6,\"T500\"),\"\")","v":""}]
[20251230,"デジタルアーツ",2326,"情報・通信業",6.7999999999999999E-5,"TOPIX Small 1","2326",{"$f":"IFERROR(_xlfn.IFS(F137=$K$4,\"T500\",F137=$K$5,\"T500\",F137=$K$6,\"T500\"),\"\")","v":""}]
[20251230,"日鉄ソリューションズ",2327,"情報・通信業",2.5099999999999998E-4,"TOPIX Mid400","2327",{"$f":"IFERROR(_xlfn.IFS(F138=$K$4,\"T500\",F138=$K$5,\"T500\",F138=$K$6,\"T500\"),\"\")","v":"T500"}]
[20251230,"ＡＬＳＯＫ",2331,"サービス業",4.3800000000000002E-4,"TOPIX Mid400","2331",{"$f":"IFERROR(_xlfn.IFS(F139=$K$4,\"T500\",F139=$K$5,\"T500\",F139=$K$6,\"T500\"),\"\")","v":"T500"}]
[20251230,"キューブシステム",2335,"情報・通信業",1.4E-5,"TOPIX Small 2","2335",{"$f":"IFERROR(_xlfn.IFS(F140=$K$4,\"T500\",F140=$K$5,\"T500\",F140=$K$6,\"T500\"),\"\")","v":""}]
[20251230,"いちご",2337,"不動産業",7.6000000000000004E-5,"TOPIX Small 1","2337",{"$f":"IFERROR(_xlfn.IFS(F141=$K$4,\"T500\",F141=$K$5,\"T500\",F141=$K$6,\"T500\"),\"\")","v":""}]
[20251230,"日本駐車場開発",2353,"不動産業",6.3E-5,"TOPIX Small 1","2353",{"$f":"IFERROR(_xlfn.IFS(F142=$K$4,\"T500\",F142=$K$5,\"T500\",F142=$K$6,\"T500\"),\"\")","v":""}]
[20251230,"コア",2359,"情報・通信業",1.9000000000000001E-5,"TOPIX Small 2","2359",{"$f":"IFERROR(_xlfn.IFS(F143=$K$4,\"T500\",F143=$K$5,\"T500\",F143=$K$6,\"T500\"),\"\")","v":""}]
[20251230,"カカクコム",2371,"サービス業",3.2000000000000003E-4,"TOPIX Mid400","2371",{"$f":"IFERROR(_xlfn.IFS(F144=$K$4,\"T500\",F144=$K$5,\"T500\",F144=$K$6,\"T500\"),\"\")","v":"T500"}]
[20251230,"セントケア・ホールディング",2374,"サービス業",1.9000000000000001E-5,"TOPIX Small 2","2374",{"$f":"IFERROR(_xlfn.IFS(F145=$K$4,\"T500\",F145=$K$5,\"T500\",F145=$K$6,\"T500\"),\"\")","v":""}]
[20251230,"ルネサンス",2378,"サービス業",1.8E-5,"TOPIX Small 2","2378",{"$f":"IFERROR(_xlfn.IFS(F146=$K$4,\"T500\",F146=$K$5,\"T500\",F146=$K$6,\"T500\"),\"\")","v":""}]
[20251230,"ディップ",2379,"サービス業",8.2000000000000001E-5,"TOPIX Small 1","2379",{"$f":"IFERROR(_xlfn.IFS(F147=$K$4,\"T500\",F147=$K$5,\"T500\",F147=$K$6,\"T500\"),\"\")","v":""}]
[20251230,"ＳＢＳホールディングス",2384,"陸運業",6.9999999999999994E-5,"TOPIX Small 1","2384",{"$f":"IFERROR(_xlfn.IFS(F148=$K$4,\"T500\",F148=$K$5,\"T500\",F148=$K$6,\"T500\"),\"\")","v":""}]
[20251230,"デジタルホールディングス",2389,"サービス業",2.3E-5,"TOPIX Small 2","2389",{"$f":"IFERROR(_xlfn.IFS(F149=$K$4,\"T500\",F149=$K$5,\"T500\",F149=$K$6,\"T500\"),\"\")","v":""}]
[20251230,"新日本科学",2395,"サービス業",3.8000000000000002E-5,"TOPIX Small 2","2395",{"$f":"IFERROR(_xlfn.IFS(F150=$K$4,\"T500\",F150=$K$5,\"T500\",F150=$K$6,\"T500\"),\"\")","v":""}]
[20251230,"エムスリー",2413,"サービス業",8.8999999999999995E-4,"TOPIX Mid400","2413",{"$f":"IFERROR(_xlfn.IFS(F151=$K$4,\"T500\",F151=$K$5,\"T500\",F151=$K$6,\"T500\"),\"\")","v":"T500"}]
[20251230,"ワールドホールディングス",2429,"サービス業",2.5000000000000001E-5,"TOPIX Small 2","2429",{"$f":"IFERROR(_xlfn.IFS(F152=$K$4,\"T500\",F152=$K$5,\"T500\",F152=$K$6,\"T500\"),\"\")","v":""}]
[20251230,"ディー・エヌ・エー",2432,"情報・通信業",2.1599999999999999E-4,"TOPIX Mid400","2432",{"$f":"IFERROR(_xlfn.IFS(F153=$K$4,\"T500\",F153=$K$5,\"T500\",F153=$K$6,\"T500\"),\"\")","v":"T500"}]
[20251230,"博報堂ＤＹホールディングス",2433,"サービス業",3.1700000000000001E-4,"TOPIX Mid400","2433",{"$f":"IFERROR(_xlfn.IFS(F154=$K$4,\"T500\",F154=$K$5,\"T500\",F154=$K$6,\"T500\"),\"\")","v":"T500"}]
[20251230,"ぐるなび",2440,"サービス業",6.0000000000000002E-6,"TOPIX Small 2","2440",{"$f":"IFERROR(_xlfn.IFS(F155=$K$4,\"T500\",F155=$K$5,\"T500\",F155=$K$6,\"T500\"),\"\")","v":""}]
[20251230,"タカミヤ",2445,"サービス業",1.2E-5,"TOPIX Small 2","2445",{"$f":"IFERROR(_xlfn.IFS(F156=$K$4,\"T500\",F156=$K$5,\"T500\",F156=$K$6,\"T500\"),\"\")","v":""}]
[20251230,"ファンコミュニケーションズ",2461,"サービス業",1.5999999999999999E-5,"TOPIX Small 2","2461",{"$f":"IFERROR(_xlfn.IFS(F157=$K$4,\"T500\",F157=$K$5,\"T500\",F157=$K$6,\"T500\"),\"\")","v":""}]
[20251230,"ライク",2462,"サービス業",1.7E-5,"TOPIX Small 2","2462",{"$f":"IFERROR(_xlfn.IFS(F158=$K$4,\"T500\",F158=$K$5,\"T500\",F158=$K$6,\"T500\"),\"\")","v":""}]
[20251230,"エスプール",2471,"サービス業",1.5E-5,"TOPIX Small 2","2471",{"$f":"IFERROR(_xlfn.IFS(F159=$K$4,\"T500\",F159=$K$5,\"T500\",F159=$K$6,\"T500\"),\"\")","v":""}]
[20251230,"ＷＤＢホールディングス",2475,"サービス業",1.5E-5,"TOPIX Small 2","2475",{"$f":"IFERROR(_xlfn.IFS(F160=$K$4,\"T500\",F160=$K$5,\"T500\",F160=$K$6,\"T500\"),\"\")","v":""}]
[20251230,"手間いらず",2477,"情報・通信業",9.0000000000000002E-6,"TOPIX Small 2","2477",{"$f":"IFERROR(_xlfn.IFS(F161=$K$4,\"T500\",F161=$K$5,\"T500\",F161=$K$6,\"T500\"),\"\")","v":""}]
[20251230,"アドウェイズ",2489,"サービス業",6.0000000000000002E-6,"TOPIX Small 2","2489",{"$f":"IFERROR(_xlfn.IFS(F162=$K$4,\"T500\",F162=$K$5,\"T500\",F162=$K$6,\"T500\"),\"\")","v":""}]
[20251230,"バリューコマース",2491,"サービス業",1.2E-5,"TOPIX Small 2","2491",{"$f":"IFERROR(_xlfn.IFS(F163=$K$4,\"T500\",F163=$K$5,\"T500\",F163=$K$6,\"T500\"),\"\")","v":""}]
[20251230,"インフォマート",2492,"サービス業",8.5000000000000006E-5,"TOPIX Small 1","2492",{"$f":"IFERROR(_xlfn.IFS(F164=$K$4,\"T500\",F164=$K$5,\"T500\",F164=$K$6,\"T500\"),\"\")","v":""}]
[20251230,"サッポロホールディングス",2501,"食料品",5.1500000000000005E-4,"TOPIX Mid400","2501",{"$f":"IFERROR(_xlfn.IFS(F165=$K$4,\"T500\",F165=$K$5,\"T500\",F165=$K$6,\"T500\"),\"\")","v":"T500"}]
[20251230,"アサヒグループホールディングス",2502,"食料品",2.5119999999999999E-3,"TOPIX Large70","2502",{"$f":"IFERROR(_xlfn.IFS(F166=$K$4,\"T500\",F166=$K$5,\"T500\",F166=$K$6,\"T500\"),\"\")","v":"T500"}]
[20251230,"キリンホールディングス",2503,"食料品",1.9959999999999999E-3,"TOPIX Large70","2503",{"$f":"IFERROR(_xlfn.IFS(F167=$K$4,\"T500\",F167=$K$5,\"T500\",F167=$K$6,\"T500\"),\"\")","v":"T500"}]
[20251230,"シマダヤ","250A","食料品",1.7E-5,"TOPIX Small 2","250A",{"$f":"IFERROR(_xlfn.IFS(F168=$K$4,\"T500\",F168=$K$5,\"T500\",F168=$K$6,\"T500\"),\"\")","v":""}]
[20251230,"宝ホールディングス",2531,"食料品",2.7E-4,"TOPIX Mid400","2531",{"$f":"IFERROR(_xlfn.IFS(F169=$K$4,\"T500\",F169=$K$5,\"T500\",F169=$K$6,\"T500\"),\"\")","v":"T500"}]
[20251230,"オエノンホールディングス",2533,"食料品",3.1000000000000001E-5,"TOPIX Small 2","2533",{"$f":"IFERROR(_xlfn.IFS(F170=$K$4,\"T500\",F170=$K$5,\"T500\",F170=$K$6,\"T500\"),\"\")","v":""}]
[20251230,"養命酒製造",2540,"食料品",3.6999999999999998E-5,"TOPIX Small 2","2540",{"$f":"IFERROR(_xlfn.IFS(F171=$K$4,\"T500\",F171=$K$5,\"T500\",F171=$K$6,\"T500\"),\"\")","v":""}]
[20251230,"飛島ホールディングス","256A","建設業",4.8999999999999998E-5,"TOPIX Small 2","256A",{"$f":"IFERROR(_xlfn.IFS(F172=$K$4,\"T500\",F172=$K$5,\"T500\",F172=$K$6,\"T500\"),\"\")","v":""}]
[20251230,"コカ・コーラ　ボトラーズジャパンホールディングス",2579,"食料品",4.2099999999999999E-4,"TOPIX Mid400","2579",{"$f":"IFERROR(_xlfn.IFS(F173=$K$4,\"T500\",F173=$K$5,\"T500\",F173=$K$6,\"T500\"),\"\")","v":"T500"}]
[20251230,"ライフドリンク　カンパニー",2585,"食料品",6.3E-5,"TOPIX Small 1","2585",{"$f":"IFERROR(_xlfn.IFS(F174=$K$4,\"T500\",F174=$K$5,\"T500\",F174=$K$6,\"T500\"),\"\")","v":""}]
[20251230,"サントリー食品インターナショナル",2587,"食料品",6.7900000000000002E-4,"TOPIX Mid400","2587",{"$f":"IFERROR(_xlfn.IFS(F175=$K$4,\"T500\",F175=$K$5,\"T500\",F175=$K$6,\"T500\"),\"\")","v":"T500"}]
[20251230,"ダイドーグループホールディングス",2590,"食料品",5.8999999999999998E-5,"TOPIX Small 1","2590",{"$f":"IFERROR(_xlfn.IFS(F176=$K$4,\"T500\",F176=$K$5,\"T500\",F176=$K$6,\"T500\"),\"\")","v":""}]
[20251230,"伊藤園",2593,"食料品",2.03E-4,"TOPIX Mid400","2593",{"$f":"IFERROR(_xlfn.IFS(F177=$K$4,\"T500\",F177=$K$5,\"T500\",F177=$K$6,\"T500\"),\"\")","v":"T500"}]
[20251230,"キーコーヒー",2594,"食料品",4.6E-5,"TOPIX Small 2","2594",{"$f":"IFERROR(_xlfn.IFS(F178=$K$4,\"T500\",F178=$K$5,\"T500\",F178=$K$6,\"T500\"),\"\")","v":""}]
[20251230,"日清オイリオグループ",2602,"食料品",1.5100000000000001E-4,"TOPIX Small 1","2602",{"$f":"IFERROR(_xlfn.IFS(F179=$K$4,\"T500\",F179=$K$5,\"T500\",F179=$K$6,\"T500\"),\"\")","v":""}]
[20251230,"不二製油",2607,"食料品",1.4899999999999999E-4,"TOPIX Mid400","2607",{"$f":"IFERROR(_xlfn.IFS(F180=$K$4,\"T500\",F180=$K$5,\"T500\",F180=$K$6,\"T500\"),\"\")","v":"T500"}]
[20251230,"Ｊ－オイルミルズ",2613,"食料品",4.6999999999999997E-5,"TOPIX Small 2","2613",{"$f":"IFERROR(_xlfn.IFS(F181=$K$4,\"T500\",F181=$K$5,\"T500\",F181=$K$6,\"T500\"),\"\")","v":""}]
[20251230,"インターメスティック","262A","小売業",1.9000000000000001E-5,"TOPIX Small 2","262A",{"$f":"IFERROR(_xlfn.IFS(F182=$K$4,\"T500\",F182=$K$5,\"T500\",F182=$K$6,\"T500\"),\"\")","v":""}]
[20251230,"サンエー",2659,"小売業",1.1E-4,"TOPIX Small 1","2659",{"$f":"IFERROR(_xlfn.IFS(F183=$K$4,\"T500\",F183=$K$5,\"T500\",F183=$K$6,\"T500\"),\"\")","v":""}]
[20251230,"カワチ薬品",2664,"小売業",5.1E-5,"TOPIX Small 1","2664",{"$f":"IFERROR(_xlfn.IFS(F184=$K$4,\"T500\",F184=$K$5,\"T500\",F184=$K$6,\"T500\"),\"\")","v":""}]
[20251230,"エービーシー・マート",2670,"小売業",3.0600000000000001E-4,"TOPIX Mid400","2670",{"$f":"IFERROR(_xlfn.IFS(F185=$K$4,\"T500\",F185=$K$5,\"T500\",F185=$K$6,\"T500\"),\"\")","v":"T500"}]
[20251230,"ハードオフコーポレーション",2674,"小売業",1.7E-5,"TOPIX Small 2","2674",{"$f":"IFERROR(_xlfn.IFS(F186=$K$4,\"T500\",F186=$K$5,\"T500\",F186=$K$6,\"T500\"),\"\")","v":""}]
[20251230,"高千穂交易",2676,"卸売業",3.6999999999999998E-5,"TOPIX Small 2","2676",{"$f":"IFERROR(_xlfn.IFS(F187=$K$4,\"T500\",F187=$K$5,\"T500\",F187=$K$6,\"T500\"),\"\")","v":""}]
[20251230,"アスクル",2678,"小売業",6.7999999999999999E-5,"TOPIX Small 1","2678",{"$f":"IFERROR(_xlfn.IFS(F188=$K$4,\"T500\",F188=$K$5,\"T500\",F188=$K$6,\"T500\"),\"\")","v":""}]
[20251230,"ゲオホールディングス",2681,"小売業",4.6E-5,"TOPIX Small 1","2681",{"$f":"IFERROR(_xlfn.IFS(F189=$K$4,\"T500\",F189=$K$5,\"T500\",F189=$K$6,\"T500\"),\"\")","v":""}]
[20251230,"アンドエスティＨＤ",2685,"小売業",8.7000000000000001E-5,"TOPIX Small 1","2685",{"$f":"IFERROR(_xlfn.IFS(F190=$K$4,\"T500\",F190=$K$5,\"T500\",F190=$K$6,\"T500\"),\"\")","v":""}]
[20251230,"リガク・ホールディングス","268A","精密機器",1.5300000000000001E-4,"TOPIX Small 1","268A",{"$f":"IFERROR(_xlfn.IFS(F191=$K$4,\"T500\",F191=$K$5,\"T500\",F191=$K$6,\"T500\"),\"\")","v":""}]
[20251230,"伊藤忠食品",2692,"卸売業",5.5000000000000002E-5,"TOPIX Small 2","2692",{"$f":"IFERROR(_xlfn.IFS(F192=$K$4,\"T500\",F192=$K$5,\"T500\",F192=$K$6,\"T500\"),\"\")","v":""}]
[20251230,"くら寿司",2695,"小売業",8.2999999999999998E-5,"TOPIX Small 1","2695",{"$f":"IFERROR(_xlfn.IFS(F193=$K$4,\"T500\",F193=$K$5,\"T500\",F193=$K$6,\"T500\"),\"\")","v":""}]
[20251230,"キャンドゥ",2698,"小売業",2.6999999999999999E-5,"TOPIX Small 2","2698",{"$f":"IFERROR(_xlfn.IFS(F194=$K$4,\"T500\",F194=$K$5,\"T500\",F194=$K$6,\"T500\"),\"\")","v":""}]
[20251230,"パルグループホールディングス",2726,"小売業",1.75E-4,"TOPIX Small 1",{"$f":"TEXT(C195,0)","v":"2726"},{"$f":"IFERROR(_xlfn.IFS(F195=$K$4,\"T500\",F195=$K$5,\"T500\",F195=$K$6,\"T500\"),\"\")","v":""}]
[20251230,"エディオン",2730,"小売業",2.2100000000000001E-4,"TOPIX Small 1","2730",{"$f":"IFERROR(_xlfn.IFS(F196=$K$4,\"T500\",F196=$K$5,\"T500\",F196=$K$6,\"T500\"),\"\")","v":""}]
[20251230,"あらた",2733,"卸売業",1.03E-4,"TOPIX Small 1","2733",{"$f":"IFERROR(_xlfn.IFS(F197=$K$4,\"T500\",F197=$K$5,\"T500\",F197=$K$6,\"T500\"),\"\")","v":""}]
[20251230,"サーラコーポレーション",2734,"小売業",5.1999999999999997E-5,"TOPIX Small 2","2734",{"$f":"IFERROR(_xlfn.IFS(F198=$K$4,\"T500\",F198=$K$5,\"T500\",F198=$K$6,\"T500\"),\"\")","v":""}]
[20251230,"トーメンデバイス",2737,"卸売業",4.1999999999999998E-5,"TOPIX Small 2","2737",{"$f":"IFERROR(_xlfn.IFS(F199=$K$4,\"T500\",F199=$K$5,\"T500\",F199=$K$6,\"T500\"),\"\")","v":""}]
[20251230,"ハローズ",2742,"小売業",4.6E-5,"TOPIX Small 2","2742",{"$f":"IFERROR(_xlfn.IFS(F200=$K$4,\"T500\",F200=$K$5,\"T500\",F200=$K$6,\"T500\"),\"\")","v":""}]
[20251230,"ＪＰホールディングス",2749,"サービス業",3.8999999999999999E-5,"TOPIX Small 1","2749",{"$f":"IFERROR(_xlfn.IFS(F201=$K$4,\"T500\",F201=$K$5,\"T500\",F201=$K$6,\"T500\"),\"\")","v":""}]
[20251230,"フジオフードグループ本社",2752,"小売業",4.1E-5,"TOPIX Small 1","2752",{"$f":"IFERROR(_xlfn.IFS(F202=$K$4,\"T500\",F202=$K$5,\"T500\",F202=$K$6,\"T500\"),\"\")","v":""}]
[20251230,"あみやき亭",2753,"小売業",2.1999999999999999E-5,"TOPIX Small 2","2753",{"$f":"IFERROR(_xlfn.IFS(F203=$K$4,\"T500\",F203=$K$5,\"T500\",F203=$K$6,\"T500\"),\"\")","v":""}]
[20251230,"東京エレクトロン　デバイス",2760,"卸売業",7.3999999999999996E-5,"TOPIX Small 1","2760",{"$f":"IFERROR(_xlfn.IFS(F204=$K$4,\"T500\",F204=$K$5,\"T500\",F204=$K$6,\"T500\"),\"\")","v":""}]
[20251230,"円谷フィールズホールディングス",2767,"卸売業",7.4999999999999993E-5,"TOPIX Small 1","2767",{"$f":"IFERROR(_xlfn.IFS(F205=$K$4,\"T500\",F205=$K$5,\"T500\",F205=$K$6,\"T500\"),\"\")","v":""}]
[20251230,"双日",2768,"卸売業",1.0300000000000001E-3,"TOPIX Mid400","2768",{"$f":"IFERROR(_xlfn.IFS(F206=$K$4,\"T500\",F206=$K$5,\"T500\",F206=$K$6,\"T500\"),\"\")","v":"T500"}]
[20251230,"アルフレッサ　ホールディングス",2784,"卸売業",5.0500000000000002E-4,"TOPIX Mid400","2784",{"$f":"IFERROR(_xlfn.IFS(F207=$K$4,\"T500\",F207=$K$5,\"T500\",F207=$K$6,\"T500\"),\"\")","v":"T500"}]
[20251230,"大黒天物産",2791,"小売業",4.5000000000000003E-5,"TOPIX Small 1","2791",{"$f":"IFERROR(_xlfn.IFS(F208=$K$4,\"T500\",F208=$K$5,\"T500\",F208=$K$6,\"T500\"),\"\")","v":""}]
[20251230,"ハニーズホールディングス",2792,"小売業",3.0000000000000001E-5,"TOPIX Small 2","2792",{"$f":"IFERROR(_xlfn.IFS(F209=$K$4,\"T500\",F209=$K$5,\"T500\",F209=$K$6,\"T500\"),\"\")","v":""}]
[20251230,"キッコーマン",2801,"食料品",9.6199999999999996E-4,"TOPIX Mid400","2801",{"$f":"IFERROR(_xlfn.IFS(F210=$K$4,\"T500\",F210=$K$5,\"T500\",F210=$K$6,\"T500\"),\"\")","v":"T500"}]
[20251230,"味の素",2802,"食料品",3.3609999999999998E-3,"TOPIX Large70","2802",{"$f":"IFERROR(_xlfn.IFS(F211=$K$4,\"T500\",F211=$K$5,\"T500\",F211=$K$6,\"T500\"),\"\")","v":"T500"}]
[20251230,"ブルドックソース",2804,"食料品",1.9000000000000001E-5,"TOPIX Small 2","2804",{"$f":"IFERROR(_xlfn.IFS(F212=$K$4,\"T500\",F212=$K$5,\"T500\",F212=$K$6,\"T500\"),\"\")","v":""}]
[20251230,"キユーピー",2809,"食料品",4.7399999999999997E-4,"TOPIX Mid400","2809",{"$f":"IFERROR(_xlfn.IFS(F213=$K$4,\"T500\",F213=$K$5,\"T500\",F213=$K$6,\"T500\"),\"\")","v":"T500"}]
[20251230,"ハウス食品グループ本社",2810,"食料品",2.2000000000000001E-4,"TOPIX Mid400","2810",{"$f":"IFERROR(_xlfn.IFS(F214=$K$4,\"T500\",F214=$K$5,\"T500\",F214=$K$6,\"T500\"),\"\")","v":"T500"}]
[20251230,"カゴメ",2811,"食料品",2.9399999999999999E-4,"TOPIX Mid400","2811",{"$f":"IFERROR(_xlfn.IFS(F215=$K$4,\"T500\",F215=$K$5,\"T500\",F215=$K$6,\"T500\"),\"\")","v":"T500"}]
[20251230,"アリアケジャパン",2815,"食料品",1.21E-4,"TOPIX Small 1","2815",{"$f":"IFERROR(_xlfn.IFS(F216=$K$4,\"T500\",F216=$K$5,\"T500\",F216=$K$6,\"T500\"),\"\")","v":""}]
[20251230,"エバラ食品工業",2819,"食料品",1.2999999999999999E-5,"TOPIX Small 2","2819",{"$f":"IFERROR(_xlfn.IFS(F217=$K$4,\"T500\",F217=$K$5,\"T500\",F217=$K$6,\"T500\"),\"\")","v":""}]
[20251230,"キオクシアホールディングス","285A","電気機器",1.3140000000000001E-3,"TOPIX Mid400","285A",{"$f":"IFERROR(_xlfn.IFS(F218=$K$4,\"T500\",F218=$K$5,\"T500\",F218=$K$6,\"T500\"),\"\")","v":"T500"}]
[20251230,"ニチレイ",2871,"食料品",3.3399999999999999E-4,"TOPIX Mid400","2871",{"$f":"IFERROR(_xlfn.IFS(F219=$K$4,\"T500\",F219=$K$5,\"T500\",F219=$K$6,\"T500\"),\"\")","v":"T500"}]
[20251230,"横浜冷凍",2874,"卸売業",6.9999999999999994E-5,"TOPIX Small 1","2874",{"$f":"IFERROR(_xlfn.IFS(F220=$K$4,\"T500\",F220=$K$5,\"T500\",F220=$K$6,\"T500\"),\"\")","v":""}]
[20251230,"東洋水産",2875,"食料品",1.016E-3,"TOPIX Mid400","2875",{"$f":"IFERROR(_xlfn.IFS(F221=$K$4,\"T500\",F221=$K$5,\"T500\",F221=$K$6,\"T500\"),\"\")","v":"T500"}]
[20251230,"イートアンドホールディングス",2882,"食料品",2.0000000000000002E-5,"TOPIX Small 2","2882",{"$f":"IFERROR(_xlfn.IFS(F222=$K$4,\"T500\",F222=$K$5,\"T500\",F222=$K$6,\"T500\"),\"\")","v":""}]
[20251230,"ヨシムラ・フード・ホールディングス",2884,"食料品",1.0000000000000001E-5,"TOPIX Small 2","2884",{"$f":"IFERROR(_xlfn.IFS(F223=$K$4,\"T500\",F223=$K$5,\"T500\",F223=$K$6,\"T500\"),\"\")","v":""}]
[20251230,"日清食品ホールディングス",2897,"食料品",6.7100000000000005E-4,"TOPIX Mid400","2897",{"$f":"IFERROR(_xlfn.IFS(F224=$K$4,\"T500\",F224=$K$5,\"T500\",F224=$K$6,\"T500\"),\"\")","v":"T500"}]
[20251230,"フジッコ",2908,"食料品",3.6999999999999998E-5,"TOPIX Small 2","2908",{"$f":"IFERROR(_xlfn.IFS(F225=$K$4,\"T500\",F225=$K$5,\"T500\",F225=$K$6,\"T500\"),\"\")","v":""}]
[20251230,"ロック・フィールド",2910,"食料品",3.1000000000000001E-5,"TOPIX Small 2","2910",{"$f":"IFERROR(_xlfn.IFS(F226=$K$4,\"T500\",F226=$K$5,\"T500\",F226=$K$6,\"T500\"),\"\")","v":""}]
[20251230,"日本たばこ産業",2914,"食料品",6.9940000000000002E-3,"TOPIX Core30","2914",{"$f":"IFERROR(_xlfn.IFS(F227=$K$4,\"T500\",F227=$K$5,\"T500\",F227=$K$6,\"T500\"),\"\")","v":"T500"}]
[20251230,"ケンコーマヨネーズ",2915,"食料品",2.4000000000000001E-5,"TOPIX Small 2","2915",{"$f":"IFERROR(_xlfn.IFS(F228=$K$4,\"T500\",F228=$K$5,\"T500\",F228=$K$6,\"T500\"),\"\")","v":""}]
[20251230,"わらべや日洋ホールディングス",2918,"食料品",4.5000000000000003E-5,"TOPIX Small 1","2918",{"$f":"IFERROR(_xlfn.IFS(F229=$K$4,\"T500\",F229=$K$5,\"T500\",F229=$K$6,\"T500\"),\"\")","v":""}]
[20251230,"なとり",2922,"食料品",2.4000000000000001E-5,"TOPIX Small 2","2922",{"$f":"IFERROR(_xlfn.IFS(F230=$K$4,\"T500\",F230=$K$5,\"T500\",F230=$K$6,\"T500\"),\"\")","v":""}]
[20251230,"ファーマフーズ",2929,"食料品",1.8E-5,"TOPIX Small 2","2929",{"$f":"IFERROR(_xlfn.IFS(F231=$K$4,\"T500\",F231=$K$5,\"T500\",F231=$K$6,\"T500\"),\"\")","v":""}]
[20251230,"北の達人コーポレーション",2930,"化学",1.2E-5,"TOPIX Small 2","2930",{"$f":"IFERROR(_xlfn.IFS(F232=$K$4,\"T500\",F232=$K$5,\"T500\",F232=$K$6,\"T500\"),\"\")","v":""}]
[20251230,"ユーグレナ",2931,"食料品",5.5000000000000002E-5,"TOPIX Small 1","2931",{"$f":"IFERROR(_xlfn.IFS(F233=$K$4,\"T500\",F233=$K$5,\"T500\",F233=$K$6,\"T500\"),\"\")","v":""}]
[20251230,"紀文食品",2933,"食料品",1.9000000000000001E-5,"TOPIX Small 2","2933",{"$f":"IFERROR(_xlfn.IFS(F234=$K$4,\"T500\",F234=$K$5,\"T500\",F234=$K$6,\"T500\"),\"\")","v":""}]
[20251230,"ピックルスホールディングス",2935,"食料品",1.5999999999999999E-5,"TOPIX Small 2","2935",{"$f":"IFERROR(_xlfn.IFS(F235=$K$4,\"T500\",F235=$K$5,\"T500\",F235=$K$6,\"T500\"),\"\")","v":""}]
[20251230,"スター・マイカ・ホールディングス",2975,"不動産業",2.9E-5,"TOPIX Small 2","2975",{"$f":"IFERROR(_xlfn.IFS(F236=$K$4,\"T500\",F236=$K$5,\"T500\",F236=$K$6,\"T500\"),\"\")","v":""}]
[20251230,"ＳＲＥホールディングス",2980,"不動産業",3.4E-5,"TOPIX Small 2","2980",{"$f":"IFERROR(_xlfn.IFS(F237=$K$4,\"T500\",F237=$K$5,\"T500\",F237=$K$6,\"T500\"),\"\")","v":""}]
[20251230,"片倉工業",3001,"繊維製品",6.3E-5,"TOPIX Small 2","3001",{"$f":"IFERROR(_xlfn.IFS(F238=$K$4,\"T500\",F238=$K$5,\"T500\",F238=$K$6,\"T500\"),\"\")","v":""}]
[20251230,"グンゼ",3002,"繊維製品",1.3799999999999999E-4,"TOPIX Small 1","3002",{"$f":"IFERROR(_xlfn.IFS(F239=$K$4,\"T500\",F239=$K$5,\"T500\",F239=$K$6,\"T500\"),\"\")","v":""}]
[20251230,"ヒューリック",3003,"不動産業",1.0200000000000001E-3,"TOPIX Mid400","3003",{"$f":"IFERROR(_xlfn.IFS(F240=$K$4,\"T500\",F240=$K$5,\"T500\",F240=$K$6,\"T500\"),\"\")","v":"T500"}]
[20251230,"ラサ商事",3023,"卸売業",2.0999999999999999E-5,"TOPIX Small 2","3023",{"$f":"IFERROR(_xlfn.IFS(F241=$K$4,\"T500\",F241=$K$5,\"T500\",F241=$K$6,\"T500\"),\"\")","v":""}]
[20251230,"アルペン",3028,"小売業",4.8999999999999998E-5,"TOPIX Small 1","3028",{"$f":"IFERROR(_xlfn.IFS(F242=$K$4,\"T500\",F242=$K$5,\"T500\",F242=$K$6,\"T500\"),\"\")","v":""}]
[20251230,"ラクーンホールディングス",3031,"情報・通信業",1.0000000000000001E-5,"TOPIX Small 2","3031",{"$f":"IFERROR(_xlfn.IFS(F243=$K$4,\"T500\",F243=$K$5,\"T500\",F243=$K$6,\"T500\"),\"\")","v":""}]
[20251230,"クオールホールディングス",3034,"小売業",5.8E-5,"TOPIX Small 1","3034",{"$f":"IFERROR(_xlfn.IFS(F244=$K$4,\"T500\",F244=$K$5,\"T500\",F244=$K$6,\"T500\"),\"\")","v":""}]
[20251230,"アルコニックス",3036,"卸売業",8.5000000000000006E-5,"TOPIX Small 1","3036",{"$f":"IFERROR(_xlfn.IFS(F245=$K$4,\"T500\",F245=$K$5,\"T500\",F245=$K$6,\"T500\"),\"\")","v":""}]
[20251230,"神戸物産",3038,"卸売業",7.2300000000000001E-4,"TOPIX Mid400","3038",{"$f":"IFERROR(_xlfn.IFS(F246=$K$4,\"T500\",F246=$K$5,\"T500\",F246=$K$6,\"T500\"),\"\")","v":"T500"}]
[20251230,"ソリトンシステムズ",3040,"情報・通信業",2.1999999999999999E-5,"TOPIX Small 2","3040",{"$f":"IFERROR(_xlfn.IFS(F247=$K$4,\"T500\",F247=$K$5,\"T500\",F247=$K$6,\"T500\"),\"\")","v":""}]
[20251230,"ジンズホールディングス",3046,"小売業",8.2000000000000001E-5,"TOPIX Small 1","3046",{"$f":"IFERROR(_xlfn.IFS(F248=$K$4,\"T500\",F248=$K$5,\"T500\",F248=$K$6,\"T500\"),\"\")","v":""}]
[20251230,"ビックカメラ",3048,"小売業",1.9599999999999999E-4,"TOPIX Mid400","3048",{"$f":"IFERROR(_xlfn.IFS(F249=$K$4,\"T500\",F249=$K$5,\"T500\",F249=$K$6,\"T500\"),\"\")","v":"T500"}]
[20251230,"ＤＣＭホールディングス",3050,"小売業",1.85E-4,"TOPIX Small 1","3050",{"$f":"IFERROR(_xlfn.IFS(F250=$K$4,\"T500\",F250=$K$5,\"T500\",F250=$K$6,\"T500\"),\"\")","v":""}]
[20251230,"ペッパーフードサービス",3053,"小売業",1.2999999999999999E-5,"TOPIX Small 2","3053",{"$f":"IFERROR(_xlfn.IFS(F251=$K$4,\"T500\",F251=$K$5,\"T500\",F251=$K$6,\"T500\"),\"\")","v":""}]
[20251230,"ＭｏｎｏｔａＲＯ",3064,"小売業",7.7700000000000002E-4,"TOPIX Mid400","3064",{"$f":"IFERROR(_xlfn.IFS(F252=$K$4,\"T500\",F252=$K$5,\"T500\",F252=$K$6,\"T500\"),\"\")","v":"T500"}]
[20251230,"あい　ホールディングス",3076,"卸売業",1.12E-4,"TOPIX Small 1","3076",{"$f":"IFERROR(_xlfn.IFS(F253=$K$4,\"T500\",F253=$K$5,\"T500\",F253=$K$6,\"T500\"),\"\")","v":""}]
[20251230,"Ｊ．フロント　リテイリング",3086,"小売業",5.5199999999999997E-4,"TOPIX Mid400","3086",{"$f":"IFERROR(_xlfn.IFS(F254=$K$4,\"T500\",F254=$K$5,\"T500\",F254=$K$6,\"T500\"),\"\")","v":"T500"}]
[20251230,"ドトール・日レスホールディングス",3087,"小売業",1.01E-4,"TOPIX Small 1","3087",{"$f":"IFERROR(_xlfn.IFS(F255=$K$4,\"T500\",F255=$K$5,\"T500\",F255=$K$6,\"T500\"),\"\")","v":""}]
[20251230,"マツキヨココカラ＆カンパニー",3088,"小売業",1.0349999999999999E-3,"TOPIX Mid400","3088",{"$f":"IFERROR(_xlfn.IFS(F256=$K$4,\"T500\",F256=$K$5,\"T500\",F256=$K$6,\"T500\"),\"\")","v":"T500"}]
[20251230,"ブロンコビリー",3091,"小売業",4.8999999999999998E-5,"TOPIX Small 1","3091",{"$f":"IFERROR(_xlfn.IFS(F257=$K$4,\"T500\",F257=$K$5,\"T500\",F257=$K$6,\"T500\"),\"\")","v":""}]
[20251230,"ＺＯＺＯ",3092,"小売業",4.46E-4,"TOPIX Mid400","3092",{"$f":"IFERROR(_xlfn.IFS(F258=$K$4,\"T500\",F258=$K$5,\"T500\",F258=$K$6,\"T500\"),\"\")","v":"T500"}]
[20251230,"トレジャー・ファクトリー",3093,"小売業",2.5000000000000001E-5,"TOPIX Small 2",{"$f":"TEXT(C259,0)","v":"3093"},{"$f":"IFERROR(_xlfn.IFS(F259=$K$4,\"T500\",F259=$K$5,\"T500\",F259=$K$6,\"T500\"),\"\")","v":""}]
[20251230,"物語コーポレーション",3097,"小売業",1.8799999999999999E-4,"TOPIX Small 1","3097",{"$f":"IFERROR(_xlfn.IFS(F260=$K$4,\"T500\",F260=$K$5,\"T500\",F260=$K$6,\"T500\"),\"\")","v":""}]
[20251230,"三越伊勢丹ホールディングス",3099,"小売業",7.7700000000000002E-4,"TOPIX Mid400","3099",{"$f":"IFERROR(_xlfn.IFS(F261=$K$4,\"T500\",F261=$K$5,\"T500\",F261=$K$6,\"T500\"),\"\")","v":"T500"}]
[20251230,"東洋紡",3101,"化学",1.13E-4,"TOPIX Small 1","3101",{"$f":"IFERROR(_xlfn.IFS(F262=$K$4,\"T500\",F262=$K$5,\"T500\",F262=$K$6,\"T500\"),\"\")","v":""}]
[20251230,"ユニチカ",3103,"繊維製品",2.0999999999999999E-5,"TOPIX Small 2","3103",{"$f":"IFERROR(_xlfn.IFS(F263=$K$4,\"T500\",F263=$K$5,\"T500\",F263=$K$6,\"T500\"),\"\")","v":""}]
[20251230,"富士紡ホールディングス",3104,"繊維製品",8.0000000000000007E-5,"TOPIX Small 2","3104",{"$f":"IFERROR(_xlfn.IFS(F264=$K$4,\"T500\",F264=$K$5,\"T500\",F264=$K$6,\"T500\"),\"\")","v":""}]
[20251230,"日清紡ホールディングス",3105,"電気機器",2.0599999999999999E-4,"TOPIX Mid400","3105",{"$f":"IFERROR(_xlfn.IFS(F265=$K$4,\"T500\",F265=$K$5,\"T500\",F265=$K$6,\"T500\"),\"\")","v":"T500"}]
[20251230,"倉敷紡績",3106,"繊維製品",1.2300000000000001E-4,"TOPIX Small 1","3106",{"$f":"IFERROR(_xlfn.IFS(F266=$K$4,\"T500\",F266=$K$5,\"T500\",F266=$K$6,\"T500\"),\"\")","v":""}]
[20251230,"ダイワボウホールディングス",3107,"卸売業",2.5399999999999999E-4,"TOPIX Mid400","3107",{"$f":"IFERROR(_xlfn.IFS(F267=$K$4,\"T500\",F267=$K$5,\"T500\",F267=$K$6,\"T500\"),\"\")","v":"T500"}]
[20251230,"シキボウ",3109,"繊維製品",1.5E-5,"TOPIX Small 2","3109",{"$f":"IFERROR(_xlfn.IFS(F268=$K$4,\"T500\",F268=$K$5,\"T500\",F268=$K$6,\"T500\"),\"\")","v":""}]
[20251230,"日東紡績",3110,"ガラス・土石製品",2.6800000000000001E-4,"TOPIX Small 1","3110",{"$f":"IFERROR(_xlfn.IFS(F269=$K$4,\"T500\",F269=$K$5,\"T500\",F269=$K$6,\"T500\"),\"\")","v":""}]
[20251230,"トヨタ紡織",3116,"輸送用機器",2.5599999999999999E-4,"TOPIX Mid400","3116",{"$f":"IFERROR(_xlfn.IFS(F270=$K$4,\"T500\",F270=$K$5,\"T500\",F270=$K$6,\"T500\"),\"\")","v":"T500"}]
[20251230,"マクニカホールディングス",3132,"卸売業",3.6499999999999998E-4,"TOPIX Mid400","3132",{"$f":"IFERROR(_xlfn.IFS(F271=$K$4,\"T500\",F271=$K$5,\"T500\",F271=$K$6,\"T500\"),\"\")","v":"T500"}]
[20251230,"Ｈａｍｅｅ",3134,"小売業",5.0000000000000004E-6,"TOPIX Small 2","3134",{"$f":"IFERROR(_xlfn.IFS(F272=$K$4,\"T500\",F272=$K$5,\"T500\",F272=$K$6,\"T500\"),\"\")","v":""}]
[20251230,"ラクト・ジャパン",3139,"卸売業",3.1999999999999999E-5,"TOPIX Small 2","3139",{"$f":"IFERROR(_xlfn.IFS(F273=$K$4,\"T500\",F273=$K$5,\"T500\",F273=$K$6,\"T500\"),\"\")","v":""}]
[20251230,"クリエイトＳＤホールディングス",3148,"小売業",1.0399999999999999E-4,"TOPIX Small 1","3148",{"$f":"IFERROR(_xlfn.IFS(F274=$K$4,\"T500\",F274=$K$5,\"T500\",F274=$K$6,\"T500\"),\"\")","v":""}]
[20251230,"グリムス",3150,"電気・ガス業",1.9000000000000001E-5,"TOPIX Small 2","3150",{"$f":"IFERROR(_xlfn.IFS(F275=$K$4,\"T500\",F275=$K$5,\"T500\",F275=$K$6,\"T500\"),\"\")","v":""}]
[20251230,"バイタルケーエスケー・ホールディングス",3151,"卸売業",4.1E-5,"TOPIX Small 2","3151",{"$f":"IFERROR(_xlfn.IFS(F276=$K$4,\"T500\",F276=$K$5,\"T500\",F276=$K$6,\"T500\"),\"\")","v":""}]
[20251230,"八洲電機",3153,"卸売業",4.6999999999999997E-5,"TOPIX Small 2","3153",{"$f":"IFERROR(_xlfn.IFS(F277=$K$4,\"T500\",F277=$K$5,\"T500\",F277=$K$6,\"T500\"),\"\")","v":""}]
[20251230,"メディアスホールディングス",3154,"卸売業",1.2E-5,"TOPIX Small 2","3154",{"$f":"IFERROR(_xlfn.IFS(F278=$K$4,\"T500\",F278=$K$5,\"T500\",F278=$K$6,\"T500\"),\"\")","v":""}]
[20251230,"レスター",3156,"卸売業",5.1999999999999997E-5,"TOPIX Small 2","3156",{"$f":"IFERROR(_xlfn.IFS(F279=$K$4,\"T500\",F279=$K$5,\"T500\",F279=$K$6,\"T500\"),\"\")","v":""}]
[20251230,"ＴＯＫＡＩホールディングス",3167,"卸売業",1.2899999999999999E-4,"TOPIX Small 1","3167",{"$f":"IFERROR(_xlfn.IFS(F280=$K$4,\"T500\",F280=$K$5,\"T500\",F280=$K$6,\"T500\"),\"\")","v":""}]
[20251230,"三洋貿易",3176,"卸売業",4.0000000000000003E-5,"TOPIX Small 2","3176",{"$f":"IFERROR(_xlfn.IFS(F281=$K$4,\"T500\",F281=$K$5,\"T500\",F281=$K$6,\"T500\"),\"\")","v":""}]
[20251230,"シュッピン",3179,"小売業",2.8E-5,"TOPIX Small 2","3179",{"$f":"IFERROR(_xlfn.IFS(F282=$K$4,\"T500\",F282=$K$5,\"T500\",F282=$K$6,\"T500\"),\"\")","v":""}]
[20251230,"ビューティガレージ",3180,"卸売業",9.0000000000000002E-6,"TOPIX Small 2","3180",{"$f":"IFERROR(_xlfn.IFS(F283=$K$4,\"T500\",F283=$K$5,\"T500\",F283=$K$6,\"T500\"),\"\")","v":""}]
[20251230,"オイシックス・ラ・大地",3182,"小売業",4.8000000000000001E-5,"TOPIX Small 1","3182",{"$f":"IFERROR(_xlfn.IFS(F284=$K$4,\"T500\",F284=$K$5,\"T500\",F284=$K$6,\"T500\"),\"\")","v":""}]
[20251230,"ウイン・パートナーズ",3183,"卸売業",2.0999999999999999E-5,"TOPIX Small 2","3183",{"$f":"IFERROR(_xlfn.IFS(F285=$K$4,\"T500\",F285=$K$5,\"T500\",F285=$K$6,\"T500\"),\"\")","v":""}]
[20251230,"ネクステージ",3186,"小売業",1.3899999999999999E-4,"TOPIX Small 1","3186",{"$f":"IFERROR(_xlfn.IFS(F286=$K$4,\"T500\",F286=$K$5,\"T500\",F286=$K$6,\"T500\"),\"\")","v":""}]
[20251230,"ジョイフル本田",3191,"小売業",1.26E-4,"TOPIX Small 1","3191",{"$f":"IFERROR(_xlfn.IFS(F287=$K$4,\"T500\",F287=$K$5,\"T500\",F287=$K$6,\"T500\"),\"\")","v":""}]
[20251230,"エターナルホスピタリティグループ",3193,"小売業",3.1000000000000001E-5,"TOPIX Small 2","3193",{"$f":"IFERROR(_xlfn.IFS(F288=$K$4,\"T500\",F288=$K$5,\"T500\",F288=$K$6,\"T500\"),\"\")","v":""}]
[20251230,"ホットランドホールディングス",3196,"小売業",3.4E-5,"TOPIX Small 2","3196",{"$f":"IFERROR(_xlfn.IFS(F289=$K$4,\"T500\",F289=$K$5,\"T500\",F289=$K$6,\"T500\"),\"\")","v":""}]
[20251230,"すかいらーくホールディングス",3197,"小売業",1.0089999999999999E-3,"TOPIX Mid400","3197",{"$f":"IFERROR(_xlfn.IFS(F290=$K$4,\"T500\",F290=$K$5,\"T500\",F290=$K$6,\"T500\"),\"\")","v":"T500"}]
[20251230,"ＳＦＰホールディングス",3198,"小売業",2.5999999999999998E-5,"TOPIX Small 2","3198",{"$f":"IFERROR(_xlfn.IFS(F291=$K$4,\"T500\",F291=$K$5,\"T500\",F291=$K$6,\"T500\"),\"\")","v":""}]
[20251230,"綿半ホールディングス",3199,"小売業",2.5000000000000001E-5,"TOPIX Small 2","3199",{"$f":"IFERROR(_xlfn.IFS(F292=$K$4,\"T500\",F292=$K$5,\"T500\",F292=$K$6,\"T500\"),\"\")","v":""}]
[20251230,"日本毛織",3201,"繊維製品",9.2E-5,"TOPIX Small 1","3201",{"$f":"IFERROR(_xlfn.IFS(F293=$K$4,\"T500\",F293=$K$5,\"T500\",F293=$K$6,\"T500\"),\"\")","v":""}]
[20251230,"ヨシックスホールディングス",3221,"小売業",1.9000000000000001E-5,"TOPIX Small 2","3221",{"$f":"IFERROR(_xlfn.IFS(F294=$K$4,\"T500\",F294=$K$5,\"T500\",F294=$K$6,\"T500\"),\"\")","v":""}]
[20251230,"ユナイテッド・スーパーマーケット・ホールディングス",3222,"小売業",9.7999999999999997E-5,"TOPIX Small 1","3222",{"$f":"IFERROR(_xlfn.IFS(F295=$K$4,\"T500\",F295=$K$5,\"T500\",F295=$K$6,\"T500\"),\"\")","v":""}]
[20251230,"野村不動産ホールディングス",3231,"不動産業",5.5000000000000003E-4,"TOPIX Mid400","3231",{"$f":"IFERROR(_xlfn.IFS(F296=$K$4,\"T500\",F296=$K$5,\"T500\",F296=$K$6,\"T500\"),\"\")","v":"T500"}]
[20251230,"三重交通グループホールディングス",3232,"不動産業",2.6999999999999999E-5,"TOPIX Small 2","3232",{"$f":"IFERROR(_xlfn.IFS(F297=$K$4,\"T500\",F297=$K$5,\"T500\",F297=$K$6,\"T500\"),\"\")","v":""}]
[20251230,"ディア・ライフ",3245,"不動産業",3.8999999999999999E-5,"TOPIX Small 2","3245",{"$f":"IFERROR(_xlfn.IFS(F298=$K$4,\"T500\",F298=$K$5,\"T500\",F298=$K$6,\"T500\"),\"\")","v":""}]
[20251230,"地主",3252,"不動産業",5.1E-5,"TOPIX Small 2","3252",{"$f":"IFERROR(_xlfn.IFS(F299=$K$4,\"T500\",F299=$K$5,\"T500\",F299=$K$6,\"T500\"),\"\")","v":""}]
[20251230,"フィル・カンパニー",3267,"建設業",3.9999999999999998E-6,"TOPIX Small 2","3267",{"$f":"IFERROR(_xlfn.IFS(F300=$K$4,\"T500\",F300=$K$5,\"T500\",F300=$K$6,\"T500\"),\"\")","v":""}]
[20251230,"ＪＰＭＣ",3276,"不動産業",1.4E-5,"TOPIX Small 2","3276",{"$f":"IFERROR(_xlfn.IFS(F301=$K$4,\"T500\",F301=$K$5,\"T500\",F301=$K$6,\"T500\"),\"\")","v":""}]
[20251230,"フージャースホールディングス",3284,"不動産業",4.6999999999999997E-5,"TOPIX Small 2","3284",{"$f":"IFERROR(_xlfn.IFS(F302=$K$4,\"T500\",F302=$K$5,\"T500\",F302=$K$6,\"T500\"),\"\")","v":""}]
[20251230,"オープンハウスグループ",3288,"不動産業",5.8299999999999997E-4,"TOPIX Mid400","3288",{"$f":"IFERROR(_xlfn.IFS(F303=$K$4,\"T500\",F303=$K$5,\"T500\",F303=$K$6,\"T500\"),\"\")","v":"T500"}]
[20251230,"東急不動産ホールディングス",3289,"不動産業",7.9699999999999997E-4,"TOPIX Mid400","3289",{"$f":"IFERROR(_xlfn.IFS(F304=$K$4,\"T500\",F304=$K$5,\"T500\",F304=$K$6,\"T500\"),\"\")","v":"T500"}]
[20251230,"飯田グループホールディングス",3291,"不動産業",4.37E-4,"TOPIX Mid400","3291",{"$f":"IFERROR(_xlfn.IFS(F305=$K$4,\"T500\",F305=$K$5,\"T500\",F305=$K$6,\"T500\"),\"\")","v":"T500"}]
[20251230,"帝国繊維",3302,"繊維製品",7.1000000000000005E-5,"TOPIX Small 2","3302",{"$f":"IFERROR(_xlfn.IFS(F306=$K$4,\"T500\",F306=$K$5,\"T500\",F306=$K$6,\"T500\"),\"\")","v":""}]
[20251230,"日本コークス工業",3315,"石油・石炭製品",2.3E-5,"TOPIX Small 2","3315",{"$f":"IFERROR(_xlfn.IFS(F307=$K$4,\"T500\",F307=$K$5,\"T500\",F307=$K$6,\"T500\"),\"\")","v":""}]
[20251230,"あさひ",3333,"小売業",2.4000000000000001E-5,"TOPIX Small 2","3333",{"$f":"IFERROR(_xlfn.IFS(F308=$K$4,\"T500\",F308=$K$5,\"T500\",F308=$K$6,\"T500\"),\"\")","v":""}]
[20251230,"コスモス薬品",3349,"小売業",3.4499999999999998E-4,"TOPIX Mid400","3349",{"$f":"IFERROR(_xlfn.IFS(F309=$K$4,\"T500\",F309=$K$5,\"T500\",F309=$K$6,\"T500\"),\"\")","v":"T500"}]
[20251230,"シップヘルスケアホールディングス",3360,"卸売業",2.1100000000000001E-4,"TOPIX Mid400","3360",{"$f":"IFERROR(_xlfn.IFS(F310=$K$4,\"T500\",F310=$K$5,\"T500\",F310=$K$6,\"T500\"),\"\")","v":"T500"}]
[20251230,"ソフトクリエイトホールディングス",3371,"情報・通信業",3.6999999999999998E-5,"TOPIX Small 2","3371",{"$f":"IFERROR(_xlfn.IFS(F311=$K$4,\"T500\",F311=$K$5,\"T500\",F311=$K$6,\"T500\"),\"\")","v":""}]
[20251230,"セブン＆アイ・ホールディングス",3382,"小売業",5.4510000000000001E-3,"TOPIX Core30","3382",{"$f":"IFERROR(_xlfn.IFS(F312=$K$4,\"T500\",F312=$K$5,\"T500\",F312=$K$6,\"T500\"),\"\")","v":"T500"}]
[20251230,"クリエイト・レストランツ・ホールディングス",3387,"小売業",2.5599999999999999E-4,"TOPIX Small 1","3387",{"$f":"IFERROR(_xlfn.IFS(F313=$K$4,\"T500\",F313=$K$5,\"T500\",F313=$K$6,\"T500\"),\"\")","v":""}]
[20251230,"明治電機工業",3388,"卸売業",2.5999999999999998E-5,"TOPIX Small 2","3388",{"$f":"IFERROR(_xlfn.IFS(F314=$K$4,\"T500\",F314=$K$5,\"T500\",F314=$K$6,\"T500\"),\"\")","v":""}]
[20251230,"ツルハホールディングス",3391,"小売業",9.859999999999999E-4,"TOPIX Mid400","3391",{"$f":"IFERROR(_xlfn.IFS(F315=$K$4,\"T500\",F315=$K$5,\"T500\",F315=$K$6,\"T500\"),\"\")","v":"T500"}]
[20251230,"サンマルクホールディングス",3395,"小売業",5.3000000000000001E-5,"TOPIX Small 1","3395",{"$f":"IFERROR(_xlfn.IFS(F316=$K$4,\"T500\",F316=$K$5,\"T500\",F316=$K$6,\"T500\"),\"\")","v":""}]
[20251230,"トリドールホールディングス",3397,"小売業",2.6200000000000003E-4,"TOPIX Mid400","3397",{"$f":"IFERROR(_xlfn.IFS(F317=$K$4,\"T500\",F317=$K$5,\"T500\",F317=$K$6,\"T500\"),\"\")","v":"T500"}]
[20251230,"帝人",3401,"繊維製品",2.5000000000000001E-4,"TOPIX Mid400","3401",{"$f":"IFERROR(_xlfn.IFS(F318=$K$4,\"T500\",F318=$K$5,\"T500\",F318=$K$6,\"T500\"),\"\")","v":"T500"}]
[20251230,"東レ",3402,"繊維製品",1.4270000000000001E-3,"TOPIX Mid400","3402",{"$f":"IFERROR(_xlfn.IFS(F319=$K$4,\"T500\",F319=$K$5,\"T500\",F319=$K$6,\"T500\"),\"\")","v":"T500"}]
[20251230,"クラレ",3405,"化学",4.17E-4,"TOPIX Mid400","3405",{"$f":"IFERROR(_xlfn.IFS(F320=$K$4,\"T500\",F320=$K$5,\"T500\",F320=$K$6,\"T500\"),\"\")","v":"T500"}]
[20251230,"旭化成",3407,"化学",1.9109999999999999E-3,"TOPIX Large70","3407",{"$f":"IFERROR(_xlfn.IFS(F321=$K$4,\"T500\",F321=$K$5,\"T500\",F321=$K$6,\"T500\"),\"\")","v":"T500"}]
[20251230,"ＴＯＫＹＯ　ＢＡＳＥ",3415,"小売業",1.4E-5,"TOPIX Small 2","3415",{"$f":"IFERROR(_xlfn.IFS(F322=$K$4,\"T500\",F322=$K$5,\"T500\",F322=$K$6,\"T500\"),\"\")","v":""}]
[20251230,"稲葉製作所",3421,"金属製品",1.9000000000000001E-5,"TOPIX Small 2",{"$f":"TEXT(C323,0)","v":"3421"},{"$f":"IFERROR(_xlfn.IFS(F323=$K$4,\"T500\",F323=$K$5,\"T500\",F323=$K$6,\"T500\"),\"\")","v":""}]
[20251230,"宮地エンジニアリンググループ",3431,"金属製品",5.1999999999999997E-5,"TOPIX Small 1","3431",{"$f":"IFERROR(_xlfn.IFS(F324=$K$4,\"T500\",F324=$K$5,\"T500\",F324=$K$6,\"T500\"),\"\")","v":""}]
[20251230,"トーカロ",3433,"金属製品",1.37E-4,"TOPIX Small 1","3433",{"$f":"IFERROR(_xlfn.IFS(F325=$K$4,\"T500\",F325=$K$5,\"T500\",F325=$K$6,\"T500\"),\"\")","v":""}]
[20251230,"ＳＵＭＣＯ",3436,"金属製品",5.8399999999999999E-4,"TOPIX Mid400","3436",{"$f":"IFERROR(_xlfn.IFS(F326=$K$4,\"T500\",F326=$K$5,\"T500\",F326=$K$6,\"T500\"),\"\")","v":"T500"}]
[20251230,"川田テクノロジーズ",3443,"金属製品",7.1000000000000005E-5,"TOPIX Small 2","3443",{"$f":"IFERROR(_xlfn.IFS(F327=$K$4,\"T500\",F327=$K$5,\"T500\",F327=$K$6,\"T500\"),\"\")","v":""}]
[20251230,"ＲＳ　Ｔｅｃｈｎｏｌｏｇｉｅｓ",3445,"金属製品",5.3999999999999998E-5,"TOPIX Small 1","3445",{"$f":"IFERROR(_xlfn.IFS(F328=$K$4,\"T500\",F328=$K$5,\"T500\",F328=$K$6,\"T500\"),\"\")","v":""}]
[20251230,"Ａｎｄ　Ｄｏホールディングス",3457,"不動産業",1.2999999999999999E-5,"TOPIX Small 2","3457",{"$f":"IFERROR(_xlfn.IFS(F329=$K$4,\"T500\",F329=$K$5,\"T500\",F329=$K$6,\"T500\"),\"\")","v":""}]
[20251230,"ケイアイスター不動産",3465,"不動産業",5.7000000000000003E-5,"TOPIX Small 1","3465",{"$f":"IFERROR(_xlfn.IFS(F330=$K$4,\"T500\",F330=$K$5,\"T500\",F330=$K$6,\"T500\"),\"\")","v":""}]
[20251230,"グッドコムアセット",3475,"不動産業",2.6999999999999999E-5,"TOPIX Small 2","3475",{"$f":"IFERROR(_xlfn.IFS(F331=$K$4,\"T500\",F331=$K$5,\"T500\",F331=$K$6,\"T500\"),\"\")","v":""}]
[20251230,"ジェイ・エス・ビー",3480,"不動産業",3.0000000000000001E-5,"TOPIX Small 2","3480",{"$f":"IFERROR(_xlfn.IFS(F332=$K$4,\"T500\",F332=$K$5,\"T500\",F332=$K$6,\"T500\"),\"\")","v":""}]
[20251230,"ロードスターキャピタル",3482,"不動産業",3.4999999999999997E-5,"TOPIX Small 2","3482",{"$f":"IFERROR(_xlfn.IFS(F333=$K$4,\"T500\",F333=$K$5,\"T500\",F333=$K$6,\"T500\"),\"\")","v":""}]
[20251230,"アズーム",3496,"不動産業",1.9000000000000001E-5,"TOPIX Small 2","3496",{"$f":"IFERROR(_xlfn.IFS(F334=$K$4,\"T500\",F334=$K$5,\"T500\",F334=$K$6,\"T500\"),\"\")","v":""}]
[20251230,"霞ヶ関キャピタル",3498,"不動産業",1.4899999999999999E-4,"TOPIX Small 1","3498",{"$f":"IFERROR(_xlfn.IFS(F335=$K$4,\"T500\",F335=$K$5,\"T500\",F335=$K$6,\"T500\"),\"\")","v":""}]
[20251230,"ＪＭホールディングス",3539,"小売業",5.3000000000000001E-5,"TOPIX Small 2","3539",{"$f":"IFERROR(_xlfn.IFS(F336=$K$4,\"T500\",F336=$K$5,\"T500\",F336=$K$6,\"T500\"),\"\")","v":""}]
[20251230,"コメダホールディングス",3543,"卸売業",1.63E-4,"TOPIX Small 1","3543",{"$f":"IFERROR(_xlfn.IFS(F337=$K$4,\"T500\",F337=$K$5,\"T500\",F337=$K$6,\"T500\"),\"\")","v":""}]
[20251230,"アレンザホールディングス",3546,"小売業",2.0000000000000002E-5,"TOPIX Small 2","3546",{"$f":"IFERROR(_xlfn.IFS(F338=$K$4,\"T500\",F338=$K$5,\"T500\",F338=$K$6,\"T500\"),\"\")","v":""}]
[20251230,"串カツ田中ホールディングス",3547,"小売業",1.2999999999999999E-5,"TOPIX Small 2","3547",{"$f":"IFERROR(_xlfn.IFS(F339=$K$4,\"T500\",F339=$K$5,\"T500\",F339=$K$6,\"T500\"),\"\")","v":""}]
[20251230,"バロックジャパンリミテッド",3548,"小売業",2.0000000000000002E-5,"TOPIX Small 2","3548",{"$f":"IFERROR(_xlfn.IFS(F340=$K$4,\"T500\",F340=$K$5,\"T500\",F340=$K$6,\"T500\"),\"\")","v":""}]
[20251230,"クスリのアオキホールディングス",3549,"小売業",2.43E-4,"TOPIX Mid400","3549",{"$f":"IFERROR(_xlfn.IFS(F341=$K$4,\"T500\",F341=$K$5,\"T500\",F341=$K$6,\"T500\"),\"\")","v":"T500"}]
[20251230,"力の源ホールディングス",3561,"小売業",2.3E-5,"TOPIX Small 2","3561",{"$f":"IFERROR(_xlfn.IFS(F342=$K$4,\"T500\",F342=$K$5,\"T500\",F342=$K$6,\"T500\"),\"\")","v":""}]
[20251230,"ＦＯＯＤ　＆　ＬＩＦＥ　ＣＯＭＰＡＮＩＥＳ",3563,"小売業",9.9700000000000006E-4,"TOPIX Mid400","3563",{"$f":"IFERROR(_xlfn.IFS(F343=$K$4,\"T500\",F343=$K$5,\"T500\",F343=$K$6,\"T500\"),\"\")","v":"T500"}]
[20251230,"アセンテック",3565,"卸売業",1.5E-5,"TOPIX Small 2","3565",{"$f":"IFERROR(_xlfn.IFS(F344=$K$4,\"T500\",F344=$K$5,\"T500\",F344=$K$6,\"T500\"),\"\")","v":""}]
[20251230,"セーレン",3569,"繊維製品",1.3799999999999999E-4,"TOPIX Small 1","3569",{"$f":"IFERROR(_xlfn.IFS(F345=$K$4,\"T500\",F345=$K$5,\"T500\",F345=$K$6,\"T500\"),\"\")","v":""}]
[20251230,"小松マテーレ",3580,"繊維製品",2.3E-5,"TOPIX Small 2","3580",{"$f":"IFERROR(_xlfn.IFS(F346=$K$4,\"T500\",F346=$K$5,\"T500\",F346=$K$6,\"T500\"),\"\")","v":""}]
[20251230,"ワコールホールディングス",3591,"繊維製品",1.8000000000000001E-4,"TOPIX Mid400","3591",{"$f":"IFERROR(_xlfn.IFS(F347=$K$4,\"T500\",F347=$K$5,\"T500\",F347=$K$6,\"T500\"),\"\")","v":"T500"}]
[20251230,"ホギメディカル",3593,"繊維製品",1.5200000000000001E-4,"TOPIX Small 1","3593",{"$f":"IFERROR(_xlfn.IFS(F348=$K$4,\"T500\",F348=$K$5,\"T500\",F348=$K$6,\"T500\"),\"\")","v":""}]
[20251230,"ＴＳＩホールディングス",3608,"繊維製品",6.6000000000000005E-5,"TOPIX Small 1","3608",{"$f":"IFERROR(_xlfn.IFS(F349=$K$4,\"T500\",F349=$K$5,\"T500\",F349=$K$6,\"T500\"),\"\")","v":""}]
[20251230,"ワールド",3612,"繊維製品",1.06E-4,"TOPIX Small 1","3612",{"$f":"IFERROR(_xlfn.IFS(F350=$K$4,\"T500\",F350=$K$5,\"T500\",F350=$K$6,\"T500\"),\"\")","v":""}]
[20251230,"ＴＩＳ",3626,"情報・通信業",1.155E-3,"TOPIX Mid400","3626",{"$f":"IFERROR(_xlfn.IFS(F351=$K$4,\"T500\",F351=$K$5,\"T500\",F351=$K$6,\"T500\"),\"\")","v":"T500"}]
[20251230,"グリーホールディングス",3632,"情報・通信業",2.8E-5,"TOPIX Small 2","3632",{"$f":"IFERROR(_xlfn.IFS(F352=$K$4,\"T500\",F352=$K$5,\"T500\",F352=$K$6,\"T500\"),\"\")","v":""}]
[20251230,"ＧＭＯペパボ",3633,"情報・通信業",6.0000000000000002E-6,"TOPIX Small 2","3633",{"$f":"IFERROR(_xlfn.IFS(F353=$K$4,\"T500\",F353=$K$5,\"T500\",F353=$K$6,\"T500\"),\"\")","v":""}]
[20251230,"コーエーテクモホールディングス",3635,"情報・通信業",2.4800000000000001E-4,"TOPIX Mid400","3635",{"$f":"IFERROR(_xlfn.IFS(F354=$K$4,\"T500\",F354=$K$5,\"T500\",F354=$K$6,\"T500\"),\"\")","v":"T500"}]
[20251230,"三菱総合研究所",3636,"情報・通信業",5.0000000000000002E-5,"TOPIX Small 1","3636",{"$f":"IFERROR(_xlfn.IFS(F355=$K$4,\"T500\",F355=$K$5,\"T500\",F355=$K$6,\"T500\"),\"\")","v":""}]
[20251230,"ファインデックス",3649,"情報・通信業",1.2999999999999999E-5,"TOPIX Small 2","3649",{"$f":"IFERROR(_xlfn.IFS(F356=$K$4,\"T500\",F356=$K$5,\"T500\",F356=$K$6,\"T500\"),\"\")","v":""}]
[20251230,"ブレインパッド",3655,"情報・通信業",1.4E-5,"TOPIX Small 2","3655",{"$f":"IFERROR(_xlfn.IFS(F357=$K$4,\"T500\",F357=$K$5,\"T500\",F357=$K$6,\"T500\"),\"\")","v":""}]
[20251230,"ＫＬａｂ",3656,"情報・通信業",2.1999999999999999E-5,"TOPIX Small 2","3656",{"$f":"IFERROR(_xlfn.IFS(F358=$K$4,\"T500\",F358=$K$5,\"T500\",F358=$K$6,\"T500\"),\"\")","v":""}]
[20251230,"ポールトゥウィンホールディングス",3657,"情報・通信業",1.0000000000000001E-5,"TOPIX Small 2","3657",{"$f":"IFERROR(_xlfn.IFS(F359=$K$4,\"T500\",F359=$K$5,\"T500\",F359=$K$6,\"T500\"),\"\")","v":""}]
[20251230,"ネクソン",3659,"情報・通信業",1.9610000000000001E-3,"TOPIX Mid400","3659",{"$f":"IFERROR(_xlfn.IFS(F360=$K$4,\"T500\",F360=$K$5,\"T500\",F360=$K$6,\"T500\"),\"\")","v":"T500"}]
[20251230,"アイスタイル",3660,"情報・通信業",3.6999999999999998E-5,"TOPIX Small 1","3660",{"$f":"IFERROR(_xlfn.IFS(F361=$K$4,\"T500\",F361=$K$5,\"T500\",F361=$K$6,\"T500\"),\"\")","v":""}]
[20251230,"エムアップホールディングス",3661,"情報・通信業",4.6E-5,"TOPIX Small 1","3661",{"$f":"IFERROR(_xlfn.IFS(F362=$K$4,\"T500\",F362=$K$5,\"T500\",F362=$K$6,\"T500\"),\"\")","v":""}]
[20251230,"エイチームホールディングス",3662,"情報・通信業",2.0000000000000002E-5,"TOPIX Small 2","3662",{"$f":"IFERROR(_xlfn.IFS(F363=$K$4,\"T500\",F363=$K$5,\"T500\",F363=$K$6,\"T500\"),\"\")","v":""}]
[20251230,"セルシス",3663,"情報・通信業",4.6999999999999997E-5,"TOPIX Small 2","3663",{"$f":"IFERROR(_xlfn.IFS(F364=$K$4,\"T500\",F364=$K$5,\"T500\",F364=$K$6,\"T500\"),\"\")","v":""}]
[20251230,"エニグモ",3665,"情報・通信業",1.1E-5,"TOPIX Small 2","3665",{"$f":"IFERROR(_xlfn.IFS(F365=$K$4,\"T500\",F365=$K$5,\"T500\",F365=$K$6,\"T500\"),\"\")","v":""}]
[20251230,"コロプラ",3668,"情報・通信業",3.0000000000000001E-5,"TOPIX Small 1","3668",{"$f":"IFERROR(_xlfn.IFS(F366=$K$4,\"T500\",F366=$K$5,\"T500\",F366=$K$6,\"T500\"),\"\")","v":""}]
[20251230,"ブロードリーフ",3673,"情報・通信業",5.5999999999999999E-5,"TOPIX Small 1","3673",{"$f":"IFERROR(_xlfn.IFS(F367=$K$4,\"T500\",F367=$K$5,\"T500\",F367=$K$6,\"T500\"),\"\")","v":""}]
[20251230,"デジタルハーツホールディングス",3676,"情報・通信業",1.2E-5,"TOPIX Small 2","3676",{"$f":"IFERROR(_xlfn.IFS(F368=$K$4,\"T500\",F368=$K$5,\"T500\",F368=$K$6,\"T500\"),\"\")","v":""}]
[20251230,"メディアドゥ",3678,"情報・通信業",1.2999999999999999E-5,"TOPIX Small 2","3678",{"$f":"IFERROR(_xlfn.IFS(F369=$K$4,\"T500\",F369=$K$5,\"T500\",F369=$K$6,\"T500\"),\"\")","v":""}]
[20251230,"じげん",3679,"情報・通信業",2.9E-5,"TOPIX Small 2","3679",{"$f":"IFERROR(_xlfn.IFS(F370=$K$4,\"T500\",F370=$K$5,\"T500\",F370=$K$6,\"T500\"),\"\")","v":""}]
[20251230,"ブイキューブ",3681,"情報・通信業",3.0000000000000001E-6,"TOPIX Small 2","3681",{"$f":"IFERROR(_xlfn.IFS(F371=$K$4,\"T500\",F371=$K$5,\"T500\",F371=$K$6,\"T500\"),\"\")","v":""}]
[20251230,"フィックスターズ",3687,"情報・通信業",4.5000000000000003E-5,"TOPIX Small 2","3687",{"$f":"IFERROR(_xlfn.IFS(F372=$K$4,\"T500\",F372=$K$5,\"T500\",F372=$K$6,\"T500\"),\"\")","v":""}]
[20251230,"北里コーポレーション","368A","精密機器",2.5000000000000001E-5,"TOPIX Small 2","368A",{"$f":"IFERROR(_xlfn.IFS(F373=$K$4,\"T500\",F373=$K$5,\"T500\",F373=$K$6,\"T500\"),\"\")","v":""}]
[20251230,"オプティム",3694,"情報・通信業",1.1E-5,"TOPIX Small 2","3694",{"$f":"IFERROR(_xlfn.IFS(F374=$K$4,\"T500\",F374=$K$5,\"T500\",F374=$K$6,\"T500\"),\"\")","v":""}]
[20251230,"セレス",3696,"情報・通信業",1.8E-5,"TOPIX Small 2","3696",{"$f":"IFERROR(_xlfn.IFS(F375=$K$4,\"T500\",F375=$K$5,\"T500\",F375=$K$6,\"T500\"),\"\")","v":""}]
[20251230,"ＳＨＩＦＴ",3697,"情報・通信業",1.83E-4,"TOPIX Mid400","3697",{"$f":"IFERROR(_xlfn.IFS(F376=$K$4,\"T500\",F376=$K$5,\"T500\",F376=$K$6,\"T500\"),\"\")","v":"T500"}]
[20251230,"特種東海製紙",3708,"パルプ・紙",5.7000000000000003E-5,"TOPIX Small 2","3708",{"$f":"IFERROR(_xlfn.IFS(F377=$K$4,\"T500\",F377=$K$5,\"T500\",F377=$K$6,\"T500\"),\"\")","v":""}]
[20251230,"セック",3741,"情報・通信業",2.0000000000000002E-5,"TOPIX Small 2","3741",{"$f":"IFERROR(_xlfn.IFS(F378=$K$4,\"T500\",F378=$K$5,\"T500\",F378=$K$6,\"T500\"),\"\")","v":""}]
[20251230,"テクマトリックス",3762,"情報・通信業",9.7E-5,"TOPIX Small 1","3762",{"$f":"IFERROR(_xlfn.IFS(F379=$K$4,\"T500\",F379=$K$5,\"T500\",F379=$K$6,\"T500\"),\"\")","v":""}]
[20251230,"プロシップ",3763,"情報・通信業",2.9E-5,"TOPIX Small 2","3763",{"$f":"IFERROR(_xlfn.IFS(F380=$K$4,\"T500\",F380=$K$5,\"T500\",F380=$K$6,\"T500\"),\"\")","v":""}]
[20251230,"ガンホー・オンライン・エンターテイメント",3765,"情報・通信業",1.21E-4,"TOPIX Small 1","3765",{"$f":"IFERROR(_xlfn.IFS(F381=$K$4,\"T500\",F381=$K$5,\"T500\",F381=$K$6,\"T500\"),\"\")","v":""}]
[20251230,"ＧＭＯペイメントゲートウェイ",3769,"情報・通信業",4.0499999999999998E-4,"TOPIX Mid400","3769",{"$f":"IFERROR(_xlfn.IFS(F382=$K$4,\"T500\",F382=$K$5,\"T500\",F382=$K$6,\"T500\"),\"\")","v":"T500"}]
[20251230,"システムリサーチ",3771,"情報・通信業",3.1999999999999999E-5,"TOPIX Small 2","3771",{"$f":"IFERROR(_xlfn.IFS(F383=$K$4,\"T500\",F383=$K$5,\"T500\",F383=$K$6,\"T500\"),\"\")","v":""}]
[20251230,"インターネットイニシアティブ",3774,"情報・通信業",3.1500000000000001E-4,"TOPIX Mid400","3774",{"$f":"IFERROR(_xlfn.IFS(F384=$K$4,\"T500\",F384=$K$5,\"T500\",F384=$K$6,\"T500\"),\"\")","v":"T500"}]
[20251230,"さくらインターネット",3778,"情報・通信業",8.1000000000000004E-5,"TOPIX Small 1","3778",{"$f":"IFERROR(_xlfn.IFS(F385=$K$4,\"T500\",F385=$K$5,\"T500\",F385=$K$6,\"T500\"),\"\")","v":""}]
[20251230,"ＧＭＯグローバルサイン・ホールディングス",3788,"情報・通信業",1.5E-5,"TOPIX Small 2","3788",{"$f":"IFERROR(_xlfn.IFS(F386=$K$4,\"T500\",F386=$K$5,\"T500\",F386=$K$6,\"T500\"),\"\")","v":""}]
[20251230,"ＳＲＡホールディングス",3817,"情報・通信業",6.2000000000000003E-5,"TOPIX Small 2",{"$f":"TEXT(C387,0)","v":"3817"},{"$f":"IFERROR(_xlfn.IFS(F387=$K$4,\"T500\",F387=$K$5,\"T500\",F387=$K$6,\"T500\"),\"\")","v":""}]
[20251230,"朝日ネット",3834,"情報・通信業",1.5999999999999999E-5,"TOPIX Small 2","3834",{"$f":"IFERROR(_xlfn.IFS(F388=$K$4,\"T500\",F388=$K$5,\"T500\",F388=$K$6,\"T500\"),\"\")","v":""}]
[20251230,"ｅＢＡＳＥ",3835,"情報・通信業",1.1E-5,"TOPIX Small 2","3835",{"$f":"IFERROR(_xlfn.IFS(F389=$K$4,\"T500\",F389=$K$5,\"T500\",F389=$K$6,\"T500\"),\"\")","v":""}]
[20251230,"アバントグループ",3836,"情報・通信業",5.1E-5,"TOPIX Small 2","3836",{"$f":"IFERROR(_xlfn.IFS(F390=$K$4,\"T500\",F390=$K$5,\"T500\",F390=$K$6,\"T500\"),\"\")","v":""}]
[20251230,"アドソル日進",3837,"情報・通信業",2.6999999999999999E-5,"TOPIX Small 2","3837",{"$f":"IFERROR(_xlfn.IFS(F391=$K$4,\"T500\",F391=$K$5,\"T500\",F391=$K$6,\"T500\"),\"\")","v":""}]
[20251230,"フリービット",3843,"情報・通信業",1.8E-5,"TOPIX Small 2","3843",{"$f":"IFERROR(_xlfn.IFS(F392=$K$4,\"T500\",F392=$K$5,\"T500\",F392=$K$6,\"T500\"),\"\")","v":""}]
[20251230,"コムチュア",3844,"情報・通信業",4.6999999999999997E-5,"TOPIX Small 1","3844",{"$f":"IFERROR(_xlfn.IFS(F393=$K$4,\"T500\",F393=$K$5,\"T500\",F393=$K$6,\"T500\"),\"\")","v":""}]
[20251230,"アステリア",3853,"情報・通信業",1.5E-5,"TOPIX Small 2","3853",{"$f":"IFERROR(_xlfn.IFS(F394=$K$4,\"T500\",F394=$K$5,\"T500\",F394=$K$6,\"T500\"),\"\")","v":""}]
[20251230,"アイル",3854,"情報・通信業",3.0000000000000001E-5,"TOPIX Small 2","3854",{"$f":"IFERROR(_xlfn.IFS(F395=$K$4,\"T500\",F395=$K$5,\"T500\",F395=$K$6,\"T500\"),\"\")","v":""}]
[20251230,"王子ホールディングス",3861,"パルプ・紙",6.7599999999999995E-4,"TOPIX Mid400","3861",{"$f":"IFERROR(_xlfn.IFS(F396=$K$4,\"T500\",F396=$K$5,\"T500\",F396=$K$6,\"T500\"),\"\")","v":"T500"}]
[20251230,"日本製紙",3863,"パルプ・紙",1.36E-4,"TOPIX Small 1","3863",{"$f":"IFERROR(_xlfn.IFS(F397=$K$4,\"T500\",F397=$K$5,\"T500\",F397=$K$6,\"T500\"),\"\")","v":""}]
[20251230,"北越コーポレーション",3865,"パルプ・紙",1.0399999999999999E-4,"TOPIX Small 1","3865",{"$f":"IFERROR(_xlfn.IFS(F398=$K$4,\"T500\",F398=$K$5,\"T500\",F398=$K$6,\"T500\"),\"\")","v":""}]
[20251230,"大王製紙",3880,"パルプ・紙",9.7999999999999997E-5,"TOPIX Small 1","3880",{"$f":"IFERROR(_xlfn.IFS(F399=$K$4,\"T500\",F399=$K$5,\"T500\",F399=$K$6,\"T500\"),\"\")","v":""}]
[20251230,"マークラインズ",3901,"情報・通信業",1.9000000000000001E-5,"TOPIX Small 2","3901",{"$f":"IFERROR(_xlfn.IFS(F400=$K$4,\"T500\",F400=$K$5,\"T500\",F400=$K$6,\"T500\"),\"\")","v":""}]
[20251230,"メディカル・データ・ビジョン",3902,"情報・通信業",3.6999999999999998E-5,"TOPIX Small 2","3902",{"$f":"IFERROR(_xlfn.IFS(F401=$K$4,\"T500\",F401=$K$5,\"T500\",F401=$K$6,\"T500\"),\"\")","v":""}]
[20251230,"ｇｕｍｉ",3903,"情報・通信業",1.4E-5,"TOPIX Small 2","3903",{"$f":"IFERROR(_xlfn.IFS(F402=$K$4,\"T500\",F402=$K$5,\"T500\",F402=$K$6,\"T500\"),\"\")","v":""}]
[20251230,"テラスカイ",3915,"情報・通信業",1.5E-5,"TOPIX Small 2","3915",{"$f":"IFERROR(_xlfn.IFS(F403=$K$4,\"T500\",F403=$K$5,\"T500\",F403=$K$6,\"T500\"),\"\")","v":""}]
[20251230,"デジタル・インフォメーション・テクノロジー",3916,"情報・通信業",3.1000000000000001E-5,"TOPIX Small 2","3916",{"$f":"IFERROR(_xlfn.IFS(F404=$K$4,\"T500\",F404=$K$5,\"T500\",F404=$K$6,\"T500\"),\"\")","v":""}]
[20251230,"ネオジャパン",3921,"情報・通信業",1.0000000000000001E-5,"TOPIX Small 2","3921",{"$f":"IFERROR(_xlfn.IFS(F405=$K$4,\"T500\",F405=$K$5,\"T500\",F405=$K$6,\"T500\"),\"\")","v":""}]
[20251230,"ＰＲ　ＴＩＭＥＳ",3922,"情報・通信業",1.2E-5,"TOPIX Small 2","3922",{"$f":"IFERROR(_xlfn.IFS(F406=$K$4,\"T500\",F406=$K$5,\"T500\",F406=$K$6,\"T500\"),\"\")","v":""}]
[20251230,"ラクス",3923,"情報・通信業",2.03E-4,"TOPIX Mid400","3923",{"$f":"IFERROR(_xlfn.IFS(F407=$K$4,\"T500\",F407=$K$5,\"T500\",F407=$K$6,\"T500\"),\"\")","v":"T500"}]
[20251230,"ダブルスタンダード",3925,"情報・通信業",1.2999999999999999E-5,"TOPIX Small 2","3925",{"$f":"IFERROR(_xlfn.IFS(F408=$K$4,\"T500\",F408=$K$5,\"T500\",F408=$K$6,\"T500\"),\"\")","v":""}]
[20251230,"オープンドア",3926,"情報・通信業",3.9999999999999998E-6,"TOPIX Small 2","3926",{"$f":"IFERROR(_xlfn.IFS(F409=$K$4,\"T500\",F409=$K$5,\"T500\",F409=$K$6,\"T500\"),\"\")","v":""}]
[20251230,"アカツキ",3932,"情報・通信業",2.6999999999999999E-5,"TOPIX Small 2","3932",{"$f":"IFERROR(_xlfn.IFS(F410=$K$4,\"T500\",F410=$K$5,\"T500\",F410=$K$6,\"T500\"),\"\")","v":""}]
[20251230,"Ｕｂｉｃｏｍホールディングス",3937,"情報・通信業",6.9999999999999999E-6,"TOPIX Small 2","3937",{"$f":"IFERROR(_xlfn.IFS(F411=$K$4,\"T500\",F411=$K$5,\"T500\",F411=$K$6,\"T500\"),\"\")","v":""}]
[20251230,"カナミックネットワーク",3939,"情報・通信業",1.4E-5,"TOPIX Small 2","3939",{"$f":"IFERROR(_xlfn.IFS(F412=$K$4,\"T500\",F412=$K$5,\"T500\",F412=$K$6,\"T500\"),\"\")","v":""}]
[20251230,"レンゴー",3941,"パルプ・紙",2.5500000000000002E-4,"TOPIX Mid400","3941",{"$f":"IFERROR(_xlfn.IFS(F413=$K$4,\"T500\",F413=$K$5,\"T500\",F413=$K$6,\"T500\"),\"\")","v":"T500"}]
[20251230,"トーモク",3946,"パルプ・紙",4.1999999999999998E-5,"TOPIX Small 2","3946",{"$f":"IFERROR(_xlfn.IFS(F414=$K$4,\"T500\",F414=$K$5,\"T500\",F414=$K$6,\"T500\"),\"\")","v":""}]
[20251230,"ザ・パック",3950,"パルプ・紙",5.3999999999999998E-5,"TOPIX Small 2","3950",{"$f":"IFERROR(_xlfn.IFS(F415=$K$4,\"T500\",F415=$K$5,\"T500\",F415=$K$6,\"T500\"),\"\")","v":""}]
[20251230,"チェンジホールディングス",3962,"情報・通信業",4.0000000000000003E-5,"TOPIX Small 1","3962",{"$f":"IFERROR(_xlfn.IFS(F416=$K$4,\"T500\",F416=$K$5,\"T500\",F416=$K$6,\"T500\"),\"\")","v":""}]
[20251230,"オークネット",3964,"情報・通信業",4.0000000000000003E-5,"TOPIX Small 2","3964",{"$f":"IFERROR(_xlfn.IFS(F417=$K$4,\"T500\",F417=$K$5,\"T500\",F417=$K$6,\"T500\"),\"\")","v":""}]
[20251230,"オロ",3983,"情報・通信業",1.8E-5,"TOPIX Small 2","3983",{"$f":"IFERROR(_xlfn.IFS(F418=$K$4,\"T500\",F418=$K$5,\"T500\",F418=$K$6,\"T500\"),\"\")","v":""}]
[20251230,"ユーザーローカル",3984,"情報・通信業",2.0000000000000002E-5,"TOPIX Small 2","3984",{"$f":"IFERROR(_xlfn.IFS(F419=$K$4,\"T500\",F419=$K$5,\"T500\",F419=$K$6,\"T500\"),\"\")","v":""}]
[20251230,"ＰＫＳＨＡ　Ｔｅｃｈｎｏｌｏｇｙ",3993,"情報・通信業",8.7000000000000001E-5,"TOPIX Small 1","3993",{"$f":"IFERROR(_xlfn.IFS(F420=$K$4,\"T500\",F420=$K$5,\"T500\",F420=$K$6,\"T500\"),\"\")","v":""}]
[20251230,"マネーフォワード",3994,"情報・通信業",2.2100000000000001E-4,"TOPIX Mid400","3994",{"$f":"IFERROR(_xlfn.IFS(F421=$K$4,\"T500\",F421=$K$5,\"T500\",F421=$K$6,\"T500\"),\"\")","v":"T500"}]
[20251230,"レゾナック・ホールディングス",4004,"化学",1.3090000000000001E-3,"TOPIX Mid400","4004",{"$f":"IFERROR(_xlfn.IFS(F422=$K$4,\"T500\",F422=$K$5,\"T500\",F422=$K$6,\"T500\"),\"\")","v":"T500"}]
[20251230,"住友化学",4005,"化学",7.4399999999999998E-4,"TOPIX Mid400","4005",{"$f":"IFERROR(_xlfn.IFS(F423=$K$4,\"T500\",F423=$K$5,\"T500\",F423=$K$6,\"T500\"),\"\")","v":"T500"}]
[20251230,"住友精化",4008,"化学",4.6999999999999997E-5,"TOPIX Small 1","4008",{"$f":"IFERROR(_xlfn.IFS(F424=$K$4,\"T500\",F424=$K$5,\"T500\",F424=$K$6,\"T500\"),\"\")","v":""}]
[20251230,"日産化学",4021,"化学",5.6400000000000005E-4,"TOPIX Mid400","4021",{"$f":"IFERROR(_xlfn.IFS(F425=$K$4,\"T500\",F425=$K$5,\"T500\",F425=$K$6,\"T500\"),\"\")","v":"T500"}]
[20251230,"ラサ工業",4022,"化学",4.1999999999999998E-5,"TOPIX Small 2","4022",{"$f":"IFERROR(_xlfn.IFS(F426=$K$4,\"T500\",F426=$K$5,\"T500\",F426=$K$6,\"T500\"),\"\")","v":""}]
[20251230,"クレハ",4023,"化学",1.26E-4,"TOPIX Small 1","4023",{"$f":"IFERROR(_xlfn.IFS(F427=$K$4,\"T500\",F427=$K$5,\"T500\",F427=$K$6,\"T500\"),\"\")","v":""}]
[20251230,"多木化学",4025,"化学",3.1000000000000001E-5,"TOPIX Small 2","4025",{"$f":"IFERROR(_xlfn.IFS(F428=$K$4,\"T500\",F428=$K$5,\"T500\",F428=$K$6,\"T500\"),\"\")","v":""}]
[20251230,"テイカ",4027,"化学",1.8E-5,"TOPIX Small 2","4027",{"$f":"IFERROR(_xlfn.IFS(F429=$K$4,\"T500\",F429=$K$5,\"T500\",F429=$K$6,\"T500\"),\"\")","v":""}]
[20251230,"石原産業",4028,"化学",9.3999999999999994E-5,"TOPIX Small 1","4028",{"$f":"IFERROR(_xlfn.IFS(F430=$K$4,\"T500\",F430=$K$5,\"T500\",F430=$K$6,\"T500\"),\"\")","v":""}]
[20251230,"日本曹達",4041,"化学",1.5899999999999999E-4,"TOPIX Small 1","4041",{"$f":"IFERROR(_xlfn.IFS(F431=$K$4,\"T500\",F431=$K$5,\"T500\",F431=$K$6,\"T500\"),\"\")","v":""}]
[20251230,"東ソー",4042,"化学",7.1100000000000004E-4,"TOPIX Mid400","4042",{"$f":"IFERROR(_xlfn.IFS(F432=$K$4,\"T500\",F432=$K$5,\"T500\",F432=$K$6,\"T500\"),\"\")","v":"T500"}]
[20251230,"トクヤマ",4043,"化学",2.99E-4,"TOPIX Mid400","4043",{"$f":"IFERROR(_xlfn.IFS(F433=$K$4,\"T500\",F433=$K$5,\"T500\",F433=$K$6,\"T500\"),\"\")","v":"T500"}]
[20251230,"セントラル硝子",4044,"化学",9.1000000000000003E-5,"TOPIX Small 1","4044",{"$f":"IFERROR(_xlfn.IFS(F434=$K$4,\"T500\",F434=$K$5,\"T500\",F434=$K$6,\"T500\"),\"\")","v":""}]
[20251230,"東亞合成",4045,"化学",1.44E-4,"TOPIX Mid400","4045",{"$f":"IFERROR(_xlfn.IFS(F435=$K$4,\"T500\",F435=$K$5,\"T500\",F435=$K$6,\"T500\"),\"\")","v":"T500"}]
[20251230,"大阪ソーダ",4046,"化学",1.5699999999999999E-4,"TOPIX Small 1","4046",{"$f":"IFERROR(_xlfn.IFS(F436=$K$4,\"T500\",F436=$K$5,\"T500\",F436=$K$6,\"T500\"),\"\")","v":""}]
[20251230,"関東電化工業",4047,"化学",4.3999999999999999E-5,"TOPIX Small 1","4047",{"$f":"IFERROR(_xlfn.IFS(F437=$K$4,\"T500\",F437=$K$5,\"T500\",F437=$K$6,\"T500\"),\"\")","v":""}]
[20251230,"ＧＭＯフィナンシャルゲート",4051,"情報・通信業",1.8E-5,"TOPIX Small 2","4051",{"$f":"IFERROR(_xlfn.IFS(F438=$K$4,\"T500\",F438=$K$5,\"T500\",F438=$K$6,\"T500\"),\"\")","v":""}]
[20251230,"Ｓｕｎ　Ａｓｔｅｒｉｓｋ",4053,"情報・通信業",7.9999999999999996E-6,"TOPIX Small 2","4053",{"$f":"IFERROR(_xlfn.IFS(F439=$K$4,\"T500\",F439=$K$5,\"T500\",F439=$K$6,\"T500\"),\"\")","v":""}]
[20251230,"デンカ",4061,"化学",2.2599999999999999E-4,"TOPIX Mid400","4061",{"$f":"IFERROR(_xlfn.IFS(F440=$K$4,\"T500\",F440=$K$5,\"T500\",F440=$K$6,\"T500\"),\"\")","v":"T500"}]
[20251230,"イビデン",4062,"電気機器",1.7639999999999999E-3,"TOPIX Mid400","4062",{"$f":"IFERROR(_xlfn.IFS(F441=$K$4,\"T500\",F441=$K$5,\"T500\",F441=$K$6,\"T500\"),\"\")","v":"T500"}]
[20251230,"信越化学工業",4063,"化学",8.9960000000000005E-3,"TOPIX Core30","4063",{"$f":"IFERROR(_xlfn.IFS(F442=$K$4,\"T500\",F442=$K$5,\"T500\",F442=$K$6,\"T500\"),\"\")","v":"T500"}]
[20251230,"日本カーバイド工業",4064,"化学",2.5999999999999998E-5,"TOPIX Small 2","4064",{"$f":"IFERROR(_xlfn.IFS(F443=$K$4,\"T500\",F443=$K$5,\"T500\",F443=$K$6,\"T500\"),\"\")","v":""}]
[20251230,"プラスアルファ・コンサルティング",4071,"情報・通信業",6.3E-5,"TOPIX Small 1","4071",{"$f":"IFERROR(_xlfn.IFS(F444=$K$4,\"T500\",F444=$K$5,\"T500\",F444=$K$6,\"T500\"),\"\")","v":""}]
[20251230,"電算システムホールディングス",4072,"情報・通信業",3.3000000000000003E-5,"TOPIX Small 2","4072",{"$f":"IFERROR(_xlfn.IFS(F445=$K$4,\"T500\",F445=$K$5,\"T500\",F445=$K$6,\"T500\"),\"\")","v":""}]
[20251230,"堺化学工業",4078,"化学",5.3999999999999998E-5,"TOPIX Small 1","4078",{"$f":"IFERROR(_xlfn.IFS(F446=$K$4,\"T500\",F446=$K$5,\"T500\",F446=$K$6,\"T500\"),\"\")","v":""}]
[20251230,"第一稀元素化学工業",4082,"化学",2.4000000000000001E-5,"TOPIX Small 2","4082",{"$f":"IFERROR(_xlfn.IFS(F447=$K$4,\"T500\",F447=$K$5,\"T500\",F447=$K$6,\"T500\"),\"\")","v":""}]
[20251230,"エア・ウォーター",4088,"化学",4.4200000000000001E-4,"TOPIX Mid400","4088",{"$f":"IFERROR(_xlfn.IFS(F448=$K$4,\"T500\",F448=$K$5,\"T500\",F448=$K$6,\"T500\"),\"\")","v":"T500"}]
[20251230,"日本酸素ホールディングス",4091,"化学",1.0970000000000001E-3,"TOPIX Mid400","4091",{"$f":"IFERROR(_xlfn.IFS(F449=$K$4,\"T500\",F449=$K$5,\"T500\",F449=$K$6,\"T500\"),\"\")","v":"T500"}]
[20251230,"日本化学工業",4092,"化学",2.3E-5,"TOPIX Small 2","4092",{"$f":"IFERROR(_xlfn.IFS(F450=$K$4,\"T500\",F450=$K$5,\"T500\",F450=$K$6,\"T500\"),\"\")","v":""}]
[20251230,"日本パーカライジング",4095,"化学",1.46E-4,"TOPIX Small 1",{"$f":"TEXT(C451,0)","v":"4095"},{"$f":"IFERROR(_xlfn.IFS(F451=$K$4,\"T500\",F451=$K$5,\"T500\",F451=$K$6,\"T500\"),\"\")","v":""}]
[20251230,"高圧ガス工業",4097,"化学",3.1999999999999999E-5,"TOPIX Small 2","4097",{"$f":"IFERROR(_xlfn.IFS(F452=$K$4,\"T500\",F452=$K$5,\"T500\",F452=$K$6,\"T500\"),\"\")","v":""}]
[20251230,"四国化成ホールディングス",4099,"化学",6.3999999999999997E-5,"TOPIX Small 2","4099",{"$f":"IFERROR(_xlfn.IFS(F453=$K$4,\"T500\",F453=$K$5,\"T500\",F453=$K$6,\"T500\"),\"\")","v":""}]
[20251230,"オリオンビール","409A","食料品",4.3000000000000002E-5,"TOPIX Small 2","409A",{"$f":"IFERROR(_xlfn.IFS(F454=$K$4,\"T500\",F454=$K$5,\"T500\",F454=$K$6,\"T500\"),\"\")","v":""}]
[20251230,"戸田工業",4100,"化学",5.0000000000000004E-6,"TOPIX Small 2","4100",{"$f":"IFERROR(_xlfn.IFS(F455=$K$4,\"T500\",F455=$K$5,\"T500\",F455=$K$6,\"T500\"),\"\")","v":""}]
[20251230,"ステラ　ケミファ",4109,"化学",4.8999999999999998E-5,"TOPIX Small 1","4109",{"$f":"IFERROR(_xlfn.IFS(F456=$K$4,\"T500\",F456=$K$5,\"T500\",F456=$K$6,\"T500\"),\"\")","v":""}]
[20251230,"保土谷化学工業",4112,"化学",2.9E-5,"TOPIX Small 2","4112",{"$f":"IFERROR(_xlfn.IFS(F457=$K$4,\"T500\",F457=$K$5,\"T500\",F457=$K$6,\"T500\"),\"\")","v":""}]
[20251230,"日本触媒",4114,"化学",2.5599999999999999E-4,"TOPIX Mid400","4114",{"$f":"IFERROR(_xlfn.IFS(F458=$K$4,\"T500\",F458=$K$5,\"T500\",F458=$K$6,\"T500\"),\"\")","v":"T500"}]
[20251230,"大日精化工業",4116,"化学",5.8E-5,"TOPIX Small 2","4116",{"$f":"IFERROR(_xlfn.IFS(F459=$K$4,\"T500\",F459=$K$5,\"T500\",F459=$K$6,\"T500\"),\"\")","v":""}]
[20251230,"カネカ",4118,"化学",2.2499999999999999E-4,"TOPIX Mid400","4118",{"$f":"IFERROR(_xlfn.IFS(F460=$K$4,\"T500\",F460=$K$5,\"T500\",F460=$K$6,\"T500\"),\"\")","v":"T500"}]
[20251230,"協和キリン",4151,"医薬品",6.1799999999999995E-4,"TOPIX Mid400","4151",{"$f":"IFERROR(_xlfn.IFS(F461=$K$4,\"T500\",F461=$K$5,\"T500\",F461=$K$6,\"T500\"),\"\")","v":"T500"}]
[20251230,"ブルーゾーンホールディングス","417A","小売業",2.2100000000000001E-4,"TOPIX Mid400","417A",{"$f":"IFERROR(_xlfn.IFS(F462=$K$4,\"T500\",F462=$K$5,\"T500\",F462=$K$6,\"T500\"),\"\")","v":"T500"}]
[20251230,"Ａｐｐｉｅｒ　Ｇｒｏｕｐ",4180,"情報・通信業",8.5000000000000006E-5,"TOPIX Small 1","4180",{"$f":"IFERROR(_xlfn.IFS(F463=$K$4,\"T500\",F463=$K$5,\"T500\",F463=$K$6,\"T500\"),\"\")","v":""}]
[20251230,"三菱瓦斯化学",4182,"化学",4.1899999999999999E-4,"TOPIX Mid400","4182",{"$f":"IFERROR(_xlfn.IFS(F464=$K$4,\"T500\",F464=$K$5,\"T500\",F464=$K$6,\"T500\"),\"\")","v":"T500"}]
[20251230,"三井化学",4183,"化学",7.4799999999999997E-4,"TOPIX Mid400","4183",{"$f":"IFERROR(_xlfn.IFS(F465=$K$4,\"T500\",F465=$K$5,\"T500\",F465=$K$6,\"T500\"),\"\")","v":"T500"}]
[20251230,"東京応化工業",4186,"化学",5.7499999999999999E-4,"TOPIX Mid400","4186",{"$f":"IFERROR(_xlfn.IFS(F466=$K$4,\"T500\",F466=$K$5,\"T500\",F466=$K$6,\"T500\"),\"\")","v":"T500"}]
[20251230,"大阪有機化学工業",4187,"化学",6.8999999999999997E-5,"TOPIX Small 1","4187",{"$f":"IFERROR(_xlfn.IFS(F467=$K$4,\"T500\",F467=$K$5,\"T500\",F467=$K$6,\"T500\"),\"\")","v":""}]
[20251230,"三菱ケミカルグループ",4188,"化学",1.3290000000000001E-3,"TOPIX Large70","4188",{"$f":"IFERROR(_xlfn.IFS(F468=$K$4,\"T500\",F468=$K$5,\"T500\",F468=$K$6,\"T500\"),\"\")","v":"T500"}]
[20251230,"ＫＨネオケム",4189,"化学",8.6000000000000003E-5,"TOPIX Small 1","4189",{"$f":"IFERROR(_xlfn.IFS(F469=$K$4,\"T500\",F469=$K$5,\"T500\",F469=$K$6,\"T500\"),\"\")","v":""}]
[20251230,"ビジョナル",4194,"情報・通信業",2.4899999999999998E-4,"TOPIX Mid400","4194",{"$f":"IFERROR(_xlfn.IFS(F470=$K$4,\"T500\",F470=$K$5,\"T500\",F470=$K$6,\"T500\"),\"\")","v":"T500"}]
[20251230,"ダイセル",4202,"化学",3.1799999999999998E-4,"TOPIX Mid400","4202",{"$f":"IFERROR(_xlfn.IFS(F471=$K$4,\"T500\",F471=$K$5,\"T500\",F471=$K$6,\"T500\"),\"\")","v":"T500"}]
[20251230,"住友ベークライト",4203,"化学",3.7500000000000001E-4,"TOPIX Mid400","4203",{"$f":"IFERROR(_xlfn.IFS(F472=$K$4,\"T500\",F472=$K$5,\"T500\",F472=$K$6,\"T500\"),\"\")","v":"T500"}]
[20251230,"積水化学工業",4204,"化学",1.1429999999999999E-3,"TOPIX Mid400","4204",{"$f":"IFERROR(_xlfn.IFS(F473=$K$4,\"T500\",F473=$K$5,\"T500\",F473=$K$6,\"T500\"),\"\")","v":"T500"}]
[20251230,"日本ゼオン",4205,"化学",2.6899999999999998E-4,"TOPIX Mid400","4205",{"$f":"IFERROR(_xlfn.IFS(F474=$K$4,\"T500\",F474=$K$5,\"T500\",F474=$K$6,\"T500\"),\"\")","v":"T500"}]
[20251230,"アイカ工業",4206,"化学",1.84E-4,"TOPIX Mid400","4206",{"$f":"IFERROR(_xlfn.IFS(F475=$K$4,\"T500\",F475=$K$5,\"T500\",F475=$K$6,\"T500\"),\"\")","v":"T500"}]
[20251230,"ＵＢＥ",4208,"化学",2.7500000000000002E-4,"TOPIX Mid400","4208",{"$f":"IFERROR(_xlfn.IFS(F476=$K$4,\"T500\",F476=$K$5,\"T500\",F476=$K$6,\"T500\"),\"\")","v":"T500"}]
[20251230,"積水樹脂",4212,"化学",5.3000000000000001E-5,"TOPIX Small 1","4212",{"$f":"IFERROR(_xlfn.IFS(F477=$K$4,\"T500\",F477=$K$5,\"T500\",F477=$K$6,\"T500\"),\"\")","v":""}]
[20251230,"旭有機材",4216,"化学",7.4999999999999993E-5,"TOPIX Small 1","4216",{"$f":"IFERROR(_xlfn.IFS(F478=$K$4,\"T500\",F478=$K$5,\"T500\",F478=$K$6,\"T500\"),\"\")","v":""}]
[20251230,"ニチバン",4218,"化学",2.5999999999999998E-5,"TOPIX Small 2","4218",{"$f":"IFERROR(_xlfn.IFS(F479=$K$4,\"T500\",F479=$K$5,\"T500\",F479=$K$6,\"T500\"),\"\")","v":""}]
[20251230,"リケンテクノス",4220,"化学",5.5000000000000002E-5,"TOPIX Small 2","4220",{"$f":"IFERROR(_xlfn.IFS(F480=$K$4,\"T500\",F480=$K$5,\"T500\",F480=$K$6,\"T500\"),\"\")","v":""}]
[20251230,"大倉工業",4221,"化学",5.1E-5,"TOPIX Small 2","4221",{"$f":"IFERROR(_xlfn.IFS(F481=$K$4,\"T500\",F481=$K$5,\"T500\",F481=$K$6,\"T500\"),\"\")","v":""}]
[20251230,"積水化成品工業",4228,"化学",1.2999999999999999E-5,"TOPIX Small 2","4228",{"$f":"IFERROR(_xlfn.IFS(F482=$K$4,\"T500\",F482=$K$5,\"T500\",F482=$K$6,\"T500\"),\"\")","v":""}]
[20251230,"群栄化学工業",4229,"化学",1.9000000000000001E-5,"TOPIX Small 2","4229",{"$f":"IFERROR(_xlfn.IFS(F483=$K$4,\"T500\",F483=$K$5,\"T500\",F483=$K$6,\"T500\"),\"\")","v":""}]
[20251230,"ダイキョーニシカワ",4246,"化学",3.4999999999999997E-5,"TOPIX Small 2","4246",{"$f":"IFERROR(_xlfn.IFS(F484=$K$4,\"T500\",F484=$K$5,\"T500\",F484=$K$6,\"T500\"),\"\")","v":""}]
[20251230,"森六",4249,"化学",2.8E-5,"TOPIX Small 2","4249",{"$f":"IFERROR(_xlfn.IFS(F485=$K$4,\"T500\",F485=$K$5,\"T500\",F485=$K$6,\"T500\"),\"\")","v":""}]
[20251230,"恵和",4251,"化学",1.7E-5,"TOPIX Small 2","4251",{"$f":"IFERROR(_xlfn.IFS(F486=$K$4,\"T500\",F486=$K$5,\"T500\",F486=$K$6,\"T500\"),\"\")","v":""}]
[20251230,"日本化薬",4272,"化学",2.5000000000000001E-4,"TOPIX Mid400","4272",{"$f":"IFERROR(_xlfn.IFS(F487=$K$4,\"T500\",F487=$K$5,\"T500\",F487=$K$6,\"T500\"),\"\")","v":"T500"}]
[20251230,"カーリット",4275,"化学",3.4999999999999997E-5,"TOPIX Small 2","4275",{"$f":"IFERROR(_xlfn.IFS(F488=$K$4,\"T500\",F488=$K$5,\"T500\",F488=$K$6,\"T500\"),\"\")","v":""}]
[20251230,"ＣＬホールディングス",4286,"サービス業",6.9999999999999999E-6,"TOPIX Small 2","4286",{"$f":"IFERROR(_xlfn.IFS(F489=$K$4,\"T500\",F489=$K$5,\"T500\",F489=$K$6,\"T500\"),\"\")","v":""}]
[20251230,"プレステージ・インターナショナル",4290,"サービス業",5.7000000000000003E-5,"TOPIX Small 1","4290",{"$f":"IFERROR(_xlfn.IFS(F490=$K$4,\"T500\",F490=$K$5,\"T500\",F490=$K$6,\"T500\"),\"\")","v":""}]
[20251230,"ハイマックス",4299,"情報・通信業",9.0000000000000002E-6,"TOPIX Small 2","4299",{"$f":"IFERROR(_xlfn.IFS(F491=$K$4,\"T500\",F491=$K$5,\"T500\",F491=$K$6,\"T500\"),\"\")","v":""}]
[20251230,"テクセンドフォトマスク","429A","その他製品",1.75E-4,"TOPIX Small 2","429A",{"$f":"IFERROR(_xlfn.IFS(F492=$K$4,\"T500\",F492=$K$5,\"T500\",F492=$K$6,\"T500\"),\"\")","v":""}]
[20251230,"アミューズ",4301,"サービス業",2.1999999999999999E-5,"TOPIX Small 2","4301",{"$f":"IFERROR(_xlfn.IFS(F493=$K$4,\"T500\",F493=$K$5,\"T500\",F493=$K$6,\"T500\"),\"\")","v":""}]
[20251230,"野村総合研究所",4307,"情報・通信業",2.441E-3,"TOPIX Large70","4307",{"$f":"IFERROR(_xlfn.IFS(F494=$K$4,\"T500\",F494=$K$5,\"T500\",F494=$K$6,\"T500\"),\"\")","v":"T500"}]
[20251230,"ドリームインキュベータ",4310,"サービス業",1.7E-5,"TOPIX Small 2","4310",{"$f":"IFERROR(_xlfn.IFS(F495=$K$4,\"T500\",F495=$K$5,\"T500\",F495=$K$6,\"T500\"),\"\")","v":""}]
[20251230,"クイック",4318,"サービス業",4.8000000000000001E-5,"TOPIX Small 2","4318",{"$f":"IFERROR(_xlfn.IFS(F496=$K$4,\"T500\",F496=$K$5,\"T500\",F496=$K$6,\"T500\"),\"\")","v":""}]
[20251230,"日本システム技術",4323,"情報・通信業",4.8999999999999998E-5,"TOPIX Small 2","4323",{"$f":"IFERROR(_xlfn.IFS(F497=$K$4,\"T500\",F497=$K$5,\"T500\",F497=$K$6,\"T500\"),\"\")","v":""}]
[20251230,"電通グループ",4324,"サービス業",6.8499999999999995E-4,"TOPIX Mid400","4324",{"$f":"IFERROR(_xlfn.IFS(F498=$K$4,\"T500\",F498=$K$5,\"T500\",F498=$K$6,\"T500\"),\"\")","v":"T500"}]
[20251230,"インテージホールディングス",4326,"情報・通信業",2.8E-5,"TOPIX Small 2","4326",{"$f":"IFERROR(_xlfn.IFS(F499=$K$4,\"T500\",F499=$K$5,\"T500\",F499=$K$6,\"T500\"),\"\")","v":""}]
[20251230,"テイクアンドギヴ・ニーズ",4331,"サービス業",7.9999999999999996E-6,"TOPIX Small 2","4331",{"$f":"IFERROR(_xlfn.IFS(F500=$K$4,\"T500\",F500=$K$5,\"T500\",F500=$K$6,\"T500\"),\"\")","v":""}]
[20251230,"東邦システムサイエンス",4333,"情報・通信業",1.1E-5,"TOPIX Small 2","4333",{"$f":"IFERROR(_xlfn.IFS(F501=$K$4,\"T500\",F501=$K$5,\"T500\",F501=$K$6,\"T500\"),\"\")","v":""}]
[20251230,"ぴあ",4337,"サービス業",2.5999999999999998E-5,"TOPIX Small 2","4337",{"$f":"IFERROR(_xlfn.IFS(F502=$K$4,\"T500\",F502=$K$5,\"T500\",F502=$K$6,\"T500\"),\"\")","v":""}]
[20251230,"イオンファンタジー",4343,"サービス業",2.8E-5,"TOPIX Small 2","4343",{"$f":"IFERROR(_xlfn.IFS(F503=$K$4,\"T500\",F503=$K$5,\"T500\",F503=$K$6,\"T500\"),\"\")","v":""}]
[20251230,"ソースネクスト",4344,"情報・通信業",1.5999999999999999E-5,"TOPIX Small 2","4344",{"$f":"IFERROR(_xlfn.IFS(F504=$K$4,\"T500\",F504=$K$5,\"T500\",F504=$K$6,\"T500\"),\"\")","v":""}]
[20251230,"シーティーエス",4345,"サービス業",2.6999999999999999E-5,"TOPIX Small 2","4345",{"$f":"IFERROR(_xlfn.IFS(F505=$K$4,\"T500\",F505=$K$5,\"T500\",F505=$K$6,\"T500\"),\"\")","v":""}]
[20251230,"メディカルシステムネットワーク",4350,"小売業",1.1E-5,"TOPIX Small 2","4350",{"$f":"IFERROR(_xlfn.IFS(F506=$K$4,\"T500\",F506=$K$5,\"T500\",F506=$K$6,\"T500\"),\"\")","v":""}]
[20251230,"日本精化",4362,"化学",3.6999999999999998E-5,"TOPIX Small 2","4362",{"$f":"IFERROR(_xlfn.IFS(F507=$K$4,\"T500\",F507=$K$5,\"T500\",F507=$K$6,\"T500\"),\"\")","v":""}]
[20251230,"扶桑化学工業",4368,"化学",1.3999999999999999E-4,"TOPIX Small 1","4368",{"$f":"IFERROR(_xlfn.IFS(F508=$K$4,\"T500\",F508=$K$5,\"T500\",F508=$K$6,\"T500\"),\"\")","v":""}]
[20251230,"トリケミカル研究所",4369,"化学",6.7999999999999999E-5,"TOPIX Small 1","4369",{"$f":"IFERROR(_xlfn.IFS(F509=$K$4,\"T500\",F509=$K$5,\"T500\",F509=$K$6,\"T500\"),\"\")","v":""}]
[20251230,"シンプレクス・ホールディングス",4373,"情報・通信業",1.73E-4,"TOPIX Small 1","4373",{"$f":"IFERROR(_xlfn.IFS(F510=$K$4,\"T500\",F510=$K$5,\"T500\",F510=$K$6,\"T500\"),\"\")","v":""}]
[20251230,"ＨＥＲＯＺ",4382,"情報・通信業",6.9999999999999999E-6,"TOPIX Small 2","4382",{"$f":"IFERROR(_xlfn.IFS(F511=$K$4,\"T500\",F511=$K$5,\"T500\",F511=$K$6,\"T500\"),\"\")","v":""}]
[20251230,"ラクスル",4384,"情報・通信業",7.2999999999999999E-5,"TOPIX Small 1","4384",{"$f":"IFERROR(_xlfn.IFS(F512=$K$4,\"T500\",F512=$K$5,\"T500\",F512=$K$6,\"T500\"),\"\")","v":""}]
[20251230,"メルカリ",4385,"情報・通信業",3.6400000000000001E-4,"TOPIX Mid400","4385",{"$f":"IFERROR(_xlfn.IFS(F513=$K$4,\"T500\",F513=$K$5,\"T500\",F513=$K$6,\"T500\"),\"\")","v":"T500"}]
[20251230,"アイ・ピー・エス",4390,"情報・通信業",1.8E-5,"TOPIX Small 2","4390",{"$f":"IFERROR(_xlfn.IFS(F514=$K$4,\"T500\",F514=$K$5,\"T500\",F514=$K$6,\"T500\"),\"\")","v":""}]
[20251230,"システムサポートホールディングス",4396,"情報・通信業",2.0999999999999999E-5,"TOPIX Small 2",{"$f":"TEXT(C515,0)","v":"4396"},{"$f":"IFERROR(_xlfn.IFS(F515=$K$4,\"T500\",F515=$K$5,\"T500\",F515=$K$6,\"T500\"),\"\")","v":""}]
[20251230,"ＡＤＥＫＡ",4401,"化学",3.1199999999999999E-4,"TOPIX Mid400","4401",{"$f":"IFERROR(_xlfn.IFS(F516=$K$4,\"T500\",F516=$K$5,\"T500\",F516=$K$6,\"T500\"),\"\")","v":"T500"}]
[20251230,"日油",4403,"化学",7.18E-4,"TOPIX Mid400","4403",{"$f":"IFERROR(_xlfn.IFS(F517=$K$4,\"T500\",F517=$K$5,\"T500\",F517=$K$6,\"T500\"),\"\")","v":"T500"}]
[20251230,"ハリマ化成グループ",4410,"化学",1.5E-5,"TOPIX Small 2","4410",{"$f":"IFERROR(_xlfn.IFS(F518=$K$4,\"T500\",F518=$K$5,\"T500\",F518=$K$6,\"T500\"),\"\")","v":""}]
[20251230,"ボードルア",4413,"情報・通信業",2.5999999999999998E-5,"TOPIX Small 2","4413",{"$f":"IFERROR(_xlfn.IFS(F519=$K$4,\"T500\",F519=$K$5,\"T500\",F519=$K$6,\"T500\"),\"\")","v":""}]
[20251230,"ＮＥ","441A","情報・通信業",6.9999999999999999E-6,"TOPIX Small 2","441A",{"$f":"IFERROR(_xlfn.IFS(F520=$K$4,\"T500\",F520=$K$5,\"T500\",F520=$K$6,\"T500\"),\"\")","v":""}]
[20251230,"イーソル",4420,"情報・通信業",6.9999999999999999E-6,"TOPIX Small 2","4420",{"$f":"IFERROR(_xlfn.IFS(F521=$K$4,\"T500\",F521=$K$5,\"T500\",F521=$K$6,\"T500\"),\"\")","v":""}]
[20251230,"ウイングアーク１ｓｔ",4432,"情報・通信業",7.8999999999999996E-5,"TOPIX Small 1","4432",{"$f":"IFERROR(_xlfn.IFS(F522=$K$4,\"T500\",F522=$K$5,\"T500\",F522=$K$6,\"T500\"),\"\")","v":""}]
[20251230,"ヒト・コミュニケーションズ・ホールディングス",4433,"情報・通信業",9.0000000000000002E-6,"TOPIX Small 2","4433",{"$f":"IFERROR(_xlfn.IFS(F523=$K$4,\"T500\",F523=$K$5,\"T500\",F523=$K$6,\"T500\"),\"\")","v":""}]
[20251230,"サーバーワークス",4434,"情報・通信業",7.9999999999999996E-6,"TOPIX Small 2","4434",{"$f":"IFERROR(_xlfn.IFS(F524=$K$4,\"T500\",F524=$K$5,\"T500\",F524=$K$6,\"T500\"),\"\")","v":""}]
[20251230,"Ｓａｎｓａｎ",4443,"情報・通信業",1.02E-4,"TOPIX Small 1","4443",{"$f":"IFERROR(_xlfn.IFS(F525=$K$4,\"T500\",F525=$K$5,\"T500\",F525=$K$6,\"T500\"),\"\")","v":""}]
[20251230,"ギフティ",4449,"情報・通信業",2.0000000000000002E-5,"TOPIX Small 2","4449",{"$f":"IFERROR(_xlfn.IFS(F526=$K$4,\"T500\",F526=$K$5,\"T500\",F526=$K$6,\"T500\"),\"\")","v":""}]
[20251230,"花王",4452,"化学",3.1649999999999998E-3,"TOPIX Large70","4452",{"$f":"IFERROR(_xlfn.IFS(F527=$K$4,\"T500\",F527=$K$5,\"T500\",F527=$K$6,\"T500\"),\"\")","v":"T500"}]
[20251230,"第一工業製薬",4461,"化学",6.7999999999999999E-5,"TOPIX Small 2","4461",{"$f":"IFERROR(_xlfn.IFS(F528=$K$4,\"T500\",F528=$K$5,\"T500\",F528=$K$6,\"T500\"),\"\")","v":""}]
[20251230,"石原ケミカル",4462,"化学",2.0000000000000002E-5,"TOPIX Small 2","4462",{"$f":"IFERROR(_xlfn.IFS(F529=$K$4,\"T500\",F529=$K$5,\"T500\",F529=$K$6,\"T500\"),\"\")","v":""}]
[20251230,"三洋化成工業",4471,"化学",6.7000000000000002E-5,"TOPIX Small 1","4471",{"$f":"IFERROR(_xlfn.IFS(F530=$K$4,\"T500\",F530=$K$5,\"T500\",F530=$K$6,\"T500\"),\"\")","v":""}]
[20251230,"メドレー",4480,"情報・通信業",6.0000000000000002E-5,"TOPIX Small 1","4480",{"$f":"IFERROR(_xlfn.IFS(F531=$K$4,\"T500\",F531=$K$5,\"T500\",F531=$K$6,\"T500\"),\"\")","v":""}]
[20251230,"ベース",4481,"情報・通信業",2.8E-5,"TOPIX Small 2","4481",{"$f":"IFERROR(_xlfn.IFS(F532=$K$4,\"T500\",F532=$K$5,\"T500\",F532=$K$6,\"T500\"),\"\")","v":""}]
[20251230,"ＪＭＤＣ",4483,"情報・通信業",1.21E-4,"TOPIX Small 1","4483",{"$f":"IFERROR(_xlfn.IFS(F533=$K$4,\"T500\",F533=$K$5,\"T500\",F533=$K$6,\"T500\"),\"\")","v":""}]
[20251230,"武田薬品工業",4502,"医薬品",8.9429999999999996E-3,"TOPIX Core30","4502",{"$f":"IFERROR(_xlfn.IFS(F534=$K$4,\"T500\",F534=$K$5,\"T500\",F534=$K$6,\"T500\"),\"\")","v":"T500"}]
[20251230,"アステラス製薬",4503,"医薬品",3.8159999999999999E-3,"TOPIX Large70","4503",{"$f":"IFERROR(_xlfn.IFS(F535=$K$4,\"T500\",F535=$K$5,\"T500\",F535=$K$6,\"T500\"),\"\")","v":"T500"}]
[20251230,"住友ファーマ",4506,"医薬品",4.2900000000000002E-4,"TOPIX Mid400","4506",{"$f":"IFERROR(_xlfn.IFS(F536=$K$4,\"T500\",F536=$K$5,\"T500\",F536=$K$6,\"T500\"),\"\")","v":"T500"}]
[20251230,"塩野義製薬",4507,"医薬品",2.1549999999999998E-3,"TOPIX Large70","4507",{"$f":"IFERROR(_xlfn.IFS(F537=$K$4,\"T500\",F537=$K$5,\"T500\",F537=$K$6,\"T500\"),\"\")","v":"T500"}]
[20251230,"日本新薬",4516,"医薬品",3.0800000000000001E-4,"TOPIX Mid400","4516",{"$f":"IFERROR(_xlfn.IFS(F538=$K$4,\"T500\",F538=$K$5,\"T500\",F538=$K$6,\"T500\"),\"\")","v":"T500"}]
[20251230,"中外製薬",4519,"医薬品",5.3629999999999997E-3,"TOPIX Large70","4519",{"$f":"IFERROR(_xlfn.IFS(F539=$K$4,\"T500\",F539=$K$5,\"T500\",F539=$K$6,\"T500\"),\"\")","v":"T500"}]
[20251230,"科研製薬",4521,"医薬品",1.2400000000000001E-4,"TOPIX Small 1","4521",{"$f":"IFERROR(_xlfn.IFS(F540=$K$4,\"T500\",F540=$K$5,\"T500\",F540=$K$6,\"T500\"),\"\")","v":""}]
[20251230,"エーザイ",4523,"医薬品",1.2639999999999999E-3,"TOPIX Mid400","4523",{"$f":"IFERROR(_xlfn.IFS(F541=$K$4,\"T500\",F541=$K$5,\"T500\",F541=$K$6,\"T500\"),\"\")","v":"T500"}]
[20251230,"理研ビタミン",4526,"食料品",5.3000000000000001E-5,"TOPIX Small 2","4526",{"$f":"IFERROR(_xlfn.IFS(F542=$K$4,\"T500\",F542=$K$5,\"T500\",F542=$K$6,\"T500\"),\"\")","v":""}]
[20251230,"ロート製薬",4527,"医薬品",5.7700000000000004E-4,"TOPIX Mid400","4527",{"$f":"IFERROR(_xlfn.IFS(F543=$K$4,\"T500\",F543=$K$5,\"T500\",F543=$K$6,\"T500\"),\"\")","v":"T500"}]
[20251230,"小野薬品工業",4528,"医薬品",1.008E-3,"TOPIX Mid400","4528",{"$f":"IFERROR(_xlfn.IFS(F544=$K$4,\"T500\",F544=$K$5,\"T500\",F544=$K$6,\"T500\"),\"\")","v":"T500"}]
[20251230,"久光製薬",4530,"医薬品",2.05E-4,"TOPIX Mid400","4530",{"$f":"IFERROR(_xlfn.IFS(F545=$K$4,\"T500\",F545=$K$5,\"T500\",F545=$K$6,\"T500\"),\"\")","v":"T500"}]
[20251230,"持田製薬",4534,"医薬品",9.0000000000000006E-5,"TOPIX Small 2","4534",{"$f":"IFERROR(_xlfn.IFS(F546=$K$4,\"T500\",F546=$K$5,\"T500\",F546=$K$6,\"T500\"),\"\")","v":""}]
[20251230,"参天製薬",4536,"医薬品",5.6899999999999995E-4,"TOPIX Mid400","4536",{"$f":"IFERROR(_xlfn.IFS(F547=$K$4,\"T500\",F547=$K$5,\"T500\",F547=$K$6,\"T500\"),\"\")","v":"T500"}]
[20251230,"扶桑薬品工業",4538,"医薬品",1.9000000000000001E-5,"TOPIX Small 2","4538",{"$f":"IFERROR(_xlfn.IFS(F548=$K$4,\"T500\",F548=$K$5,\"T500\",F548=$K$6,\"T500\"),\"\")","v":""}]
[20251230,"ツムラ",4540,"医薬品",2.9100000000000003E-4,"TOPIX Mid400","4540",{"$f":"IFERROR(_xlfn.IFS(F549=$K$4,\"T500\",F549=$K$5,\"T500\",F549=$K$6,\"T500\"),\"\")","v":"T500"}]
[20251230,"テルモ",4543,"精密機器",3.1259999999999999E-3,"TOPIX Large70","4543",{"$f":"IFERROR(_xlfn.IFS(F550=$K$4,\"T500\",F550=$K$5,\"T500\",F550=$K$6,\"T500\"),\"\")","v":"T500"}]
[20251230,"Ｈ．Ｕ．グループホールディングス",4544,"サービス業",2.2599999999999999E-4,"TOPIX Mid400","4544",{"$f":"IFERROR(_xlfn.IFS(F551=$K$4,\"T500\",F551=$K$5,\"T500\",F551=$K$6,\"T500\"),\"\")","v":"T500"}]
[20251230,"キッセイ薬品工業",4547,"医薬品",1.5100000000000001E-4,"TOPIX Small 1","4547",{"$f":"IFERROR(_xlfn.IFS(F552=$K$4,\"T500\",F552=$K$5,\"T500\",F552=$K$6,\"T500\"),\"\")","v":""}]
[20251230,"生化学工業",4548,"医薬品",2.5000000000000001E-5,"TOPIX Small 2","4548",{"$f":"IFERROR(_xlfn.IFS(F553=$K$4,\"T500\",F553=$K$5,\"T500\",F553=$K$6,\"T500\"),\"\")","v":""}]
[20251230,"栄研化学",4549,"医薬品",7.1000000000000005E-5,"TOPIX Small 1","4549",{"$f":"IFERROR(_xlfn.IFS(F554=$K$4,\"T500\",F554=$K$5,\"T500\",F554=$K$6,\"T500\"),\"\")","v":""}]
[20251230,"ＪＣＲファーマ",4552,"医薬品",6.3999999999999997E-5,"TOPIX Small 1","4552",{"$f":"IFERROR(_xlfn.IFS(F555=$K$4,\"T500\",F555=$K$5,\"T500\",F555=$K$6,\"T500\"),\"\")","v":""}]
[20251230,"東和薬品",4553,"医薬品",1.02E-4,"TOPIX Small 1","4553",{"$f":"IFERROR(_xlfn.IFS(F556=$K$4,\"T500\",F556=$K$5,\"T500\",F556=$K$6,\"T500\"),\"\")","v":""}]
[20251230,"富士製薬工業",4554,"医薬品",2.9E-5,"TOPIX Small 2","4554",{"$f":"IFERROR(_xlfn.IFS(F557=$K$4,\"T500\",F557=$K$5,\"T500\",F557=$K$6,\"T500\"),\"\")","v":""}]
[20251230,"ゼリア新薬工業",4559,"医薬品",5.8E-5,"TOPIX Small 1","4559",{"$f":"IFERROR(_xlfn.IFS(F558=$K$4,\"T500\",F558=$K$5,\"T500\",F558=$K$6,\"T500\"),\"\")","v":""}]
[20251230,"ネクセラファーマ",4565,"医薬品",7.4999999999999993E-5,"TOPIX Small 1","4565",{"$f":"IFERROR(_xlfn.IFS(F559=$K$4,\"T500\",F559=$K$5,\"T500\",F559=$K$6,\"T500\"),\"\")","v":""}]
[20251230,"第一三共",4568,"医薬品",6.3899999999999998E-3,"TOPIX Core30","4568",{"$f":"IFERROR(_xlfn.IFS(F560=$K$4,\"T500\",F560=$K$5,\"T500\",F560=$K$6,\"T500\"),\"\")","v":"T500"}]
[20251230,"杏林製薬",4569,"医薬品",6.3999999999999997E-5,"TOPIX Small 1","4569",{"$f":"IFERROR(_xlfn.IFS(F561=$K$4,\"T500\",F561=$K$5,\"T500\",F561=$K$6,\"T500\"),\"\")","v":""}]
[20251230,"大幸薬品",4574,"医薬品",1.2999999999999999E-5,"TOPIX Small 2","4574",{"$f":"IFERROR(_xlfn.IFS(F562=$K$4,\"T500\",F562=$K$5,\"T500\",F562=$K$6,\"T500\"),\"\")","v":""}]
[20251230,"ダイト",4577,"医薬品",3.8000000000000002E-5,"TOPIX Small 2","4577",{"$f":"IFERROR(_xlfn.IFS(F563=$K$4,\"T500\",F563=$K$5,\"T500\",F563=$K$6,\"T500\"),\"\")","v":""}]
[20251230,"大塚ホールディングス",4578,"医薬品",4.1070000000000004E-3,"TOPIX Large70","4578",{"$f":"IFERROR(_xlfn.IFS(F564=$K$4,\"T500\",F564=$K$5,\"T500\",F564=$K$6,\"T500\"),\"\")","v":"T500"}]
[20251230,"ペプチドリーム",4587,"医薬品",1.6699999999999999E-4,"TOPIX Mid400","4587",{"$f":"IFERROR(_xlfn.IFS(F565=$K$4,\"T500\",F565=$K$5,\"T500\",F565=$K$6,\"T500\"),\"\")","v":"T500"}]
[20251230,"大日本塗料",4611,"化学",3.1000000000000001E-5,"TOPIX Small 2","4611",{"$f":"IFERROR(_xlfn.IFS(F566=$K$4,\"T500\",F566=$K$5,\"T500\",F566=$K$6,\"T500\"),\"\")","v":""}]
[20251230,"日本ペイントホールディングス",4612,"化学",1.155E-3,"TOPIX Mid400","4612",{"$f":"IFERROR(_xlfn.IFS(F567=$K$4,\"T500\",F567=$K$5,\"T500\",F567=$K$6,\"T500\"),\"\")","v":"T500"}]
[20251230,"関西ペイント",4613,"化学",4.0999999999999999E-4,"TOPIX Mid400","4613",{"$f":"IFERROR(_xlfn.IFS(F568=$K$4,\"T500\",F568=$K$5,\"T500\",F568=$K$6,\"T500\"),\"\")","v":"T500"}]
[20251230,"中国塗料",4617,"化学",1.8799999999999999E-4,"TOPIX Small 1","4617",{"$f":"IFERROR(_xlfn.IFS(F569=$K$4,\"T500\",F569=$K$5,\"T500\",F569=$K$6,\"T500\"),\"\")","v":""}]
[20251230,"藤倉化成",4620,"化学",1.5E-5,"TOPIX Small 2","4620",{"$f":"IFERROR(_xlfn.IFS(F570=$K$4,\"T500\",F570=$K$5,\"T500\",F570=$K$6,\"T500\"),\"\")","v":""}]
[20251230,"太陽ホールディングス",4626,"化学",4.7399999999999997E-4,"TOPIX Mid400","4626",{"$f":"IFERROR(_xlfn.IFS(F571=$K$4,\"T500\",F571=$K$5,\"T500\",F571=$K$6,\"T500\"),\"\")","v":"T500"}]
[20251230,"ＤＩＣ",4631,"化学",2.6899999999999998E-4,"TOPIX Mid400","4631",{"$f":"IFERROR(_xlfn.IFS(F572=$K$4,\"T500\",F572=$K$5,\"T500\",F572=$K$6,\"T500\"),\"\")","v":"T500"}]
[20251230,"サカタインクス",4633,"化学",1.0900000000000001E-4,"TOPIX Small 1","4633",{"$f":"IFERROR(_xlfn.IFS(F573=$K$4,\"T500\",F573=$K$5,\"T500\",F573=$K$6,\"T500\"),\"\")","v":""}]
[20251230,"ａｒｔｉｅｎｃｅ",4634,"化学",1.34E-4,"TOPIX Small 1","4634",{"$f":"IFERROR(_xlfn.IFS(F574=$K$4,\"T500\",F574=$K$5,\"T500\",F574=$K$6,\"T500\"),\"\")","v":""}]
[20251230,"アルプス技研",4641,"サービス業",4.8000000000000001E-5,"TOPIX Small 2","4641",{"$f":"IFERROR(_xlfn.IFS(F575=$K$4,\"T500\",F575=$K$5,\"T500\",F575=$K$6,\"T500\"),\"\")","v":""}]
[20251230,"サニックスホールディングス",4651,"サービス業",6.0000000000000002E-6,"TOPIX Small 2","4651",{"$f":"IFERROR(_xlfn.IFS(F576=$K$4,\"T500\",F576=$K$5,\"T500\",F576=$K$6,\"T500\"),\"\")","v":""}]
[20251230,"日本空調サービス",4658,"サービス業",3.0000000000000001E-5,"TOPIX Small 2","4658",{"$f":"IFERROR(_xlfn.IFS(F577=$K$4,\"T500\",F577=$K$5,\"T500\",F577=$K$6,\"T500\"),\"\")","v":""}]
[20251230,"オリエンタルランド",4661,"サービス業",3.64E-3,"TOPIX Large70","4661",{"$f":"IFERROR(_xlfn.IFS(F578=$K$4,\"T500\",F578=$K$5,\"T500\",F578=$K$6,\"T500\"),\"\")","v":"T500"}]
[20251230,"フォーカスシステムズ",4662,"情報・通信業",2.5000000000000001E-5,"TOPIX Small 2",{"$f":"TEXT(C579,0)","v":"4662"},{"$f":"IFERROR(_xlfn.IFS(F579=$K$4,\"T500\",F579=$K$5,\"T500\",F579=$K$6,\"T500\"),\"\")","v":""}]
[20251230,"ダスキン",4665,"サービス業",2.0599999999999999E-4,"TOPIX Mid400","4665",{"$f":"IFERROR(_xlfn.IFS(F580=$K$4,\"T500\",F580=$K$5,\"T500\",F580=$K$6,\"T500\"),\"\")","v":"T500"}]
[20251230,"パーク２４",4666,"不動産業",3.0499999999999999E-4,"TOPIX Mid400","4666",{"$f":"IFERROR(_xlfn.IFS(F581=$K$4,\"T500\",F581=$K$5,\"T500\",F581=$K$6,\"T500\"),\"\")","v":"T500"}]
[20251230,"明光ネットワークジャパン",4668,"サービス業",2.0000000000000002E-5,"TOPIX Small 2","4668",{"$f":"IFERROR(_xlfn.IFS(F582=$K$4,\"T500\",F582=$K$5,\"T500\",F582=$K$6,\"T500\"),\"\")","v":""}]
[20251230,"ファルコホールディングス",4671,"サービス業",2.1999999999999999E-5,"TOPIX Small 2","4671",{"$f":"IFERROR(_xlfn.IFS(F583=$K$4,\"T500\",F583=$K$5,\"T500\",F583=$K$6,\"T500\"),\"\")","v":""}]
[20251230,"クレスコ",4674,"情報・通信業",6.3E-5,"TOPIX Small 2","4674",{"$f":"IFERROR(_xlfn.IFS(F584=$K$4,\"T500\",F584=$K$5,\"T500\",F584=$K$6,\"T500\"),\"\")","v":""}]
[20251230,"フジ・メディア・ホールディングス",4676,"情報・通信業",6.0300000000000002E-4,"TOPIX Mid400","4676",{"$f":"IFERROR(_xlfn.IFS(F585=$K$4,\"T500\",F585=$K$5,\"T500\",F585=$K$6,\"T500\"),\"\")","v":"T500"}]
[20251230,"ラウンドワン",4680,"サービス業",2.2599999999999999E-4,"TOPIX Mid400","4680",{"$f":"IFERROR(_xlfn.IFS(F586=$K$4,\"T500\",F586=$K$5,\"T500\",F586=$K$6,\"T500\"),\"\")","v":"T500"}]
[20251230,"リゾートトラスト",4681,"サービス業",3.9599999999999998E-4,"TOPIX Mid400","4681",{"$f":"IFERROR(_xlfn.IFS(F587=$K$4,\"T500\",F587=$K$5,\"T500\",F587=$K$6,\"T500\"),\"\")","v":"T500"}]
[20251230,"オービック",4684,"情報・通信業",1.9E-3,"TOPIX Mid400","4684",{"$f":"IFERROR(_xlfn.IFS(F588=$K$4,\"T500\",F588=$K$5,\"T500\",F588=$K$6,\"T500\"),\"\")","v":"T500"}]
[20251230,"ジャストシステム",4686,"情報・通信業",1.5100000000000001E-4,"TOPIX Small 1","4686",{"$f":"IFERROR(_xlfn.IFS(F589=$K$4,\"T500\",F589=$K$5,\"T500\",F589=$K$6,\"T500\"),\"\")","v":""}]
[20251230,"ＴＤＣソフト",4687,"情報・通信業",5.3000000000000001E-5,"TOPIX Small 2","4687",{"$f":"IFERROR(_xlfn.IFS(F590=$K$4,\"T500\",F590=$K$5,\"T500\",F590=$K$6,\"T500\"),\"\")","v":""}]
[20251230,"ＬＩＮＥヤフー",4689,"情報・通信業",1.335E-3,"TOPIX Large70","4689",{"$f":"IFERROR(_xlfn.IFS(F591=$K$4,\"T500\",F591=$K$5,\"T500\",F591=$K$6,\"T500\"),\"\")","v":"T500"}]
[20251230,"ビー・エム・エル",4694,"サービス業",1.1E-4,"TOPIX Small 1","4694",{"$f":"IFERROR(_xlfn.IFS(F592=$K$4,\"T500\",F592=$K$5,\"T500\",F592=$K$6,\"T500\"),\"\")","v":""}]
[20251230,"トレンドマイクロ",4704,"情報・通信業",7.8100000000000001E-4,"TOPIX Mid400","4704",{"$f":"IFERROR(_xlfn.IFS(F593=$K$4,\"T500\",F593=$K$5,\"T500\",F593=$K$6,\"T500\"),\"\")","v":"T500"}]
[20251230,"ＩＤホールディングス",4709,"情報・通信業",2.9E-5,"TOPIX Small 2","4709",{"$f":"IFERROR(_xlfn.IFS(F594=$K$4,\"T500\",F594=$K$5,\"T500\",F594=$K$6,\"T500\"),\"\")","v":""}]
[20251230,"リソー教育グループ",4714,"サービス業",1.2999999999999999E-5,"TOPIX Small 2","4714",{"$f":"IFERROR(_xlfn.IFS(F595=$K$4,\"T500\",F595=$K$5,\"T500\",F595=$K$6,\"T500\"),\"\")","v":""}]
[20251230,"日本オラクル",4716,"情報・通信業",5.2499999999999997E-4,"TOPIX Mid400","4716",{"$f":"IFERROR(_xlfn.IFS(F596=$K$4,\"T500\",F596=$K$5,\"T500\",F596=$K$6,\"T500\"),\"\")","v":"T500"}]
[20251230,"早稲田アカデミー",4718,"サービス業",2.3E-5,"TOPIX Small 2","4718",{"$f":"IFERROR(_xlfn.IFS(F597=$K$4,\"T500\",F597=$K$5,\"T500\",F597=$K$6,\"T500\"),\"\")","v":""}]
[20251230,"アルファシステムズ",4719,"情報・通信業",2.5999999999999998E-5,"TOPIX Small 2","4719",{"$f":"IFERROR(_xlfn.IFS(F598=$K$4,\"T500\",F598=$K$5,\"T500\",F598=$K$6,\"T500\"),\"\")","v":""}]
[20251230,"フューチャー",4722,"情報・通信業",8.7999999999999998E-5,"TOPIX Small 1","4722",{"$f":"IFERROR(_xlfn.IFS(F599=$K$4,\"T500\",F599=$K$5,\"T500\",F599=$K$6,\"T500\"),\"\")","v":""}]
[20251230,"ＣＡＣ　Ｈｏｌｄｉｎｇｓ",4725,"情報・通信業",2.5999999999999998E-5,"TOPIX Small 2","4725",{"$f":"IFERROR(_xlfn.IFS(F600=$K$4,\"T500\",F600=$K$5,\"T500\",F600=$K$6,\"T500\"),\"\")","v":""}]
[20251230,"ユー・エス・エス",4732,"サービス業",6.9399999999999996E-4,"TOPIX Mid400","4732",{"$f":"IFERROR(_xlfn.IFS(F601=$K$4,\"T500\",F601=$K$5,\"T500\",F601=$K$6,\"T500\"),\"\")","v":"T500"}]
[20251230,"オービックビジネスコンサルタント",4733,"情報・通信業",2.9599999999999998E-4,"TOPIX Mid400","4733",{"$f":"IFERROR(_xlfn.IFS(F602=$K$4,\"T500\",F602=$K$5,\"T500\",F602=$K$6,\"T500\"),\"\")","v":"T500"}]
[20251230,"アイティフォー",4743,"情報・通信業",3.6999999999999998E-5,"TOPIX Small 2","4743",{"$f":"IFERROR(_xlfn.IFS(F603=$K$4,\"T500\",F603=$K$5,\"T500\",F603=$K$6,\"T500\"),\"\")","v":""}]
[20251230,"東計電算",4746,"情報・通信業",2.3E-5,"TOPIX Small 2","4746",{"$f":"IFERROR(_xlfn.IFS(F604=$K$4,\"T500\",F604=$K$5,\"T500\",F604=$K$6,\"T500\"),\"\")","v":""}]
[20251230,"サイバーエージェント",4751,"サービス業",5.7799999999999995E-4,"TOPIX Mid400","4751",{"$f":"IFERROR(_xlfn.IFS(F605=$K$4,\"T500\",F605=$K$5,\"T500\",F605=$K$6,\"T500\"),\"\")","v":"T500"}]
[20251230,"楽天グループ",4755,"サービス業",1.688E-3,"TOPIX Mid400","4755",{"$f":"IFERROR(_xlfn.IFS(F606=$K$4,\"T500\",F606=$K$5,\"T500\",F606=$K$6,\"T500\"),\"\")","v":"T500"}]
[20251230,"クリーク・アンド・リバー社",4763,"サービス業",1.9000000000000001E-5,"TOPIX Small 2","4763",{"$f":"IFERROR(_xlfn.IFS(F607=$K$4,\"T500\",F607=$K$5,\"T500\",F607=$K$6,\"T500\"),\"\")","v":""}]
[20251230,"ＳＢＩグローバルアセットマネジメント",4765,"サービス業",2.4000000000000001E-5,"TOPIX Small 2","4765",{"$f":"IFERROR(_xlfn.IFS(F608=$K$4,\"T500\",F608=$K$5,\"T500\",F608=$K$6,\"T500\"),\"\")","v":""}]
[20251230,"テー・オー・ダブリュー",4767,"サービス業",1.4E-5,"TOPIX Small 2","4767",{"$f":"IFERROR(_xlfn.IFS(F609=$K$4,\"T500\",F609=$K$5,\"T500\",F609=$K$6,\"T500\"),\"\")","v":""}]
[20251230,"大塚商会",4768,"情報・通信業",7.6099999999999996E-4,"TOPIX Mid400","4768",{"$f":"IFERROR(_xlfn.IFS(F610=$K$4,\"T500\",F610=$K$5,\"T500\",F610=$K$6,\"T500\"),\"\")","v":"T500"}]
[20251230,"サイボウズ",4776,"情報・通信業",8.1000000000000004E-5,"TOPIX Small 1","4776",{"$f":"IFERROR(_xlfn.IFS(F611=$K$4,\"T500\",F611=$K$5,\"T500\",F611=$K$6,\"T500\"),\"\")","v":""}]
[20251230,"ＧＭＯインターネット",4784,"サービス業",5.0000000000000004E-6,"TOPIX Small 2","4784",{"$f":"IFERROR(_xlfn.IFS(F612=$K$4,\"T500\",F612=$K$5,\"T500\",F612=$K$6,\"T500\"),\"\")","v":""}]
[20251230,"山田コンサルティンググループ",4792,"サービス業",1.5999999999999999E-5,"TOPIX Small 2","4792",{"$f":"IFERROR(_xlfn.IFS(F613=$K$4,\"T500\",F613=$K$5,\"T500\",F613=$K$6,\"T500\"),\"\")","v":""}]
[20251230,"セントラルスポーツ",4801,"サービス業",2.1999999999999999E-5,"TOPIX Small 2","4801",{"$f":"IFERROR(_xlfn.IFS(F614=$K$4,\"T500\",F614=$K$5,\"T500\",F614=$K$6,\"T500\"),\"\")","v":""}]
[20251230,"パラカ",4809,"不動産業",1.2E-5,"TOPIX Small 2","4809",{"$f":"IFERROR(_xlfn.IFS(F615=$K$4,\"T500\",F615=$K$5,\"T500\",F615=$K$6,\"T500\"),\"\")","v":""}]
[20251230,"電通総研",4812,"情報・通信業",2.0699999999999999E-4,"TOPIX Small 1","4812",{"$f":"IFERROR(_xlfn.IFS(F616=$K$4,\"T500\",F616=$K$5,\"T500\",F616=$K$6,\"T500\"),\"\")","v":""}]
[20251230,"デジタルガレージ",4819,"情報・通信業",8.0000000000000007E-5,"TOPIX Small 1","4819",{"$f":"IFERROR(_xlfn.IFS(F617=$K$4,\"T500\",F617=$K$5,\"T500\",F617=$K$6,\"T500\"),\"\")","v":""}]
[20251230,"イーエムシステムズ",4820,"情報・通信業",2.1999999999999999E-5,"TOPIX Small 2","4820",{"$f":"IFERROR(_xlfn.IFS(F618=$K$4,\"T500\",F618=$K$5,\"T500\",F618=$K$6,\"T500\"),\"\")","v":""}]
[20251230,"ウェザーニューズ",4825,"情報・通信業",6.4999999999999994E-5,"TOPIX Small 1","4825",{"$f":"IFERROR(_xlfn.IFS(F619=$K$4,\"T500\",F619=$K$5,\"T500\",F619=$K$6,\"T500\"),\"\")","v":""}]
[20251230,"ＣＩＪ",4826,"情報・通信業",2.9E-5,"TOPIX Small 2","4826",{"$f":"IFERROR(_xlfn.IFS(F620=$K$4,\"T500\",F620=$K$5,\"T500\",F620=$K$6,\"T500\"),\"\")","v":""}]
[20251230,"ビジネスエンジニアリング",4828,"情報・通信業",4.1999999999999998E-5,"TOPIX Small 2","4828",{"$f":"IFERROR(_xlfn.IFS(F621=$K$4,\"T500\",F621=$K$5,\"T500\",F621=$K$6,\"T500\"),\"\")","v":""}]
[20251230,"ＷＯＷＯＷ",4839,"情報・通信業",2.3E-5,"TOPIX Small 2","4839",{"$f":"IFERROR(_xlfn.IFS(F622=$K$4,\"T500\",F622=$K$5,\"T500\",F622=$K$6,\"T500\"),\"\")","v":""}]
[20251230,"スカラ",4845,"情報・通信業",6.9999999999999999E-6,"TOPIX Small 2","4845",{"$f":"IFERROR(_xlfn.IFS(F623=$K$4,\"T500\",F623=$K$5,\"T500\",F623=$K$6,\"T500\"),\"\")","v":""}]
[20251230,"フルキャストホールディングス",4848,"サービス業",2.6999999999999999E-5,"TOPIX Small 2","4848",{"$f":"IFERROR(_xlfn.IFS(F624=$K$4,\"T500\",F624=$K$5,\"T500\",F624=$K$6,\"T500\"),\"\")","v":""}]
[20251230,"エン",4849,"サービス業",5.3000000000000001E-5,"TOPIX Small 1","4849",{"$f":"IFERROR(_xlfn.IFS(F625=$K$4,\"T500\",F625=$K$5,\"T500\",F625=$K$6,\"T500\"),\"\")","v":""}]
[20251230,"セルソース",4880,"医薬品",5.0000000000000004E-6,"TOPIX Small 2","4880",{"$f":"IFERROR(_xlfn.IFS(F626=$K$4,\"T500\",F626=$K$5,\"T500\",F626=$K$6,\"T500\"),\"\")","v":""}]
[20251230,"あすか製薬ホールディングス",4886,"医薬品",4.1E-5,"TOPIX Small 2","4886",{"$f":"IFERROR(_xlfn.IFS(F627=$K$4,\"T500\",F627=$K$5,\"T500\",F627=$K$6,\"T500\"),\"\")","v":""}]
[20251230,"サワイグループホールディングス",4887,"医薬品",2.5300000000000002E-4,"TOPIX Mid400","4887",{"$f":"IFERROR(_xlfn.IFS(F628=$K$4,\"T500\",F628=$K$5,\"T500\",F628=$K$6,\"T500\"),\"\")","v":"T500"}]
[20251230,"富士フイルムホールディングス",4901,"化学",4.1910000000000003E-3,"TOPIX Large70","4901",{"$f":"IFERROR(_xlfn.IFS(F629=$K$4,\"T500\",F629=$K$5,\"T500\",F629=$K$6,\"T500\"),\"\")","v":"T500"}]
[20251230,"コニカミノルタ",4902,"電気機器",3.1799999999999998E-4,"TOPIX Mid400","4902",{"$f":"IFERROR(_xlfn.IFS(F630=$K$4,\"T500\",F630=$K$5,\"T500\",F630=$K$6,\"T500\"),\"\")","v":"T500"}]
[20251230,"資生堂",4911,"化学",9.1799999999999998E-4,"TOPIX Mid400","4911",{"$f":"IFERROR(_xlfn.IFS(F631=$K$4,\"T500\",F631=$K$5,\"T500\",F631=$K$6,\"T500\"),\"\")","v":"T500"}]
[20251230,"ライオン",4912,"化学",3.9300000000000001E-4,"TOPIX Mid400","4912",{"$f":"IFERROR(_xlfn.IFS(F632=$K$4,\"T500\",F632=$K$5,\"T500\",F632=$K$6,\"T500\"),\"\")","v":"T500"}]
[20251230,"高砂香料工業",4914,"化学",1.15E-4,"TOPIX Small 1","4914",{"$f":"IFERROR(_xlfn.IFS(F633=$K$4,\"T500\",F633=$K$5,\"T500\",F633=$K$6,\"T500\"),\"\")","v":""}]
[20251230,"マンダム",4917,"化学",1.22E-4,"TOPIX Small 1","4917",{"$f":"IFERROR(_xlfn.IFS(F634=$K$4,\"T500\",F634=$K$5,\"T500\",F634=$K$6,\"T500\"),\"\")","v":""}]
[20251230,"ミルボン",4919,"化学",8.1000000000000004E-5,"TOPIX Small 1","4919",{"$f":"IFERROR(_xlfn.IFS(F635=$K$4,\"T500\",F635=$K$5,\"T500\",F635=$K$6,\"T500\"),\"\")","v":""}]
[20251230,"コーセー",4922,"化学",2.4600000000000002E-4,"TOPIX Mid400","4922",{"$f":"IFERROR(_xlfn.IFS(F636=$K$4,\"T500\",F636=$K$5,\"T500\",F636=$K$6,\"T500\"),\"\")","v":"T500"}]
[20251230,"コタ",4923,"化学",2.5999999999999998E-5,"TOPIX Small 2","4923",{"$f":"IFERROR(_xlfn.IFS(F637=$K$4,\"T500\",F637=$K$5,\"T500\",F637=$K$6,\"T500\"),\"\")","v":""}]
[20251230,"ポーラ・オルビスホールディングス",4927,"化学",1.3899999999999999E-4,"TOPIX Mid400","4927",{"$f":"IFERROR(_xlfn.IFS(F638=$K$4,\"T500\",F638=$K$5,\"T500\",F638=$K$6,\"T500\"),\"\")","v":"T500"}]
[20251230,"ノエビアホールディングス",4928,"化学",8.5000000000000006E-5,"TOPIX Small 1","4928",{"$f":"IFERROR(_xlfn.IFS(F639=$K$4,\"T500\",F639=$K$5,\"T500\",F639=$K$6,\"T500\"),\"\")","v":""}]
[20251230,"新日本製薬",4931,"化学",2.4000000000000001E-5,"TOPIX Small 2","4931",{"$f":"IFERROR(_xlfn.IFS(F640=$K$4,\"T500\",F640=$K$5,\"T500\",F640=$K$6,\"T500\"),\"\")","v":""}]
[20251230,"Ｉ－ｎｅ",4933,"化学",6.9999999999999999E-6,"TOPIX Small 2","4933",{"$f":"IFERROR(_xlfn.IFS(F641=$K$4,\"T500\",F641=$K$5,\"T500\",F641=$K$6,\"T500\"),\"\")","v":""}]
[20251230,"アクシージア",4936,"化学",5.0000000000000004E-6,"TOPIX Small 2","4936",{"$f":"IFERROR(_xlfn.IFS(F642=$K$4,\"T500\",F642=$K$5,\"T500\",F642=$K$6,\"T500\"),\"\")","v":""}]
[20251230,"エステー",4951,"化学",3.0000000000000001E-5,"TOPIX Small 2",{"$f":"TEXT(C643,0)","v":"4951"},{"$f":"IFERROR(_xlfn.IFS(F643=$K$4,\"T500\",F643=$K$5,\"T500\",F643=$K$6,\"T500\"),\"\")","v":""}]
[20251230,"コニシ",4956,"化学",8.7000000000000001E-5,"TOPIX Small 2","4956",{"$f":"IFERROR(_xlfn.IFS(F644=$K$4,\"T500\",F644=$K$5,\"T500\",F644=$K$6,\"T500\"),\"\")","v":""}]
[20251230,"長谷川香料",4958,"化学",1.12E-4,"TOPIX Small 1","4958",{"$f":"IFERROR(_xlfn.IFS(F645=$K$4,\"T500\",F645=$K$5,\"T500\",F645=$K$6,\"T500\"),\"\")","v":""}]
[20251230,"小林製薬",4967,"化学",2.9599999999999998E-4,"TOPIX Mid400","4967",{"$f":"IFERROR(_xlfn.IFS(F646=$K$4,\"T500\",F646=$K$5,\"T500\",F646=$K$6,\"T500\"),\"\")","v":"T500"}]
[20251230,"荒川化学工業",4968,"化学",2.0999999999999999E-5,"TOPIX Small 2","4968",{"$f":"IFERROR(_xlfn.IFS(F647=$K$4,\"T500\",F647=$K$5,\"T500\",F647=$K$6,\"T500\"),\"\")","v":""}]
[20251230,"メック",4971,"化学",7.7000000000000001E-5,"TOPIX Small 1","4971",{"$f":"IFERROR(_xlfn.IFS(F648=$K$4,\"T500\",F648=$K$5,\"T500\",F648=$K$6,\"T500\"),\"\")","v":""}]
[20251230,"日本高純度化学",4973,"化学",1.8E-5,"TOPIX Small 2","4973",{"$f":"IFERROR(_xlfn.IFS(F649=$K$4,\"T500\",F649=$K$5,\"T500\",F649=$K$6,\"T500\"),\"\")","v":""}]
[20251230,"タカラバイオ",4974,"化学",4.5000000000000003E-5,"TOPIX Small 1","4974",{"$f":"IFERROR(_xlfn.IFS(F650=$K$4,\"T500\",F650=$K$5,\"T500\",F650=$K$6,\"T500\"),\"\")","v":""}]
[20251230,"ＪＣＵ",4975,"化学",1.11E-4,"TOPIX Small 1","4975",{"$f":"IFERROR(_xlfn.IFS(F651=$K$4,\"T500\",F651=$K$5,\"T500\",F651=$K$6,\"T500\"),\"\")","v":""}]
[20251230,"ＯＡＴアグリオ",4979,"化学",1.7E-5,"TOPIX Small 2","4979",{"$f":"IFERROR(_xlfn.IFS(F652=$K$4,\"T500\",F652=$K$5,\"T500\",F652=$K$6,\"T500\"),\"\")","v":""}]
[20251230,"デクセリアルズ",4980,"化学",4.6700000000000002E-4,"TOPIX Mid400","4980",{"$f":"IFERROR(_xlfn.IFS(F653=$K$4,\"T500\",F653=$K$5,\"T500\",F653=$K$6,\"T500\"),\"\")","v":"T500"}]
[20251230,"アース製薬",4985,"化学",9.3999999999999994E-5,"TOPIX Small 1","4985",{"$f":"IFERROR(_xlfn.IFS(F654=$K$4,\"T500\",F654=$K$5,\"T500\",F654=$K$6,\"T500\"),\"\")","v":""}]
[20251230,"北興化学工業",4992,"化学",2.5000000000000001E-5,"TOPIX Small 2","4992",{"$f":"IFERROR(_xlfn.IFS(F655=$K$4,\"T500\",F655=$K$5,\"T500\",F655=$K$6,\"T500\"),\"\")","v":""}]
[20251230,"大成ラミックグループ",4994,"化学",1.5999999999999999E-5,"TOPIX Small 2","4994",{"$f":"IFERROR(_xlfn.IFS(F656=$K$4,\"T500\",F656=$K$5,\"T500\",F656=$K$6,\"T500\"),\"\")","v":""}]
[20251230,"クミアイ化学工業",4996,"化学",6.4999999999999994E-5,"TOPIX Small 1","4996",{"$f":"IFERROR(_xlfn.IFS(F657=$K$4,\"T500\",F657=$K$5,\"T500\",F657=$K$6,\"T500\"),\"\")","v":""}]
[20251230,"日本農薬",4997,"化学",3.1999999999999999E-5,"TOPIX Small 2","4997",{"$f":"IFERROR(_xlfn.IFS(F658=$K$4,\"T500\",F658=$K$5,\"T500\",F658=$K$6,\"T500\"),\"\")","v":""}]
[20251230,"ニチレキグループ",5011,"石油・石炭製品",5.3999999999999998E-5,"TOPIX Small 2","5011",{"$f":"IFERROR(_xlfn.IFS(F659=$K$4,\"T500\",F659=$K$5,\"T500\",F659=$K$6,\"T500\"),\"\")","v":""}]
[20251230,"ユシロ",5013,"石油・石炭製品",3.0000000000000001E-5,"TOPIX Small 2","5013",{"$f":"IFERROR(_xlfn.IFS(F660=$K$4,\"T500\",F660=$K$5,\"T500\",F660=$K$6,\"T500\"),\"\")","v":""}]
[20251230,"ＪＸ金属",5016,"非鉄金属",1.1640000000000001E-3,"TOPIX Mid400","5016",{"$f":"IFERROR(_xlfn.IFS(F661=$K$4,\"T500\",F661=$K$5,\"T500\",F661=$K$6,\"T500\"),\"\")","v":"T500"}]
[20251230,"出光興産",5019,"石油・石炭製品",1.0629999999999999E-3,"TOPIX Mid400","5019",{"$f":"IFERROR(_xlfn.IFS(F662=$K$4,\"T500\",F662=$K$5,\"T500\",F662=$K$6,\"T500\"),\"\")","v":"T500"}]
[20251230,"ＥＮＥＯＳホールディングス",5020,"石油・石炭製品",3.251E-3,"TOPIX Large70","5020",{"$f":"IFERROR(_xlfn.IFS(F663=$K$4,\"T500\",F663=$K$5,\"T500\",F663=$K$6,\"T500\"),\"\")","v":"T500"}]
[20251230,"コスモエネルギーホールディングス",5021,"石油・石炭製品",4.8099999999999998E-4,"TOPIX Mid400","5021",{"$f":"IFERROR(_xlfn.IFS(F664=$K$4,\"T500\",F664=$K$5,\"T500\",F664=$K$6,\"T500\"),\"\")","v":"T500"}]
[20251230,"ＡＮＹＣＯＬＯＲ",5032,"情報・通信業",1.3799999999999999E-4,"TOPIX Small 1","5032",{"$f":"IFERROR(_xlfn.IFS(F665=$K$4,\"T500\",F665=$K$5,\"T500\",F665=$K$6,\"T500\"),\"\")","v":""}]
[20251230,"日本ビジネスシステムズ",5036,"情報・通信業",1.9000000000000001E-5,"TOPIX Small 2","5036",{"$f":"IFERROR(_xlfn.IFS(F666=$K$4,\"T500\",F666=$K$5,\"T500\",F666=$K$6,\"T500\"),\"\")","v":""}]
[20251230,"テスホールディングス",5074,"建設業",1.7E-5,"TOPIX Small 2","5074",{"$f":"IFERROR(_xlfn.IFS(F667=$K$4,\"T500\",F667=$K$5,\"T500\",F667=$K$6,\"T500\"),\"\")","v":""}]
[20251230,"インフロニア・ホールディングス",5076,"建設業",4.55E-4,"TOPIX Mid400","5076",{"$f":"IFERROR(_xlfn.IFS(F668=$K$4,\"T500\",F668=$K$5,\"T500\",F668=$K$6,\"T500\"),\"\")","v":"T500"}]
[20251230,"横浜ゴム",5101,"ゴム製品",6.9800000000000005E-4,"TOPIX Mid400","5101",{"$f":"IFERROR(_xlfn.IFS(F669=$K$4,\"T500\",F669=$K$5,\"T500\",F669=$K$6,\"T500\"),\"\")","v":"T500"}]
[20251230,"ＴＯＹＯ　ＴＩＲＥ",5105,"ゴム製品",5.6999999999999998E-4,"TOPIX Mid400","5105",{"$f":"IFERROR(_xlfn.IFS(F670=$K$4,\"T500\",F670=$K$5,\"T500\",F670=$K$6,\"T500\"),\"\")","v":"T500"}]
[20251230,"ブリヂストン",5108,"ゴム製品",4.2760000000000003E-3,"TOPIX Large70","5108",{"$f":"IFERROR(_xlfn.IFS(F671=$K$4,\"T500\",F671=$K$5,\"T500\",F671=$K$6,\"T500\"),\"\")","v":"T500"}]
[20251230,"住友ゴム工業",5110,"ゴム製品",5.4100000000000003E-4,"TOPIX Mid400","5110",{"$f":"IFERROR(_xlfn.IFS(F672=$K$4,\"T500\",F672=$K$5,\"T500\",F672=$K$6,\"T500\"),\"\")","v":"T500"}]
[20251230,"藤倉コンポジット",5121,"ゴム製品",3.4999999999999997E-5,"TOPIX Small 2","5121",{"$f":"IFERROR(_xlfn.IFS(F673=$K$4,\"T500\",F673=$K$5,\"T500\",F673=$K$6,\"T500\"),\"\")","v":""}]
[20251230,"オカモト",5122,"ゴム製品",6.0000000000000002E-5,"TOPIX Small 2","5122",{"$f":"IFERROR(_xlfn.IFS(F674=$K$4,\"T500\",F674=$K$5,\"T500\",F674=$K$6,\"T500\"),\"\")","v":""}]
[20251230,"アキレス",5142,"化学",1.5999999999999999E-5,"TOPIX Small 2","5142",{"$f":"IFERROR(_xlfn.IFS(F675=$K$4,\"T500\",F675=$K$5,\"T500\",F675=$K$6,\"T500\"),\"\")","v":""}]
[20251230,"フコク",5185,"ゴム製品",2.0999999999999999E-5,"TOPIX Small 2","5185",{"$f":"IFERROR(_xlfn.IFS(F676=$K$4,\"T500\",F676=$K$5,\"T500\",F676=$K$6,\"T500\"),\"\")","v":""}]
[20251230,"ニッタ",5186,"ゴム製品",8.6000000000000003E-5,"TOPIX Small 2","5186",{"$f":"IFERROR(_xlfn.IFS(F677=$K$4,\"T500\",F677=$K$5,\"T500\",F677=$K$6,\"T500\"),\"\")","v":""}]
[20251230,"三ツ星ベルト",5192,"ゴム製品",1.0399999999999999E-4,"TOPIX Small 1","5192",{"$f":"IFERROR(_xlfn.IFS(F678=$K$4,\"T500\",F678=$K$5,\"T500\",F678=$K$6,\"T500\"),\"\")","v":""}]
[20251230,"バンドー化学",5195,"ゴム製品",6.3E-5,"TOPIX Small 2","5195",{"$f":"IFERROR(_xlfn.IFS(F679=$K$4,\"T500\",F679=$K$5,\"T500\",F679=$K$6,\"T500\"),\"\")","v":""}]
[20251230,"ＡＧＣ",5201,"ガラス・土石製品",1.0499999999999999E-3,"TOPIX Mid400","5201",{"$f":"IFERROR(_xlfn.IFS(F680=$K$4,\"T500\",F680=$K$5,\"T500\",F680=$K$6,\"T500\"),\"\")","v":"T500"}]
[20251230,"日本板硝子",5202,"ガラス・土石製品",6.7999999999999999E-5,"TOPIX Small 1","5202",{"$f":"IFERROR(_xlfn.IFS(F681=$K$4,\"T500\",F681=$K$5,\"T500\",F681=$K$6,\"T500\"),\"\")","v":""}]
[20251230,"有沢製作所",5208,"化学",6.3E-5,"TOPIX Small 1","5208",{"$f":"IFERROR(_xlfn.IFS(F682=$K$4,\"T500\",F682=$K$5,\"T500\",F682=$K$6,\"T500\"),\"\")","v":""}]
[20251230,"日本電気硝子",5214,"ガラス・土石製品",4.2700000000000002E-4,"TOPIX Mid400","5214",{"$f":"IFERROR(_xlfn.IFS(F683=$K$4,\"T500\",F683=$K$5,\"T500\",F683=$K$6,\"T500\"),\"\")","v":"T500"}]
[20251230,"オハラ",5218,"ガラス・土石製品",7.9999999999999996E-6,"TOPIX Small 2","5218",{"$f":"IFERROR(_xlfn.IFS(F684=$K$4,\"T500\",F684=$K$5,\"T500\",F684=$K$6,\"T500\"),\"\")","v":""}]
[20251230,"住友大阪セメント",5232,"ガラス・土石製品",1.37E-4,"TOPIX Mid400","5232",{"$f":"IFERROR(_xlfn.IFS(F685=$K$4,\"T500\",F685=$K$5,\"T500\",F685=$K$6,\"T500\"),\"\")","v":"T500"}]
[20251230,"太平洋セメント",5233,"ガラス・土石製品",4.9799999999999996E-4,"TOPIX Mid400","5233",{"$f":"IFERROR(_xlfn.IFS(F686=$K$4,\"T500\",F686=$K$5,\"T500\",F686=$K$6,\"T500\"),\"\")","v":"T500"}]
[20251230,"日本ヒューム",5262,"ガラス・土石製品",5.5000000000000002E-5,"TOPIX Small 1","5262",{"$f":"IFERROR(_xlfn.IFS(F687=$K$4,\"T500\",F687=$K$5,\"T500\",F687=$K$6,\"T500\"),\"\")","v":""}]
[20251230,"日本コンクリート工業",5269,"ガラス・土石製品",1.2999999999999999E-5,"TOPIX Small 2","5269",{"$f":"IFERROR(_xlfn.IFS(F688=$K$4,\"T500\",F688=$K$5,\"T500\",F688=$K$6,\"T500\"),\"\")","v":""}]
[20251230,"三谷セキサン",5273,"ガラス・土石製品",6.9999999999999994E-5,"TOPIX Small 2","5273",{"$f":"IFERROR(_xlfn.IFS(F689=$K$4,\"T500\",F689=$K$5,\"T500\",F689=$K$6,\"T500\"),\"\")","v":""}]
[20251230,"アジアパイルホールディングス",5288,"ガラス・土石製品",4.6E-5,"TOPIX Small 2","5288",{"$f":"IFERROR(_xlfn.IFS(F690=$K$4,\"T500\",F690=$K$5,\"T500\",F690=$K$6,\"T500\"),\"\")","v":""}]
[20251230,"東海カーボン",5301,"ガラス・土石製品",2.03E-4,"TOPIX Mid400","5301",{"$f":"IFERROR(_xlfn.IFS(F691=$K$4,\"T500\",F691=$K$5,\"T500\",F691=$K$6,\"T500\"),\"\")","v":"T500"}]
[20251230,"日本カーボン",5302,"ガラス・土石製品",5.3000000000000001E-5,"TOPIX Small 1","5302",{"$f":"IFERROR(_xlfn.IFS(F692=$K$4,\"T500\",F692=$K$5,\"T500\",F692=$K$6,\"T500\"),\"\")","v":""}]
[20251230,"東洋炭素",5310,"ガラス・土石製品",8.6000000000000003E-5,"TOPIX Small 1","5310",{"$f":"IFERROR(_xlfn.IFS(F693=$K$4,\"T500\",F693=$K$5,\"T500\",F693=$K$6,\"T500\"),\"\")","v":""}]
[20251230,"ノリタケ",5331,"ガラス・土石製品",1.2400000000000001E-4,"TOPIX Small 1","5331",{"$f":"IFERROR(_xlfn.IFS(F694=$K$4,\"T500\",F694=$K$5,\"T500\",F694=$K$6,\"T500\"),\"\")","v":""}]
[20251230,"ＴＯＴＯ",5332,"ガラス・土石製品",5.5900000000000004E-4,"TOPIX Mid400","5332",{"$f":"IFERROR(_xlfn.IFS(F695=$K$4,\"T500\",F695=$K$5,\"T500\",F695=$K$6,\"T500\"),\"\")","v":"T500"}]
[20251230,"日本碍子",5333,"ガラス・土石製品",7.7399999999999995E-4,"TOPIX Mid400","5333",{"$f":"IFERROR(_xlfn.IFS(F696=$K$4,\"T500\",F696=$K$5,\"T500\",F696=$K$6,\"T500\"),\"\")","v":"T500"}]
[20251230,"日本特殊陶業",5334,"ガラス・土石製品",1.1709999999999999E-3,"TOPIX Mid400","5334",{"$f":"IFERROR(_xlfn.IFS(F697=$K$4,\"T500\",F697=$K$5,\"T500\",F697=$K$6,\"T500\"),\"\")","v":"T500"}]
[20251230,"ＭＡＲＵＷＡ",5344,"ガラス・土石製品",3.68E-4,"TOPIX Mid400","5344",{"$f":"IFERROR(_xlfn.IFS(F698=$K$4,\"T500\",F698=$K$5,\"T500\",F698=$K$6,\"T500\"),\"\")","v":"T500"}]
[20251230,"品川リフラ",5351,"ガラス・土石製品",5.3999999999999998E-5,"TOPIX Small 1","5351",{"$f":"IFERROR(_xlfn.IFS(F699=$K$4,\"T500\",F699=$K$5,\"T500\",F699=$K$6,\"T500\"),\"\")","v":""}]
[20251230,"黒崎播磨",5352,"ガラス・土石製品",7.1000000000000005E-5,"TOPIX Small 1","5352",{"$f":"IFERROR(_xlfn.IFS(F700=$K$4,\"T500\",F700=$K$5,\"T500\",F700=$K$6,\"T500\"),\"\")","v":""}]
[20251230,"ヨータイ",5357,"ガラス・土石製品",2.1999999999999999E-5,"TOPIX Small 2","5357",{"$f":"IFERROR(_xlfn.IFS(F701=$K$4,\"T500\",F701=$K$5,\"T500\",F701=$K$6,\"T500\"),\"\")","v":""}]
[20251230,"フジミインコーポレーテッド",5384,"ガラス・土石製品",1.47E-4,"TOPIX Small 1","5384",{"$f":"IFERROR(_xlfn.IFS(F702=$K$4,\"T500\",F702=$K$5,\"T500\",F702=$K$6,\"T500\"),\"\")","v":""}]
[20251230,"ニチアス",5393,"ガラス・土石製品",3.9199999999999999E-4,"TOPIX Mid400","5393",{"$f":"IFERROR(_xlfn.IFS(F703=$K$4,\"T500\",F703=$K$5,\"T500\",F703=$K$6,\"T500\"),\"\")","v":"T500"}]
[20251230,"日本製鉄",5401,"鉄鋼",3.7420000000000001E-3,"TOPIX Large70","5401",{"$f":"IFERROR(_xlfn.IFS(F704=$K$4,\"T500\",F704=$K$5,\"T500\",F704=$K$6,\"T500\"),\"\")","v":"T500"}]
[20251230,"神戸製鋼所",5406,"鉄鋼",8.9099999999999997E-4,"TOPIX Mid400","5406",{"$f":"IFERROR(_xlfn.IFS(F705=$K$4,\"T500\",F705=$K$5,\"T500\",F705=$K$6,\"T500\"),\"\")","v":"T500"}]
[20251230,"中山製鋼所",5408,"鉄鋼",2.6999999999999999E-5,"TOPIX Small 2","5408",{"$f":"IFERROR(_xlfn.IFS(F706=$K$4,\"T500\",F706=$K$5,\"T500\",F706=$K$6,\"T500\"),\"\")","v":""}]
[20251230,"合同製鐵",5410,"鉄鋼",4.6999999999999997E-5,"TOPIX Small 1",{"$f":"TEXT(C707,0)","v":"5410"},{"$f":"IFERROR(_xlfn.IFS(F707=$K$4,\"T500\",F707=$K$5,\"T500\",F707=$K$6,\"T500\"),\"\")","v":""}]
[20251230,"ＪＦＥホールディングス",5411,"鉄鋼",1.3860000000000001E-3,"TOPIX Mid400","5411",{"$f":"IFERROR(_xlfn.IFS(F708=$K$4,\"T500\",F708=$K$5,\"T500\",F708=$K$6,\"T500\"),\"\")","v":"T500"}]
[20251230,"東京製鐵",5423,"鉄鋼",8.7999999999999998E-5,"TOPIX Small 1","5423",{"$f":"IFERROR(_xlfn.IFS(F709=$K$4,\"T500\",F709=$K$5,\"T500\",F709=$K$6,\"T500\"),\"\")","v":""}]
[20251230,"共英製鋼",5440,"鉄鋼",6.0000000000000002E-5,"TOPIX Small 1","5440",{"$f":"IFERROR(_xlfn.IFS(F710=$K$4,\"T500\",F710=$K$5,\"T500\",F710=$K$6,\"T500\"),\"\")","v":""}]
[20251230,"大和工業",5444,"鉄鋼",4.1100000000000002E-4,"TOPIX Mid400","5444",{"$f":"IFERROR(_xlfn.IFS(F711=$K$4,\"T500\",F711=$K$5,\"T500\",F711=$K$6,\"T500\"),\"\")","v":"T500"}]
[20251230,"東京鐵鋼",5445,"鉄鋼",5.3999999999999998E-5,"TOPIX Small 1","5445",{"$f":"IFERROR(_xlfn.IFS(F712=$K$4,\"T500\",F712=$K$5,\"T500\",F712=$K$6,\"T500\"),\"\")","v":""}]
[20251230,"大阪製鐵",5449,"鉄鋼",2.6999999999999999E-5,"TOPIX Small 2","5449",{"$f":"IFERROR(_xlfn.IFS(F713=$K$4,\"T500\",F713=$K$5,\"T500\",F713=$K$6,\"T500\"),\"\")","v":""}]
[20251230,"ヨドコウ",5451,"鉄鋼",1.6799999999999999E-4,"TOPIX Small 1","5451",{"$f":"IFERROR(_xlfn.IFS(F714=$K$4,\"T500\",F714=$K$5,\"T500\",F714=$K$6,\"T500\"),\"\")","v":""}]
[20251230,"中部鋼鈑",5461,"鉄鋼",4.3999999999999999E-5,"TOPIX Small 1","5461",{"$f":"IFERROR(_xlfn.IFS(F715=$K$4,\"T500\",F715=$K$5,\"T500\",F715=$K$6,\"T500\"),\"\")","v":""}]
[20251230,"丸一鋼管",5463,"鉄鋼",3.1199999999999999E-4,"TOPIX Mid400","5463",{"$f":"IFERROR(_xlfn.IFS(F716=$K$4,\"T500\",F716=$K$5,\"T500\",F716=$K$6,\"T500\"),\"\")","v":"T500"}]
[20251230,"モリ工業",5464,"鉄鋼",2.5000000000000001E-5,"TOPIX Small 2","5464",{"$f":"IFERROR(_xlfn.IFS(F717=$K$4,\"T500\",F717=$K$5,\"T500\",F717=$K$6,\"T500\"),\"\")","v":""}]
[20251230,"大同特殊鋼",5471,"鉄鋼",2.42E-4,"TOPIX Mid400","5471",{"$f":"IFERROR(_xlfn.IFS(F718=$K$4,\"T500\",F718=$K$5,\"T500\",F718=$K$6,\"T500\"),\"\")","v":"T500"}]
[20251230,"日本冶金工業",5480,"鉄鋼",6.4999999999999994E-5,"TOPIX Small 1","5480",{"$f":"IFERROR(_xlfn.IFS(F719=$K$4,\"T500\",F719=$K$5,\"T500\",F719=$K$6,\"T500\"),\"\")","v":""}]
[20251230,"愛知製鋼",5482,"鉄鋼",1.17E-4,"TOPIX Small 1","5482",{"$f":"IFERROR(_xlfn.IFS(F720=$K$4,\"T500\",F720=$K$5,\"T500\",F720=$K$6,\"T500\"),\"\")","v":""}]
[20251230,"大平洋金属",5541,"鉄鋼",4.1E-5,"TOPIX Small 2","5541",{"$f":"IFERROR(_xlfn.IFS(F721=$K$4,\"T500\",F721=$K$5,\"T500\",F721=$K$6,\"T500\"),\"\")","v":""}]
[20251230,"新日本電工",5563,"鉄鋼",4.1999999999999998E-5,"TOPIX Small 1","5563",{"$f":"IFERROR(_xlfn.IFS(F722=$K$4,\"T500\",F722=$K$5,\"T500\",F722=$K$6,\"T500\"),\"\")","v":""}]
[20251230,"栗本鐵工所",5602,"鉄鋼",8.2999999999999998E-5,"TOPIX Small 1","5602",{"$f":"IFERROR(_xlfn.IFS(F723=$K$4,\"T500\",F723=$K$5,\"T500\",F723=$K$6,\"T500\"),\"\")","v":""}]
[20251230,"日本製鋼所",5631,"機械",4.8700000000000002E-4,"TOPIX Mid400","5631",{"$f":"IFERROR(_xlfn.IFS(F724=$K$4,\"T500\",F724=$K$5,\"T500\",F724=$K$6,\"T500\"),\"\")","v":"T500"}]
[20251230,"三菱製鋼",5632,"鉄鋼",2.6999999999999999E-5,"TOPIX Small 2","5632",{"$f":"IFERROR(_xlfn.IFS(F725=$K$4,\"T500\",F725=$K$5,\"T500\",F725=$K$6,\"T500\"),\"\")","v":""}]
[20251230,"日本精線",5659,"鉄鋼",2.0000000000000002E-5,"TOPIX Small 2","5659",{"$f":"IFERROR(_xlfn.IFS(F726=$K$4,\"T500\",F726=$K$5,\"T500\",F726=$K$6,\"T500\"),\"\")","v":""}]
[20251230,"エンビプロ・ホールディングス",5698,"鉄鋼",1.2999999999999999E-5,"TOPIX Small 2","5698",{"$f":"IFERROR(_xlfn.IFS(F727=$K$4,\"T500\",F727=$K$5,\"T500\",F727=$K$6,\"T500\"),\"\")","v":""}]
[20251230,"大紀アルミニウム工業所",5702,"非鉄金属",3.6999999999999998E-5,"TOPIX Small 1","5702",{"$f":"IFERROR(_xlfn.IFS(F728=$K$4,\"T500\",F728=$K$5,\"T500\",F728=$K$6,\"T500\"),\"\")","v":""}]
[20251230,"日本軽金属ホールディングス",5703,"非鉄金属",1.5899999999999999E-4,"TOPIX Small 1","5703",{"$f":"IFERROR(_xlfn.IFS(F729=$K$4,\"T500\",F729=$K$5,\"T500\",F729=$K$6,\"T500\"),\"\")","v":""}]
[20251230,"三井金属",5706,"非鉄金属",9.4200000000000002E-4,"TOPIX Mid400","5706",{"$f":"IFERROR(_xlfn.IFS(F730=$K$4,\"T500\",F730=$K$5,\"T500\",F730=$K$6,\"T500\"),\"\")","v":"T500"}]
[20251230,"東邦亜鉛",5707,"非鉄金属",1.8E-5,"TOPIX Small 2","5707",{"$f":"IFERROR(_xlfn.IFS(F731=$K$4,\"T500\",F731=$K$5,\"T500\",F731=$K$6,\"T500\"),\"\")","v":""}]
[20251230,"三菱マテリアル",5711,"非鉄金属",5.2400000000000005E-4,"TOPIX Mid400","5711",{"$f":"IFERROR(_xlfn.IFS(F732=$K$4,\"T500\",F732=$K$5,\"T500\",F732=$K$6,\"T500\"),\"\")","v":"T500"}]
[20251230,"住友金属鉱山",5713,"非鉄金属",1.8630000000000001E-3,"TOPIX Mid400","5713",{"$f":"IFERROR(_xlfn.IFS(F733=$K$4,\"T500\",F733=$K$5,\"T500\",F733=$K$6,\"T500\"),\"\")","v":"T500"}]
[20251230,"ＤＯＷＡホールディングス",5714,"非鉄金属",4.28E-4,"TOPIX Mid400","5714",{"$f":"IFERROR(_xlfn.IFS(F734=$K$4,\"T500\",F734=$K$5,\"T500\",F734=$K$6,\"T500\"),\"\")","v":"T500"}]
[20251230,"古河機械金属",5715,"非鉄金属",9.7999999999999997E-5,"TOPIX Small 1","5715",{"$f":"IFERROR(_xlfn.IFS(F735=$K$4,\"T500\",F735=$K$5,\"T500\",F735=$K$6,\"T500\"),\"\")","v":""}]
[20251230,"大阪チタニウムテクノロジーズ",5726,"非鉄金属",6.9999999999999994E-5,"TOPIX Small 1","5726",{"$f":"IFERROR(_xlfn.IFS(F736=$K$4,\"T500\",F736=$K$5,\"T500\",F736=$K$6,\"T500\"),\"\")","v":""}]
[20251230,"東邦チタニウム",5727,"非鉄金属",5.1E-5,"TOPIX Small 1","5727",{"$f":"IFERROR(_xlfn.IFS(F737=$K$4,\"T500\",F737=$K$5,\"T500\",F737=$K$6,\"T500\"),\"\")","v":""}]
[20251230,"ＵＡＣＪ",5741,"非鉄金属",2.7399999999999999E-4,"TOPIX Small 1","5741",{"$f":"IFERROR(_xlfn.IFS(F738=$K$4,\"T500\",F738=$K$5,\"T500\",F738=$K$6,\"T500\"),\"\")","v":""}]
[20251230,"ＣＫサンエツ",5757,"非鉄金属",2.0999999999999999E-5,"TOPIX Small 2","5757",{"$f":"IFERROR(_xlfn.IFS(F739=$K$4,\"T500\",F739=$K$5,\"T500\",F739=$K$6,\"T500\"),\"\")","v":""}]
[20251230,"古河電気工業",5801,"非鉄金属",7.1299999999999998E-4,"TOPIX Mid400","5801",{"$f":"IFERROR(_xlfn.IFS(F740=$K$4,\"T500\",F740=$K$5,\"T500\",F740=$K$6,\"T500\"),\"\")","v":"T500"}]
[20251230,"住友電気工業",5802,"非鉄金属",4.6699999999999997E-3,"TOPIX Large70","5802",{"$f":"IFERROR(_xlfn.IFS(F741=$K$4,\"T500\",F741=$K$5,\"T500\",F741=$K$6,\"T500\"),\"\")","v":"T500"}]
[20251230,"フジクラ",5803,"非鉄金属",4.7990000000000003E-3,"TOPIX Large70","5803",{"$f":"IFERROR(_xlfn.IFS(F742=$K$4,\"T500\",F742=$K$5,\"T500\",F742=$K$6,\"T500\"),\"\")","v":"T500"}]
[20251230,"ＳＷＣＣ",5805,"非鉄金属",3.21E-4,"TOPIX Small 1","5805",{"$f":"IFERROR(_xlfn.IFS(F743=$K$4,\"T500\",F743=$K$5,\"T500\",F743=$K$6,\"T500\"),\"\")","v":""}]
[20251230,"平河ヒューテック",5821,"非鉄金属",3.4999999999999997E-5,"TOPIX Small 2","5821",{"$f":"IFERROR(_xlfn.IFS(F744=$K$4,\"T500\",F744=$K$5,\"T500\",F744=$K$6,\"T500\"),\"\")","v":""}]
[20251230,"いよぎんホールディングス",5830,"銀行業",6.8199999999999999E-4,"TOPIX Mid400","5830",{"$f":"IFERROR(_xlfn.IFS(F745=$K$4,\"T500\",F745=$K$5,\"T500\",F745=$K$6,\"T500\"),\"\")","v":"T500"}]
[20251230,"しずおかフィナンシャルグループ",5831,"銀行業",1.093E-3,"TOPIX Mid400","5831",{"$f":"IFERROR(_xlfn.IFS(F746=$K$4,\"T500\",F746=$K$5,\"T500\",F746=$K$6,\"T500\"),\"\")","v":"T500"}]
[20251230,"ちゅうぎんフィナンシャルグループ",5832,"銀行業",4.2499999999999998E-4,"TOPIX Mid400","5832",{"$f":"IFERROR(_xlfn.IFS(F747=$K$4,\"T500\",F747=$K$5,\"T500\",F747=$K$6,\"T500\"),\"\")","v":"T500"}]
[20251230,"楽天銀行",5838,"銀行業",7.4799999999999997E-4,"TOPIX Mid400","5838",{"$f":"IFERROR(_xlfn.IFS(F748=$K$4,\"T500\",F748=$K$5,\"T500\",F748=$K$6,\"T500\"),\"\")","v":"T500"}]
[20251230,"京都フィナンシャルグループ",5844,"銀行業",9.6100000000000005E-4,"TOPIX Mid400","5844",{"$f":"IFERROR(_xlfn.IFS(F749=$K$4,\"T500\",F749=$K$5,\"T500\",F749=$K$6,\"T500\"),\"\")","v":"T500"}]
[20251230,"リョービ",5851,"非鉄金属",6.8999999999999997E-5,"TOPIX Small 1","5851",{"$f":"IFERROR(_xlfn.IFS(F750=$K$4,\"T500\",F750=$K$5,\"T500\",F750=$K$6,\"T500\"),\"\")","v":""}]
[20251230,"ＡＲＥホールディングス",5857,"非鉄金属",2.7599999999999999E-4,"TOPIX Small 1","5857",{"$f":"IFERROR(_xlfn.IFS(F751=$K$4,\"T500\",F751=$K$5,\"T500\",F751=$K$6,\"T500\"),\"\")","v":""}]
[20251230,"Ｊａｐａｎ　Ｅｙｅｗｅａｒ　Ｈｏｌｄｉｎｇｓ",5889,"小売業",1.4E-5,"TOPIX Small 2","5889",{"$f":"IFERROR(_xlfn.IFS(F752=$K$4,\"T500\",F752=$K$5,\"T500\",F752=$K$6,\"T500\"),\"\")","v":""}]
[20251230,"東洋製罐グループホールディングス",5901,"金属製品",4.0900000000000002E-4,"TOPIX Mid400","5901",{"$f":"IFERROR(_xlfn.IFS(F753=$K$4,\"T500\",F753=$K$5,\"T500\",F753=$K$6,\"T500\"),\"\")","v":"T500"}]
[20251230,"ホッカンホールディングス",5902,"金属製品",2.6999999999999999E-5,"TOPIX Small 2","5902",{"$f":"IFERROR(_xlfn.IFS(F754=$K$4,\"T500\",F754=$K$5,\"T500\",F754=$K$6,\"T500\"),\"\")","v":""}]
[20251230,"コロナ",5909,"金属製品",1.1E-5,"TOPIX Small 2","5909",{"$f":"IFERROR(_xlfn.IFS(F755=$K$4,\"T500\",F755=$K$5,\"T500\",F755=$K$6,\"T500\"),\"\")","v":""}]
[20251230,"横河ブリッジホールディングス",5911,"金属製品",1.11E-4,"TOPIX Small 1","5911",{"$f":"IFERROR(_xlfn.IFS(F756=$K$4,\"T500\",F756=$K$5,\"T500\",F756=$K$6,\"T500\"),\"\")","v":""}]
[20251230,"三和ホールディングス",5929,"金属製品",8.3799999999999999E-4,"TOPIX Mid400","5929",{"$f":"IFERROR(_xlfn.IFS(F757=$K$4,\"T500\",F757=$K$5,\"T500\",F757=$K$6,\"T500\"),\"\")","v":"T500"}]
[20251230,"文化シヤッター",5930,"金属製品",1.37E-4,"TOPIX Small 1","5930",{"$f":"IFERROR(_xlfn.IFS(F758=$K$4,\"T500\",F758=$K$5,\"T500\",F758=$K$6,\"T500\"),\"\")","v":""}]
[20251230,"三協立山",5932,"金属製品",1.7E-5,"TOPIX Small 2","5932",{"$f":"IFERROR(_xlfn.IFS(F759=$K$4,\"T500\",F759=$K$5,\"T500\",F759=$K$6,\"T500\"),\"\")","v":""}]
[20251230,"アルインコ",5933,"金属製品",1.8E-5,"TOPIX Small 2","5933",{"$f":"IFERROR(_xlfn.IFS(F760=$K$4,\"T500\",F760=$K$5,\"T500\",F760=$K$6,\"T500\"),\"\")","v":""}]
[20251230,"ＬＩＸＩＬ",5938,"金属製品",6.3299999999999999E-4,"TOPIX Mid400","5938",{"$f":"IFERROR(_xlfn.IFS(F761=$K$4,\"T500\",F761=$K$5,\"T500\",F761=$K$6,\"T500\"),\"\")","v":"T500"}]
[20251230,"ノーリツ",5943,"金属製品",7.4999999999999993E-5,"TOPIX Small 1","5943",{"$f":"IFERROR(_xlfn.IFS(F762=$K$4,\"T500\",F762=$K$5,\"T500\",F762=$K$6,\"T500\"),\"\")","v":""}]
[20251230,"長府製作所",5946,"金属製品",4.3000000000000002E-5,"TOPIX Small 2","5946",{"$f":"IFERROR(_xlfn.IFS(F763=$K$4,\"T500\",F763=$K$5,\"T500\",F763=$K$6,\"T500\"),\"\")","v":""}]
[20251230,"リンナイ",5947,"金属製品",4.4200000000000001E-4,"TOPIX Mid400","5947",{"$f":"IFERROR(_xlfn.IFS(F764=$K$4,\"T500\",F764=$K$5,\"T500\",F764=$K$6,\"T500\"),\"\")","v":"T500"}]
[20251230,"ユニプレス",5949,"輸送用機器",4.8999999999999998E-5,"TOPIX Small 1","5949",{"$f":"IFERROR(_xlfn.IFS(F765=$K$4,\"T500\",F765=$K$5,\"T500\",F765=$K$6,\"T500\"),\"\")","v":""}]
[20251230,"日東精工",5957,"金属製品",2.0000000000000002E-5,"TOPIX Small 2","5957",{"$f":"IFERROR(_xlfn.IFS(F766=$K$4,\"T500\",F766=$K$5,\"T500\",F766=$K$6,\"T500\"),\"\")","v":""}]
[20251230,"岡部",5959,"金属製品",3.6999999999999998E-5,"TOPIX Small 2","5959",{"$f":"IFERROR(_xlfn.IFS(F767=$K$4,\"T500\",F767=$K$5,\"T500\",F767=$K$6,\"T500\"),\"\")","v":""}]
[20251230,"ジーテクト",5970,"金属製品",5.3000000000000001E-5,"TOPIX Small 1","5970",{"$f":"IFERROR(_xlfn.IFS(F768=$K$4,\"T500\",F768=$K$5,\"T500\",F768=$K$6,\"T500\"),\"\")","v":""}]
[20251230,"東プレ",5975,"金属製品",8.8999999999999995E-5,"TOPIX Small 1","5975",{"$f":"IFERROR(_xlfn.IFS(F769=$K$4,\"T500\",F769=$K$5,\"T500\",F769=$K$6,\"T500\"),\"\")","v":""}]
[20251230,"高周波熱錬",5976,"金属製品",4.1E-5,"TOPIX Small 2","5976",{"$f":"IFERROR(_xlfn.IFS(F770=$K$4,\"T500\",F770=$K$5,\"T500\",F770=$K$6,\"T500\"),\"\")","v":""}]
[20251230,"東京製綱",5981,"金属製品",2.0999999999999999E-5,"TOPIX Small 2",{"$f":"TEXT(C771,0)","v":"5981"},{"$f":"IFERROR(_xlfn.IFS(F771=$K$4,\"T500\",F771=$K$5,\"T500\",F771=$K$6,\"T500\"),\"\")","v":""}]
[20251230,"サンコール",5985,"金属製品",1.9000000000000001E-5,"TOPIX Small 2","5985",{"$f":"IFERROR(_xlfn.IFS(F772=$K$4,\"T500\",F772=$K$5,\"T500\",F772=$K$6,\"T500\"),\"\")","v":""}]
[20251230,"パイオラックス",5988,"金属製品",4.0000000000000003E-5,"TOPIX Small 1","5988",{"$f":"IFERROR(_xlfn.IFS(F773=$K$4,\"T500\",F773=$K$5,\"T500\",F773=$K$6,\"T500\"),\"\")","v":""}]
[20251230,"エイチワン",5989,"金属製品",3.1000000000000001E-5,"TOPIX Small 2","5989",{"$f":"IFERROR(_xlfn.IFS(F774=$K$4,\"T500\",F774=$K$5,\"T500\",F774=$K$6,\"T500\"),\"\")","v":""}]
[20251230,"日本発條",5991,"金属製品",4.06E-4,"TOPIX Mid400","5991",{"$f":"IFERROR(_xlfn.IFS(F775=$K$4,\"T500\",F775=$K$5,\"T500\",F775=$K$6,\"T500\"),\"\")","v":"T500"}]
[20251230,"中央発條",5992,"金属製品",4.8999999999999998E-5,"TOPIX Small 2","5992",{"$f":"IFERROR(_xlfn.IFS(F776=$K$4,\"T500\",F776=$K$5,\"T500\",F776=$K$6,\"T500\"),\"\")","v":""}]
[20251230,"三浦工業",6005,"機械",2.9500000000000001E-4,"TOPIX Mid400","6005",{"$f":"IFERROR(_xlfn.IFS(F777=$K$4,\"T500\",F777=$K$5,\"T500\",F777=$K$6,\"T500\"),\"\")","v":"T500"}]
[20251230,"タクマ",6013,"機械",1.55E-4,"TOPIX Small 1","6013",{"$f":"IFERROR(_xlfn.IFS(F778=$K$4,\"T500\",F778=$K$5,\"T500\",F778=$K$6,\"T500\"),\"\")","v":""}]
[20251230,"アイ・アールジャパンホールディングス",6035,"サービス業",9.0000000000000002E-6,"TOPIX Small 2","6035",{"$f":"IFERROR(_xlfn.IFS(F779=$K$4,\"T500\",F779=$K$5,\"T500\",F779=$K$6,\"T500\"),\"\")","v":""}]
[20251230,"ＫｅｅＰｅｒ技研",6036,"サービス業",4.6E-5,"TOPIX Small 1","6036",{"$f":"IFERROR(_xlfn.IFS(F780=$K$4,\"T500\",F780=$K$5,\"T500\",F780=$K$6,\"T500\"),\"\")","v":""}]
[20251230,"Ｇｕｎｏｓｙ",6047,"サービス業",9.0000000000000002E-6,"TOPIX Small 2","6047",{"$f":"IFERROR(_xlfn.IFS(F781=$K$4,\"T500\",F781=$K$5,\"T500\",F781=$K$6,\"T500\"),\"\")","v":""}]
[20251230,"イー・ガーディアン",6050,"サービス業",1.1E-5,"TOPIX Small 2","6050",{"$f":"IFERROR(_xlfn.IFS(F782=$K$4,\"T500\",F782=$K$5,\"T500\",F782=$K$6,\"T500\"),\"\")","v":""}]
[20251230,"ジャパンマテリアル",6055,"サービス業",1.01E-4,"TOPIX Small 1","6055",{"$f":"IFERROR(_xlfn.IFS(F783=$K$4,\"T500\",F783=$K$5,\"T500\",F783=$K$6,\"T500\"),\"\")","v":""}]
[20251230,"ベクトル",6058,"サービス業",3.4999999999999997E-5,"TOPIX Small 2","6058",{"$f":"IFERROR(_xlfn.IFS(F784=$K$4,\"T500\",F784=$K$5,\"T500\",F784=$K$6,\"T500\"),\"\")","v":""}]
[20251230,"チャーム・ケア・コーポレーション",6062,"サービス業",2.3E-5,"TOPIX Small 2","6062",{"$f":"IFERROR(_xlfn.IFS(F785=$K$4,\"T500\",F785=$K$5,\"T500\",F785=$K$6,\"T500\"),\"\")","v":""}]
[20251230,"キャリアリンク",6070,"サービス業",2.0000000000000002E-5,"TOPIX Small 2","6070",{"$f":"IFERROR(_xlfn.IFS(F786=$K$4,\"T500\",F786=$K$5,\"T500\",F786=$K$6,\"T500\"),\"\")","v":""}]
[20251230,"ＩＢＪ",6071,"サービス業",1.2999999999999999E-5,"TOPIX Small 2","6071",{"$f":"IFERROR(_xlfn.IFS(F787=$K$4,\"T500\",F787=$K$5,\"T500\",F787=$K$6,\"T500\"),\"\")","v":""}]
[20251230,"アサンテ",6073,"サービス業",1.7E-5,"TOPIX Small 2","6073",{"$f":"IFERROR(_xlfn.IFS(F788=$K$4,\"T500\",F788=$K$5,\"T500\",F788=$K$6,\"T500\"),\"\")","v":""}]
[20251230,"バリューＨＲ",6078,"サービス業",3.0000000000000001E-5,"TOPIX Small 2","6078",{"$f":"IFERROR(_xlfn.IFS(F789=$K$4,\"T500\",F789=$K$5,\"T500\",F789=$K$6,\"T500\"),\"\")","v":""}]
[20251230,"Ｍ＆Ａキャピタルパートナーズ",6080,"サービス業",5.8E-5,"TOPIX Small 1","6080",{"$f":"IFERROR(_xlfn.IFS(F790=$K$4,\"T500\",F790=$K$5,\"T500\",F790=$K$6,\"T500\"),\"\")","v":""}]
[20251230,"ライドオンエクスプレスホールディングス",6082,"サービス業",9.0000000000000002E-6,"TOPIX Small 2","6082",{"$f":"IFERROR(_xlfn.IFS(F791=$K$4,\"T500\",F791=$K$5,\"T500\",F791=$K$6,\"T500\"),\"\")","v":""}]
[20251230,"シグマクシス・ホールディングス",6088,"サービス業",5.0000000000000002E-5,"TOPIX Small 1","6088",{"$f":"IFERROR(_xlfn.IFS(F792=$K$4,\"T500\",F792=$K$5,\"T500\",F792=$K$6,\"T500\"),\"\")","v":""}]
[20251230,"ウィルグループ",6089,"サービス業",2.4000000000000001E-5,"TOPIX Small 2","6089",{"$f":"IFERROR(_xlfn.IFS(F793=$K$4,\"T500\",F793=$K$5,\"T500\",F793=$K$6,\"T500\"),\"\")","v":""}]
[20251230,"リクルートホールディングス",6098,"サービス業",1.3939999999999999E-2,"TOPIX Core30","6098",{"$f":"IFERROR(_xlfn.IFS(F794=$K$4,\"T500\",F794=$K$5,\"T500\",F794=$K$6,\"T500\"),\"\")","v":"T500"}]
[20251230,"エラン",6099,"サービス業",1.4E-5,"TOPIX Small 2","6099",{"$f":"IFERROR(_xlfn.IFS(F795=$K$4,\"T500\",F795=$K$5,\"T500\",F795=$K$6,\"T500\"),\"\")","v":""}]
[20251230,"ツガミ",6101,"機械",1.2799999999999999E-4,"TOPIX Small 1","6101",{"$f":"IFERROR(_xlfn.IFS(F796=$K$4,\"T500\",F796=$K$5,\"T500\",F796=$K$6,\"T500\"),\"\")","v":""}]
[20251230,"オークマ",6103,"機械",1.3300000000000001E-4,"TOPIX Small 1","6103",{"$f":"IFERROR(_xlfn.IFS(F797=$K$4,\"T500\",F797=$K$5,\"T500\",F797=$K$6,\"T500\"),\"\")","v":""}]
[20251230,"芝浦機械",6104,"機械",1.07E-4,"TOPIX Small 1","6104",{"$f":"IFERROR(_xlfn.IFS(F798=$K$4,\"T500\",F798=$K$5,\"T500\",F798=$K$6,\"T500\"),\"\")","v":""}]
[20251230,"アマダ",6113,"機械",5.6499999999999996E-4,"TOPIX Mid400","6113",{"$f":"IFERROR(_xlfn.IFS(F799=$K$4,\"T500\",F799=$K$5,\"T500\",F799=$K$6,\"T500\"),\"\")","v":"T500"}]
[20251230,"アイダエンジニアリング",6118,"機械",4.6999999999999997E-5,"TOPIX Small 1","6118",{"$f":"IFERROR(_xlfn.IFS(F800=$K$4,\"T500\",F800=$K$5,\"T500\",F800=$K$6,\"T500\"),\"\")","v":""}]
[20251230,"ＦＵＪＩ",6134,"機械",3.0400000000000002E-4,"TOPIX Mid400","6134",{"$f":"IFERROR(_xlfn.IFS(F801=$K$4,\"T500\",F801=$K$5,\"T500\",F801=$K$6,\"T500\"),\"\")","v":"T500"}]
[20251230,"牧野フライス製作所",6135,"機械",2.34E-4,"TOPIX Small 1","6135",{"$f":"IFERROR(_xlfn.IFS(F802=$K$4,\"T500\",F802=$K$5,\"T500\",F802=$K$6,\"T500\"),\"\")","v":""}]
[20251230,"オーエスジー",6136,"機械",1.7000000000000001E-4,"TOPIX Mid400","6136",{"$f":"IFERROR(_xlfn.IFS(F803=$K$4,\"T500\",F803=$K$5,\"T500\",F803=$K$6,\"T500\"),\"\")","v":"T500"}]
[20251230,"旭ダイヤモンド工業",6140,"機械",4.1999999999999998E-5,"TOPIX Small 1","6140",{"$f":"IFERROR(_xlfn.IFS(F804=$K$4,\"T500\",F804=$K$5,\"T500\",F804=$K$6,\"T500\"),\"\")","v":""}]
[20251230,"ＤＭＧ森精機",6141,"機械",3.7800000000000003E-4,"TOPIX Mid400","6141",{"$f":"IFERROR(_xlfn.IFS(F805=$K$4,\"T500\",F805=$K$5,\"T500\",F805=$K$6,\"T500\"),\"\")","v":"T500"}]
[20251230,"ソディック",6143,"機械",4.8999999999999998E-5,"TOPIX Small 1","6143",{"$f":"IFERROR(_xlfn.IFS(F806=$K$4,\"T500\",F806=$K$5,\"T500\",F806=$K$6,\"T500\"),\"\")","v":""}]
[20251230,"ディスコ",6146,"機械",4.8580000000000003E-3,"TOPIX Large70","6146",{"$f":"IFERROR(_xlfn.IFS(F807=$K$4,\"T500\",F807=$K$5,\"T500\",F807=$K$6,\"T500\"),\"\")","v":"T500"}]
[20251230,"日東工器",6151,"機械",1.4E-5,"TOPIX Small 2","6151",{"$f":"IFERROR(_xlfn.IFS(F808=$K$4,\"T500\",F808=$K$5,\"T500\",F808=$K$6,\"T500\"),\"\")","v":""}]
[20251230,"日進工具",6157,"機械",1.5E-5,"TOPIX Small 2","6157",{"$f":"IFERROR(_xlfn.IFS(F809=$K$4,\"T500\",F809=$K$5,\"T500\",F809=$K$6,\"T500\"),\"\")","v":""}]
[20251230,"冨士ダイス",6167,"機械",1.4E-5,"TOPIX Small 2","6167",{"$f":"IFERROR(_xlfn.IFS(F810=$K$4,\"T500\",F810=$K$5,\"T500\",F810=$K$6,\"T500\"),\"\")","v":""}]
[20251230,"日本郵政",6178,"サービス業",3.1670000000000001E-3,"TOPIX Large70","6178",{"$f":"IFERROR(_xlfn.IFS(F811=$K$4,\"T500\",F811=$K$5,\"T500\",F811=$K$6,\"T500\"),\"\")","v":"T500"}]
[20251230,"ベルシステム２４ホールディングス",6183,"サービス業",4.1999999999999998E-5,"TOPIX Small 2","6183",{"$f":"IFERROR(_xlfn.IFS(F812=$K$4,\"T500\",F812=$K$5,\"T500\",F812=$K$6,\"T500\"),\"\")","v":""}]
[20251230,"鎌倉新書",6184,"サービス業",1.2999999999999999E-5,"TOPIX Small 2","6184",{"$f":"IFERROR(_xlfn.IFS(F813=$K$4,\"T500\",F813=$K$5,\"T500\",F813=$K$6,\"T500\"),\"\")","v":""}]
[20251230,"エアトリ",6191,"サービス業",1.2999999999999999E-5,"TOPIX Small 2","6191",{"$f":"IFERROR(_xlfn.IFS(F814=$K$4,\"T500\",F814=$K$5,\"T500\",F814=$K$6,\"T500\"),\"\")","v":""}]
[20251230,"アトラエ",6194,"サービス業",1.1E-5,"TOPIX Small 2","6194",{"$f":"IFERROR(_xlfn.IFS(F815=$K$4,\"T500\",F815=$K$5,\"T500\",F815=$K$6,\"T500\"),\"\")","v":""}]
[20251230,"ストライク",6196,"サービス業",4.3000000000000002E-5,"TOPIX Small 1","6196",{"$f":"IFERROR(_xlfn.IFS(F816=$K$4,\"T500\",F816=$K$5,\"T500\",F816=$K$6,\"T500\"),\"\")","v":""}]
[20251230,"ソラスト",6197,"サービス業",4.3999999999999999E-5,"TOPIX Small 2","6197",{"$f":"IFERROR(_xlfn.IFS(F817=$K$4,\"T500\",F817=$K$5,\"T500\",F817=$K$6,\"T500\"),\"\")","v":""}]
[20251230,"セラク",6199,"サービス業",1.0000000000000001E-5,"TOPIX Small 2","6199",{"$f":"IFERROR(_xlfn.IFS(F818=$K$4,\"T500\",F818=$K$5,\"T500\",F818=$K$6,\"T500\"),\"\")","v":""}]
[20251230,"インソース",6200,"サービス業",4.0000000000000003E-5,"TOPIX Small 1","6200",{"$f":"IFERROR(_xlfn.IFS(F819=$K$4,\"T500\",F819=$K$5,\"T500\",F819=$K$6,\"T500\"),\"\")","v":""}]
[20251230,"豊田自動織機",6201,"輸送用機器",3.1470000000000001E-3,"TOPIX Large70","6201",{"$f":"IFERROR(_xlfn.IFS(F820=$K$4,\"T500\",F820=$K$5,\"T500\",F820=$K$6,\"T500\"),\"\")","v":"T500"}]
[20251230,"リケンＮＰＲ",6209,"機械",8.7000000000000001E-5,"TOPIX Small 1","6209",{"$f":"IFERROR(_xlfn.IFS(F821=$K$4,\"T500\",F821=$K$5,\"T500\",F821=$K$6,\"T500\"),\"\")","v":""}]
[20251230,"島精機製作所",6222,"機械",3.3000000000000003E-5,"TOPIX Small 1","6222",{"$f":"IFERROR(_xlfn.IFS(F822=$K$4,\"T500\",F822=$K$5,\"T500\",F822=$K$6,\"T500\"),\"\")","v":""}]
[20251230,"オプトラン",6235,"機械",6.6000000000000005E-5,"TOPIX Small 1","6235",{"$f":"IFERROR(_xlfn.IFS(F823=$K$4,\"T500\",F823=$K$5,\"T500\",F823=$K$6,\"T500\"),\"\")","v":""}]
[20251230,"イワキ",6237,"機械",3.6999999999999998E-5,"TOPIX Small 2","6237",{"$f":"IFERROR(_xlfn.IFS(F824=$K$4,\"T500\",F824=$K$5,\"T500\",F824=$K$6,\"T500\"),\"\")","v":""}]
[20251230,"フリュー",6238,"機械",2.3E-5,"TOPIX Small 2","6238",{"$f":"IFERROR(_xlfn.IFS(F825=$K$4,\"T500\",F825=$K$5,\"T500\",F825=$K$6,\"T500\"),\"\")","v":""}]
[20251230,"ヤマシンフィルタ",6240,"機械",2.5999999999999998E-5,"TOPIX Small 2","6240",{"$f":"IFERROR(_xlfn.IFS(F826=$K$4,\"T500\",F826=$K$5,\"T500\",F826=$K$6,\"T500\"),\"\")","v":""}]
[20251230,"日阪製作所",6247,"機械",3.8000000000000002E-5,"TOPIX Small 2","6247",{"$f":"IFERROR(_xlfn.IFS(F827=$K$4,\"T500\",F827=$K$5,\"T500\",F827=$K$6,\"T500\"),\"\")","v":""}]
[20251230,"やまびこ",6250,"機械",1.02E-4,"TOPIX Small 1","6250",{"$f":"IFERROR(_xlfn.IFS(F828=$K$4,\"T500\",F828=$K$5,\"T500\",F828=$K$6,\"T500\"),\"\")","v":""}]
[20251230,"野村マイクロ・サイエンス",6254,"機械",1.13E-4,"TOPIX Small 1","6254",{"$f":"IFERROR(_xlfn.IFS(F829=$K$4,\"T500\",F829=$K$5,\"T500\",F829=$K$6,\"T500\"),\"\")","v":""}]
[20251230,"平田機工",6258,"機械",7.1000000000000005E-5,"TOPIX Small 1","6258",{"$f":"IFERROR(_xlfn.IFS(F830=$K$4,\"T500\",F830=$K$5,\"T500\",F830=$K$6,\"T500\"),\"\")","v":""}]
[20251230,"ＰＥＧＡＳＵＳ",6262,"機械",1.8E-5,"TOPIX Small 2","6262",{"$f":"IFERROR(_xlfn.IFS(F831=$K$4,\"T500\",F831=$K$5,\"T500\",F831=$K$6,\"T500\"),\"\")","v":""}]
[20251230,"マルマエ",6264,"機械",1.9000000000000001E-5,"TOPIX Small 2","6264",{"$f":"IFERROR(_xlfn.IFS(F832=$K$4,\"T500\",F832=$K$5,\"T500\",F832=$K$6,\"T500\"),\"\")","v":""}]
[20251230,"タツモ",6266,"機械",2.8E-5,"TOPIX Small 2","6266",{"$f":"IFERROR(_xlfn.IFS(F833=$K$4,\"T500\",F833=$K$5,\"T500\",F833=$K$6,\"T500\"),\"\")","v":""}]
[20251230,"ナブテスコ",6268,"機械",4.57E-4,"TOPIX Mid400","6268",{"$f":"IFERROR(_xlfn.IFS(F834=$K$4,\"T500\",F834=$K$5,\"T500\",F834=$K$6,\"T500\"),\"\")","v":"T500"}]
[20251230,"三井海洋開発",6269,"機械",6.3000000000000003E-4,"TOPIX Mid400",{"$f":"TEXT(C835,0)","v":"6269"},{"$f":"IFERROR(_xlfn.IFS(F835=$K$4,\"T500\",F835=$K$5,\"T500\",F835=$K$6,\"T500\"),\"\")","v":"T500"}]
[20251230,"レオン自動機",6272,"機械",3.4999999999999997E-5,"TOPIX Small 2","6272",{"$f":"IFERROR(_xlfn.IFS(F836=$K$4,\"T500\",F836=$K$5,\"T500\",F836=$K$6,\"T500\"),\"\")","v":""}]
[20251230,"ＳＭＣ",6273,"機械",3.235E-3,"TOPIX Large70","6273",{"$f":"IFERROR(_xlfn.IFS(F837=$K$4,\"T500\",F837=$K$5,\"T500\",F837=$K$6,\"T500\"),\"\")","v":"T500"}]
[20251230,"ホソカワミクロン",6277,"機械",8.8999999999999995E-5,"TOPIX Small 1","6277",{"$f":"IFERROR(_xlfn.IFS(F838=$K$4,\"T500\",F838=$K$5,\"T500\",F838=$K$6,\"T500\"),\"\")","v":""}]
[20251230,"ユニオンツール",6278,"機械",7.7999999999999999E-5,"TOPIX Small 1","6278",{"$f":"IFERROR(_xlfn.IFS(F839=$K$4,\"T500\",F839=$K$5,\"T500\",F839=$K$6,\"T500\"),\"\")","v":""}]
[20251230,"瑞光",6279,"機械",1.8E-5,"TOPIX Small 2","6279",{"$f":"IFERROR(_xlfn.IFS(F840=$K$4,\"T500\",F840=$K$5,\"T500\",F840=$K$6,\"T500\"),\"\")","v":""}]
[20251230,"オイレス工業",6282,"機械",6.0999999999999999E-5,"TOPIX Small 1","6282",{"$f":"IFERROR(_xlfn.IFS(F841=$K$4,\"T500\",F841=$K$5,\"T500\",F841=$K$6,\"T500\"),\"\")","v":""}]
[20251230,"日精エー・エス・ビー機械",6284,"機械",5.1E-5,"TOPIX Small 1","6284",{"$f":"IFERROR(_xlfn.IFS(F842=$K$4,\"T500\",F842=$K$5,\"T500\",F842=$K$6,\"T500\"),\"\")","v":""}]
[20251230,"サトー",6287,"機械",6.8999999999999997E-5,"TOPIX Small 1","6287",{"$f":"IFERROR(_xlfn.IFS(F843=$K$4,\"T500\",F843=$K$5,\"T500\",F843=$K$6,\"T500\"),\"\")","v":""}]
[20251230,"技研製作所",6289,"機械",3.6999999999999998E-5,"TOPIX Small 2","6289",{"$f":"IFERROR(_xlfn.IFS(F844=$K$4,\"T500\",F844=$K$5,\"T500\",F844=$K$6,\"T500\"),\"\")","v":""}]
[20251230,"日本エアーテック",6291,"機械",1.1E-5,"TOPIX Small 2","6291",{"$f":"IFERROR(_xlfn.IFS(F845=$K$4,\"T500\",F845=$K$5,\"T500\",F845=$K$6,\"T500\"),\"\")","v":""}]
[20251230,"日精樹脂工業",6293,"機械",1.2E-5,"TOPIX Small 2","6293",{"$f":"IFERROR(_xlfn.IFS(F846=$K$4,\"T500\",F846=$K$5,\"T500\",F846=$K$6,\"T500\"),\"\")","v":""}]
[20251230,"ワイエイシイホールディングス",6298,"機械",1.9000000000000001E-5,"TOPIX Small 2","6298",{"$f":"IFERROR(_xlfn.IFS(F847=$K$4,\"T500\",F847=$K$5,\"T500\",F847=$K$6,\"T500\"),\"\")","v":""}]
[20251230,"小松製作所",6301,"機械",5.1590000000000004E-3,"TOPIX Large70","6301",{"$f":"IFERROR(_xlfn.IFS(F848=$K$4,\"T500\",F848=$K$5,\"T500\",F848=$K$6,\"T500\"),\"\")","v":"T500"}]
[20251230,"住友重機械工業",6302,"機械",5.1400000000000003E-4,"TOPIX Mid400","6302",{"$f":"IFERROR(_xlfn.IFS(F849=$K$4,\"T500\",F849=$K$5,\"T500\",F849=$K$6,\"T500\"),\"\")","v":"T500"}]
[20251230,"日立建機",6305,"機械",3.86E-4,"TOPIX Mid400","6305",{"$f":"IFERROR(_xlfn.IFS(F850=$K$4,\"T500\",F850=$K$5,\"T500\",F850=$K$6,\"T500\"),\"\")","v":"T500"}]
[20251230,"日工",6306,"機械",3.1999999999999999E-5,"TOPIX Small 2","6306",{"$f":"IFERROR(_xlfn.IFS(F851=$K$4,\"T500\",F851=$K$5,\"T500\",F851=$K$6,\"T500\"),\"\")","v":""}]
[20251230,"巴工業",6309,"機械",4.1999999999999998E-5,"TOPIX Small 2","6309",{"$f":"IFERROR(_xlfn.IFS(F852=$K$4,\"T500\",F852=$K$5,\"T500\",F852=$K$6,\"T500\"),\"\")","v":""}]
[20251230,"井関農機",6310,"機械",3.6000000000000001E-5,"TOPIX Small 2","6310",{"$f":"IFERROR(_xlfn.IFS(F853=$K$4,\"T500\",F853=$K$5,\"T500\",F853=$K$6,\"T500\"),\"\")","v":""}]
[20251230,"ＴＯＷＡ",6315,"機械",1.63E-4,"TOPIX Small 1","6315",{"$f":"IFERROR(_xlfn.IFS(F854=$K$4,\"T500\",F854=$K$5,\"T500\",F854=$K$6,\"T500\"),\"\")","v":""}]
[20251230,"北川鉄工所",6317,"機械",1.4E-5,"TOPIX Small 2","6317",{"$f":"IFERROR(_xlfn.IFS(F855=$K$4,\"T500\",F855=$K$5,\"T500\",F855=$K$6,\"T500\"),\"\")","v":""}]
[20251230,"ローツェ",6323,"機械",2.7700000000000001E-4,"TOPIX Mid400","6323",{"$f":"IFERROR(_xlfn.IFS(F856=$K$4,\"T500\",F856=$K$5,\"T500\",F856=$K$6,\"T500\"),\"\")","v":"T500"}]
[20251230,"クボタ",6326,"機械",2.372E-3,"TOPIX Large70","6326",{"$f":"IFERROR(_xlfn.IFS(F857=$K$4,\"T500\",F857=$K$5,\"T500\",F857=$K$6,\"T500\"),\"\")","v":"T500"}]
[20251230,"荏原実業",6328,"機械",4.6999999999999997E-5,"TOPIX Small 2","6328",{"$f":"IFERROR(_xlfn.IFS(F858=$K$4,\"T500\",F858=$K$5,\"T500\",F858=$K$6,\"T500\"),\"\")","v":""}]
[20251230,"東洋エンジニアリング",6330,"建設業",9.2E-5,"TOPIX Small 2","6330",{"$f":"IFERROR(_xlfn.IFS(F859=$K$4,\"T500\",F859=$K$5,\"T500\",F859=$K$6,\"T500\"),\"\")","v":""}]
[20251230,"三菱化工機",6331,"機械",7.1000000000000005E-5,"TOPIX Small 1","6331",{"$f":"IFERROR(_xlfn.IFS(F860=$K$4,\"T500\",F860=$K$5,\"T500\",F860=$K$6,\"T500\"),\"\")","v":""}]
[20251230,"月島ホールディングス",6332,"機械",8.7000000000000001E-5,"TOPIX Small 1","6332",{"$f":"IFERROR(_xlfn.IFS(F861=$K$4,\"T500\",F861=$K$5,\"T500\",F861=$K$6,\"T500\"),\"\")","v":""}]
[20251230,"帝国電機製作所",6333,"機械",4.3999999999999999E-5,"TOPIX Small 2","6333",{"$f":"IFERROR(_xlfn.IFS(F862=$K$4,\"T500\",F862=$K$5,\"T500\",F862=$K$6,\"T500\"),\"\")","v":""}]
[20251230,"新東工業",6339,"機械",4.6E-5,"TOPIX Small 2","6339",{"$f":"IFERROR(_xlfn.IFS(F863=$K$4,\"T500\",F863=$K$5,\"T500\",F863=$K$6,\"T500\"),\"\")","v":""}]
[20251230,"澁谷工業",6340,"機械",6.7999999999999999E-5,"TOPIX Small 2","6340",{"$f":"IFERROR(_xlfn.IFS(F864=$K$4,\"T500\",F864=$K$5,\"T500\",F864=$K$6,\"T500\"),\"\")","v":""}]
[20251230,"アイチ　コーポレーション",6345,"機械",4.6999999999999997E-5,"TOPIX Small 2","6345",{"$f":"IFERROR(_xlfn.IFS(F865=$K$4,\"T500\",F865=$K$5,\"T500\",F865=$K$6,\"T500\"),\"\")","v":""}]
[20251230,"小森コーポレーション",6349,"機械",7.8999999999999996E-5,"TOPIX Small 1","6349",{"$f":"IFERROR(_xlfn.IFS(F866=$K$4,\"T500\",F866=$K$5,\"T500\",F866=$K$6,\"T500\"),\"\")","v":""}]
[20251230,"鶴見製作所",6351,"機械",6.3E-5,"TOPIX Small 2","6351",{"$f":"IFERROR(_xlfn.IFS(F867=$K$4,\"T500\",F867=$K$5,\"T500\",F867=$K$6,\"T500\"),\"\")","v":""}]
[20251230,"酒井重工業",6358,"機械",1.7E-5,"TOPIX Small 2","6358",{"$f":"IFERROR(_xlfn.IFS(F868=$K$4,\"T500\",F868=$K$5,\"T500\",F868=$K$6,\"T500\"),\"\")","v":""}]
[20251230,"荏原製作所",6361,"機械",1.5839999999999999E-3,"TOPIX Mid400","6361",{"$f":"IFERROR(_xlfn.IFS(F869=$K$4,\"T500\",F869=$K$5,\"T500\",F869=$K$6,\"T500\"),\"\")","v":"T500"}]
[20251230,"酉島製作所",6363,"機械",3.1999999999999999E-5,"TOPIX Small 1","6363",{"$f":"IFERROR(_xlfn.IFS(F870=$K$4,\"T500\",F870=$K$5,\"T500\",F870=$K$6,\"T500\"),\"\")","v":""}]
[20251230,"ＡＩＲＭＡＮ",6364,"機械",3.8000000000000002E-5,"TOPIX Small 2","6364",{"$f":"IFERROR(_xlfn.IFS(F871=$K$4,\"T500\",F871=$K$5,\"T500\",F871=$K$6,\"T500\"),\"\")","v":""}]
[20251230,"ダイキン工業",6367,"機械",5.4739999999999997E-3,"TOPIX Core30","6367",{"$f":"IFERROR(_xlfn.IFS(F872=$K$4,\"T500\",F872=$K$5,\"T500\",F872=$K$6,\"T500\"),\"\")","v":"T500"}]
[20251230,"オルガノ",6368,"機械",3.7199999999999999E-4,"TOPIX Mid400","6368",{"$f":"IFERROR(_xlfn.IFS(F873=$K$4,\"T500\",F873=$K$5,\"T500\",F873=$K$6,\"T500\"),\"\")","v":"T500"}]
[20251230,"トーヨーカネツ",6369,"機械",4.3000000000000002E-5,"TOPIX Small 2","6369",{"$f":"IFERROR(_xlfn.IFS(F874=$K$4,\"T500\",F874=$K$5,\"T500\",F874=$K$6,\"T500\"),\"\")","v":""}]
[20251230,"栗田工業",6370,"機械",8.0000000000000004E-4,"TOPIX Mid400","6370",{"$f":"IFERROR(_xlfn.IFS(F875=$K$4,\"T500\",F875=$K$5,\"T500\",F875=$K$6,\"T500\"),\"\")","v":"T500"}]
[20251230,"椿本チエイン",6371,"機械",2.0900000000000001E-4,"TOPIX Small 1","6371",{"$f":"IFERROR(_xlfn.IFS(F876=$K$4,\"T500\",F876=$K$5,\"T500\",F876=$K$6,\"T500\"),\"\")","v":""}]
[20251230,"日機装",6376,"精密機器",7.7000000000000001E-5,"TOPIX Small 1","6376",{"$f":"IFERROR(_xlfn.IFS(F877=$K$4,\"T500\",F877=$K$5,\"T500\",F877=$K$6,\"T500\"),\"\")","v":""}]
[20251230,"木村化工機",6378,"機械",1.9000000000000001E-5,"TOPIX Small 2","6378",{"$f":"IFERROR(_xlfn.IFS(F878=$K$4,\"T500\",F878=$K$5,\"T500\",F878=$K$6,\"T500\"),\"\")","v":""}]
[20251230,"レイズネクスト",6379,"建設業",7.1000000000000005E-5,"TOPIX Small 2","6379",{"$f":"IFERROR(_xlfn.IFS(F879=$K$4,\"T500\",F879=$K$5,\"T500\",F879=$K$6,\"T500\"),\"\")","v":""}]
[20251230,"アネスト岩田",6381,"機械",6.3E-5,"TOPIX Small 2","6381",{"$f":"IFERROR(_xlfn.IFS(F880=$K$4,\"T500\",F880=$K$5,\"T500\",F880=$K$6,\"T500\"),\"\")","v":""}]
[20251230,"ダイフク",6383,"機械",1.7409999999999999E-3,"TOPIX Mid400","6383",{"$f":"IFERROR(_xlfn.IFS(F881=$K$4,\"T500\",F881=$K$5,\"T500\",F881=$K$6,\"T500\"),\"\")","v":"T500"}]
[20251230,"サムコ",6387,"機械",2.5999999999999998E-5,"TOPIX Small 2","6387",{"$f":"IFERROR(_xlfn.IFS(F882=$K$4,\"T500\",F882=$K$5,\"T500\",F882=$K$6,\"T500\"),\"\")","v":""}]
[20251230,"タダノ",6395,"機械",1.17E-4,"TOPIX Small 1","6395",{"$f":"IFERROR(_xlfn.IFS(F883=$K$4,\"T500\",F883=$K$5,\"T500\",F883=$K$6,\"T500\"),\"\")","v":""}]
[20251230,"フジテック",6406,"機械",1.0399999999999999E-4,"TOPIX Mid400","6406",{"$f":"IFERROR(_xlfn.IFS(F884=$K$4,\"T500\",F884=$K$5,\"T500\",F884=$K$6,\"T500\"),\"\")","v":"T500"}]
[20251230,"ＣＫＤ",6407,"機械",1.93E-4,"TOPIX Small 1","6407",{"$f":"IFERROR(_xlfn.IFS(F885=$K$4,\"T500\",F885=$K$5,\"T500\",F885=$K$6,\"T500\"),\"\")","v":""}]
[20251230,"平和",6412,"機械",1.26E-4,"TOPIX Small 1","6412",{"$f":"IFERROR(_xlfn.IFS(F886=$K$4,\"T500\",F886=$K$5,\"T500\",F886=$K$6,\"T500\"),\"\")","v":""}]
[20251230,"理想科学工業",6413,"機械",4.1999999999999998E-5,"TOPIX Small 2","6413",{"$f":"IFERROR(_xlfn.IFS(F887=$K$4,\"T500\",F887=$K$5,\"T500\",F887=$K$6,\"T500\"),\"\")","v":""}]
[20251230,"ＳＡＮＫＹＯ",6417,"機械",5.6300000000000002E-4,"TOPIX Mid400","6417",{"$f":"IFERROR(_xlfn.IFS(F888=$K$4,\"T500\",F888=$K$5,\"T500\",F888=$K$6,\"T500\"),\"\")","v":"T500"}]
[20251230,"日本金銭機械",6418,"機械",2.5999999999999998E-5,"TOPIX Small 2","6418",{"$f":"IFERROR(_xlfn.IFS(F889=$K$4,\"T500\",F889=$K$5,\"T500\",F889=$K$6,\"T500\"),\"\")","v":""}]
[20251230,"マースグループホールディングス",6419,"機械",5.5999999999999999E-5,"TOPIX Small 1","6419",{"$f":"IFERROR(_xlfn.IFS(F890=$K$4,\"T500\",F890=$K$5,\"T500\",F890=$K$6,\"T500\"),\"\")","v":""}]
[20251230,"ガリレイ",6420,"機械",1.17E-4,"TOPIX Small 1","6420",{"$f":"IFERROR(_xlfn.IFS(F891=$K$4,\"T500\",F891=$K$5,\"T500\",F891=$K$6,\"T500\"),\"\")","v":""}]
[20251230,"ダイコク電機",6430,"機械",3.0000000000000001E-5,"TOPIX Small 2","6430",{"$f":"IFERROR(_xlfn.IFS(F892=$K$4,\"T500\",F892=$K$5,\"T500\",F892=$K$6,\"T500\"),\"\")","v":""}]
[20251230,"竹内製作所",6432,"機械",2.5599999999999999E-4,"TOPIX Small 1","6432",{"$f":"IFERROR(_xlfn.IFS(F893=$K$4,\"T500\",F893=$K$5,\"T500\",F893=$K$6,\"T500\"),\"\")","v":""}]
[20251230,"アマノ",6436,"機械",2.32E-4,"TOPIX Mid400","6436",{"$f":"IFERROR(_xlfn.IFS(F894=$K$4,\"T500\",F894=$K$5,\"T500\",F894=$K$6,\"T500\"),\"\")","v":"T500"}]
[20251230,"ＪＵＫＩ",6440,"機械",1.5999999999999999E-5,"TOPIX Small 2","6440",{"$f":"IFERROR(_xlfn.IFS(F895=$K$4,\"T500\",F895=$K$5,\"T500\",F895=$K$6,\"T500\"),\"\")","v":""}]
[20251230,"ジャノメ",6445,"機械",1.8E-5,"TOPIX Small 2","6445",{"$f":"IFERROR(_xlfn.IFS(F896=$K$4,\"T500\",F896=$K$5,\"T500\",F896=$K$6,\"T500\"),\"\")","v":""}]
[20251230,"ブラザー工業",6448,"電気機器",8.1099999999999998E-4,"TOPIX Mid400","6448",{"$f":"IFERROR(_xlfn.IFS(F897=$K$4,\"T500\",F897=$K$5,\"T500\",F897=$K$6,\"T500\"),\"\")","v":"T500"}]
[20251230,"マックス",6454,"機械",1.9900000000000001E-4,"TOPIX Small 1","6454",{"$f":"IFERROR(_xlfn.IFS(F898=$K$4,\"T500\",F898=$K$5,\"T500\",F898=$K$6,\"T500\"),\"\")","v":""}]
[20251230,"モリタホールディングス",6455,"輸送用機器",9.0000000000000006E-5,"TOPIX Small 2",{"$f":"TEXT(C899,0)","v":"6455"},{"$f":"IFERROR(_xlfn.IFS(F899=$K$4,\"T500\",F899=$K$5,\"T500\",F899=$K$6,\"T500\"),\"\")","v":""}]
[20251230,"グローリー",6457,"機械",2.1699999999999999E-4,"TOPIX Mid400","6457",{"$f":"IFERROR(_xlfn.IFS(F900=$K$4,\"T500\",F900=$K$5,\"T500\",F900=$K$6,\"T500\"),\"\")","v":"T500"}]
[20251230,"新晃工業",6458,"機械",8.0000000000000007E-5,"TOPIX Small 1","6458",{"$f":"IFERROR(_xlfn.IFS(F901=$K$4,\"T500\",F901=$K$5,\"T500\",F901=$K$6,\"T500\"),\"\")","v":""}]
[20251230,"大和冷機工業",6459,"機械",5.1E-5,"TOPIX Small 2","6459",{"$f":"IFERROR(_xlfn.IFS(F902=$K$4,\"T500\",F902=$K$5,\"T500\",F902=$K$6,\"T500\"),\"\")","v":""}]
[20251230,"セガサミーホールディングス",6460,"機械",4.2000000000000002E-4,"TOPIX Mid400","6460",{"$f":"IFERROR(_xlfn.IFS(F903=$K$4,\"T500\",F903=$K$5,\"T500\",F903=$K$6,\"T500\"),\"\")","v":"T500"}]
[20251230,"ＴＰＲ",6463,"機械",6.2000000000000003E-5,"TOPIX Small 1","6463",{"$f":"IFERROR(_xlfn.IFS(F904=$K$4,\"T500\",F904=$K$5,\"T500\",F904=$K$6,\"T500\"),\"\")","v":""}]
[20251230,"ツバキ・ナカシマ",6464,"機械",1.7E-5,"TOPIX Small 2","6464",{"$f":"IFERROR(_xlfn.IFS(F905=$K$4,\"T500\",F905=$K$5,\"T500\",F905=$K$6,\"T500\"),\"\")","v":""}]
[20251230,"ホシザキ",6465,"機械",7.0200000000000004E-4,"TOPIX Mid400","6465",{"$f":"IFERROR(_xlfn.IFS(F906=$K$4,\"T500\",F906=$K$5,\"T500\",F906=$K$6,\"T500\"),\"\")","v":"T500"}]
[20251230,"大豊工業",6470,"機械",1.2999999999999999E-5,"TOPIX Small 2","6470",{"$f":"IFERROR(_xlfn.IFS(F907=$K$4,\"T500\",F907=$K$5,\"T500\",F907=$K$6,\"T500\"),\"\")","v":""}]
[20251230,"日本精工",6471,"機械",3.7800000000000003E-4,"TOPIX Mid400","6471",{"$f":"IFERROR(_xlfn.IFS(F908=$K$4,\"T500\",F908=$K$5,\"T500\",F908=$K$6,\"T500\"),\"\")","v":"T500"}]
[20251230,"ＮＴＮ",6472,"機械",1.85E-4,"TOPIX Mid400","6472",{"$f":"IFERROR(_xlfn.IFS(F909=$K$4,\"T500\",F909=$K$5,\"T500\",F909=$K$6,\"T500\"),\"\")","v":"T500"}]
[20251230,"ジェイテクト",6473,"機械",3.4299999999999999E-4,"TOPIX Mid400","6473",{"$f":"IFERROR(_xlfn.IFS(F910=$K$4,\"T500\",F910=$K$5,\"T500\",F910=$K$6,\"T500\"),\"\")","v":"T500"}]
[20251230,"不二越",6474,"機械",6.7000000000000002E-5,"TOPIX Small 1","6474",{"$f":"IFERROR(_xlfn.IFS(F911=$K$4,\"T500\",F911=$K$5,\"T500\",F911=$K$6,\"T500\"),\"\")","v":""}]
[20251230,"ミネベアミツミ",6479,"電気機器",1.1440000000000001E-3,"TOPIX Mid400","6479",{"$f":"IFERROR(_xlfn.IFS(F912=$K$4,\"T500\",F912=$K$5,\"T500\",F912=$K$6,\"T500\"),\"\")","v":"T500"}]
[20251230,"日本トムソン",6480,"機械",4.6999999999999997E-5,"TOPIX Small 2","6480",{"$f":"IFERROR(_xlfn.IFS(F913=$K$4,\"T500\",F913=$K$5,\"T500\",F913=$K$6,\"T500\"),\"\")","v":""}]
[20251230,"ＴＨＫ",6481,"機械",4.44E-4,"TOPIX Mid400","6481",{"$f":"IFERROR(_xlfn.IFS(F914=$K$4,\"T500\",F914=$K$5,\"T500\",F914=$K$6,\"T500\"),\"\")","v":"T500"}]
[20251230,"ＹＵＳＨＩＮ",6482,"機械",1.2E-5,"TOPIX Small 2","6482",{"$f":"IFERROR(_xlfn.IFS(F915=$K$4,\"T500\",F915=$K$5,\"T500\",F915=$K$6,\"T500\"),\"\")","v":""}]
[20251230,"前澤給装工業",6485,"機械",2.4000000000000001E-5,"TOPIX Small 2","6485",{"$f":"IFERROR(_xlfn.IFS(F916=$K$4,\"T500\",F916=$K$5,\"T500\",F916=$K$6,\"T500\"),\"\")","v":""}]
[20251230,"イーグル工業",6486,"機械",6.6000000000000005E-5,"TOPIX Small 1","6486",{"$f":"IFERROR(_xlfn.IFS(F917=$K$4,\"T500\",F917=$K$5,\"T500\",F917=$K$6,\"T500\"),\"\")","v":""}]
[20251230,"ＰＩＬＬＡＲ",6490,"機械",9.2999999999999997E-5,"TOPIX Small 1","6490",{"$f":"IFERROR(_xlfn.IFS(F918=$K$4,\"T500\",F918=$K$5,\"T500\",F918=$K$6,\"T500\"),\"\")","v":""}]
[20251230,"キッツ",6498,"機械",1.2999999999999999E-4,"TOPIX Small 1","6498",{"$f":"IFERROR(_xlfn.IFS(F919=$K$4,\"T500\",F919=$K$5,\"T500\",F919=$K$6,\"T500\"),\"\")","v":""}]
[20251230,"日立製作所",6501,"電気機器",2.6109E-2,"TOPIX Core30","6501",{"$f":"IFERROR(_xlfn.IFS(F920=$K$4,\"T500\",F920=$K$5,\"T500\",F920=$K$6,\"T500\"),\"\")","v":"T500"}]
[20251230,"三菱電機",6503,"電気機器",1.0513E-2,"TOPIX Core30","6503",{"$f":"IFERROR(_xlfn.IFS(F921=$K$4,\"T500\",F921=$K$5,\"T500\",F921=$K$6,\"T500\"),\"\")","v":"T500"}]
[20251230,"富士電機",6504,"電気機器",1.7819999999999999E-3,"TOPIX Mid400","6504",{"$f":"IFERROR(_xlfn.IFS(F922=$K$4,\"T500\",F922=$K$5,\"T500\",F922=$K$6,\"T500\"),\"\")","v":"T500"}]
[20251230,"安川電機",6506,"電気機器",1.0809999999999999E-3,"TOPIX Mid400","6506",{"$f":"IFERROR(_xlfn.IFS(F923=$K$4,\"T500\",F923=$K$5,\"T500\",F923=$K$6,\"T500\"),\"\")","v":"T500"}]
[20251230,"シンフォニアテクノロジー",6507,"電気機器",2.0900000000000001E-4,"TOPIX Small 1","6507",{"$f":"IFERROR(_xlfn.IFS(F924=$K$4,\"T500\",F924=$K$5,\"T500\",F924=$K$6,\"T500\"),\"\")","v":""}]
[20251230,"明電舎",6508,"電気機器",2.1599999999999999E-4,"TOPIX Small 1","6508",{"$f":"IFERROR(_xlfn.IFS(F925=$K$4,\"T500\",F925=$K$5,\"T500\",F925=$K$6,\"T500\"),\"\")","v":""}]
[20251230,"山洋電気",6516,"電気機器",1.01E-4,"TOPIX Small 1","6516",{"$f":"IFERROR(_xlfn.IFS(F926=$K$4,\"T500\",F926=$K$5,\"T500\",F926=$K$6,\"T500\"),\"\")","v":""}]
[20251230,"デンヨー",6517,"電気機器",5.5000000000000002E-5,"TOPIX Small 2","6517",{"$f":"IFERROR(_xlfn.IFS(F927=$K$4,\"T500\",F927=$K$5,\"T500\",F927=$K$6,\"T500\"),\"\")","v":""}]
[20251230,"ＰＨＣホールディングス",6523,"電気機器",4.3999999999999999E-5,"TOPIX Small 1","6523",{"$f":"IFERROR(_xlfn.IFS(F928=$K$4,\"T500\",F928=$K$5,\"T500\",F928=$K$6,\"T500\"),\"\")","v":""}]
[20251230,"ＫＯＫＵＳＡＩ　ＥＬＥＣＴＲＩＣ",6525,"電気機器",1.3179999999999999E-3,"TOPIX Mid400","6525",{"$f":"IFERROR(_xlfn.IFS(F929=$K$4,\"T500\",F929=$K$5,\"T500\",F929=$K$6,\"T500\"),\"\")","v":"T500"}]
[20251230,"ソシオネクスト",6526,"電気機器",3.97E-4,"TOPIX Mid400","6526",{"$f":"IFERROR(_xlfn.IFS(F930=$K$4,\"T500\",F930=$K$5,\"T500\",F930=$K$6,\"T500\"),\"\")","v":"T500"}]
[20251230,"ベイカレント",6532,"サービス業",1.018E-3,"TOPIX Mid400","6532",{"$f":"IFERROR(_xlfn.IFS(F931=$K$4,\"T500\",F931=$K$5,\"T500\",F931=$K$6,\"T500\"),\"\")","v":"T500"}]
[20251230,"Ｏｒｃｈｅｓｔｒａ　Ｈｏｌｄｉｎｇｓ",6533,"サービス業",5.0000000000000004E-6,"TOPIX Small 2","6533",{"$f":"IFERROR(_xlfn.IFS(F932=$K$4,\"T500\",F932=$K$5,\"T500\",F932=$K$6,\"T500\"),\"\")","v":""}]
[20251230,"アイモバイル",6535,"サービス業",1.5999999999999999E-5,"TOPIX Small 2","6535",{"$f":"IFERROR(_xlfn.IFS(F933=$K$4,\"T500\",F933=$K$5,\"T500\",F933=$K$6,\"T500\"),\"\")","v":""}]
[20251230,"ＭＳ－Ｊａｐａｎ",6539,"サービス業",1.4E-5,"TOPIX Small 2","6539",{"$f":"IFERROR(_xlfn.IFS(F934=$K$4,\"T500\",F934=$K$5,\"T500\",F934=$K$6,\"T500\"),\"\")","v":""}]
[20251230,"ジャパンエレベーターサービスホールディングス",6544,"サービス業",3.1199999999999999E-4,"TOPIX Mid400","6544",{"$f":"IFERROR(_xlfn.IFS(F935=$K$4,\"T500\",F935=$K$5,\"T500\",F935=$K$6,\"T500\"),\"\")","v":"T500"}]
[20251230,"エル・ティー・エス",6560,"サービス業",6.0000000000000002E-6,"TOPIX Small 2","6560",{"$f":"IFERROR(_xlfn.IFS(F936=$K$4,\"T500\",F936=$K$5,\"T500\",F936=$K$6,\"T500\"),\"\")","v":""}]
[20251230,"ミダックホールディングス",6564,"サービス業",2.0999999999999999E-5,"TOPIX Small 2","6564",{"$f":"IFERROR(_xlfn.IFS(F937=$K$4,\"T500\",F937=$K$5,\"T500\",F937=$K$6,\"T500\"),\"\")","v":""}]
[20251230,"キュービーネットホールディングス",6571,"サービス業",1.7E-5,"TOPIX Small 2","6571",{"$f":"IFERROR(_xlfn.IFS(F938=$K$4,\"T500\",F938=$K$5,\"T500\",F938=$K$6,\"T500\"),\"\")","v":""}]
[20251230,"オープングループ",6572,"サービス業",9.0000000000000002E-6,"TOPIX Small 2","6572",{"$f":"IFERROR(_xlfn.IFS(F939=$K$4,\"T500\",F939=$K$5,\"T500\",F939=$K$6,\"T500\"),\"\")","v":""}]
[20251230,"三櫻工業",6584,"輸送用機器",2.6999999999999999E-5,"TOPIX Small 2","6584",{"$f":"IFERROR(_xlfn.IFS(F940=$K$4,\"T500\",F940=$K$5,\"T500\",F940=$K$6,\"T500\"),\"\")","v":""}]
[20251230,"マキタ",6586,"機械",1.2340000000000001E-3,"TOPIX Mid400","6586",{"$f":"IFERROR(_xlfn.IFS(F941=$K$4,\"T500\",F941=$K$5,\"T500\",F941=$K$6,\"T500\"),\"\")","v":"T500"}]
[20251230,"東芝テック",6588,"電気機器",7.2999999999999999E-5,"TOPIX Small 1","6588",{"$f":"IFERROR(_xlfn.IFS(F942=$K$4,\"T500\",F942=$K$5,\"T500\",F942=$K$6,\"T500\"),\"\")","v":""}]
[20251230,"芝浦メカトロニクス",6590,"電気機器",2.4600000000000002E-4,"TOPIX Small 1","6590",{"$f":"IFERROR(_xlfn.IFS(F943=$K$4,\"T500\",F943=$K$5,\"T500\",F943=$K$6,\"T500\"),\"\")","v":""}]
[20251230,"マブチモーター",6592,"電気機器",2.9100000000000003E-4,"TOPIX Mid400","6592",{"$f":"IFERROR(_xlfn.IFS(F944=$K$4,\"T500\",F944=$K$5,\"T500\",F944=$K$6,\"T500\"),\"\")","v":"T500"}]
[20251230,"ユー・エム・シー・エレクトロニクス",6615,"電気機器",3.9999999999999998E-6,"TOPIX Small 2","6615",{"$f":"IFERROR(_xlfn.IFS(F945=$K$4,\"T500\",F945=$K$5,\"T500\",F945=$K$6,\"T500\"),\"\")","v":""}]
[20251230,"トレックス・セミコンダクター",6616,"電気機器",1.2E-5,"TOPIX Small 2","6616",{"$f":"IFERROR(_xlfn.IFS(F946=$K$4,\"T500\",F946=$K$5,\"T500\",F946=$K$6,\"T500\"),\"\")","v":""}]
[20251230,"東光高岳",6617,"電気機器",4.3999999999999999E-5,"TOPIX Small 2","6617",{"$f":"IFERROR(_xlfn.IFS(F947=$K$4,\"T500\",F947=$K$5,\"T500\",F947=$K$6,\"T500\"),\"\")","v":""}]
[20251230,"ダブル・スコープ",6619,"電気機器",1.0000000000000001E-5,"TOPIX Small 2","6619",{"$f":"IFERROR(_xlfn.IFS(F948=$K$4,\"T500\",F948=$K$5,\"T500\",F948=$K$6,\"T500\"),\"\")","v":""}]
[20251230,"宮越ホールディングス",6620,"不動産業",7.9999999999999996E-6,"TOPIX Small 2","6620",{"$f":"IFERROR(_xlfn.IFS(F949=$K$4,\"T500\",F949=$K$5,\"T500\",F949=$K$6,\"T500\"),\"\")","v":""}]
[20251230,"ダイヘン",6622,"電気機器",1.95E-4,"TOPIX Small 1","6622",{"$f":"IFERROR(_xlfn.IFS(F950=$K$4,\"T500\",F950=$K$5,\"T500\",F950=$K$6,\"T500\"),\"\")","v":""}]
[20251230,"ヤーマン",6630,"電気機器",3.1000000000000001E-5,"TOPIX Small 1","6630",{"$f":"IFERROR(_xlfn.IFS(F951=$K$4,\"T500\",F951=$K$5,\"T500\",F951=$K$6,\"T500\"),\"\")","v":""}]
[20251230,"ＪＶＣケンウッド",6632,"電気機器",1.9799999999999999E-4,"TOPIX Mid400","6632",{"$f":"IFERROR(_xlfn.IFS(F952=$K$4,\"T500\",F952=$K$5,\"T500\",F952=$K$6,\"T500\"),\"\")","v":"T500"}]
[20251230,"ミマキエンジニアリング",6638,"電気機器",2.8E-5,"TOPIX Small 2","6638",{"$f":"IFERROR(_xlfn.IFS(F953=$K$4,\"T500\",F953=$K$5,\"T500\",F953=$K$6,\"T500\"),\"\")","v":""}]
[20251230,"大崎電気工業",6644,"電気機器",5.0000000000000002E-5,"TOPIX Small 2","6644",{"$f":"IFERROR(_xlfn.IFS(F954=$K$4,\"T500\",F954=$K$5,\"T500\",F954=$K$6,\"T500\"),\"\")","v":""}]
[20251230,"オムロン",6645,"電気機器",6.96E-4,"TOPIX Mid400","6645",{"$f":"IFERROR(_xlfn.IFS(F955=$K$4,\"T500\",F955=$K$5,\"T500\",F955=$K$6,\"T500\"),\"\")","v":"T500"}]
[20251230,"日東工業",6651,"電気機器",1.03E-4,"TOPIX Small 1","6651",{"$f":"IFERROR(_xlfn.IFS(F956=$K$4,\"T500\",F956=$K$5,\"T500\",F956=$K$6,\"T500\"),\"\")","v":""}]
[20251230,"ＩＤＥＣ",6652,"電気機器",7.7999999999999999E-5,"TOPIX Small 1","6652",{"$f":"IFERROR(_xlfn.IFS(F957=$K$4,\"T500\",F957=$K$5,\"T500\",F957=$K$6,\"T500\"),\"\")","v":""}]
[20251230,"ジーエス・ユアサ　コーポレーション",6674,"電気機器",3.21E-4,"TOPIX Mid400","6674",{"$f":"IFERROR(_xlfn.IFS(F958=$K$4,\"T500\",F958=$K$5,\"T500\",F958=$K$6,\"T500\"),\"\")","v":"T500"}]
[20251230,"バッファロー",6676,"電気機器",2.6999999999999999E-5,"TOPIX Small 2","6676",{"$f":"IFERROR(_xlfn.IFS(F959=$K$4,\"T500\",F959=$K$5,\"T500\",F959=$K$6,\"T500\"),\"\")","v":""}]
[20251230,"テクノメディカ",6678,"電気機器",9.0000000000000002E-6,"TOPIX Small 2","6678",{"$f":"IFERROR(_xlfn.IFS(F960=$K$4,\"T500\",F960=$K$5,\"T500\",F960=$K$6,\"T500\"),\"\")","v":""}]
[20251230,"ダイヤモンドエレクトリックホールディングス",6699,"電気機器",5.0000000000000004E-6,"TOPIX Small 2","6699",{"$f":"IFERROR(_xlfn.IFS(F961=$K$4,\"T500\",F961=$K$5,\"T500\",F961=$K$6,\"T500\"),\"\")","v":""}]
[20251230,"日本電気",6701,"電気機器",7.2989999999999999E-3,"TOPIX Large70","6701",{"$f":"IFERROR(_xlfn.IFS(F962=$K$4,\"T500\",F962=$K$5,\"T500\",F962=$K$6,\"T500\"),\"\")","v":"T500"}]
[20251230,"富士通",6702,"電気機器",8.3379999999999999E-3,"TOPIX Large70",{"$f":"TEXT(C963,0)","v":"6702"},{"$f":"IFERROR(_xlfn.IFS(F963=$K$4,\"T500\",F963=$K$5,\"T500\",F963=$K$6,\"T500\"),\"\")","v":"T500"}]
[20251230,"沖電気工業",6703,"電気機器",2.0100000000000001E-4,"TOPIX Small 1","6703",{"$f":"IFERROR(_xlfn.IFS(F964=$K$4,\"T500\",F964=$K$5,\"T500\",F964=$K$6,\"T500\"),\"\")","v":""}]
[20251230,"電気興業",6706,"電気機器",2.0000000000000002E-5,"TOPIX Small 2","6706",{"$f":"IFERROR(_xlfn.IFS(F965=$K$4,\"T500\",F965=$K$5,\"T500\",F965=$K$6,\"T500\"),\"\")","v":""}]
[20251230,"サンケン電気",6707,"電気機器",1.2400000000000001E-4,"TOPIX Mid400","6707",{"$f":"IFERROR(_xlfn.IFS(F966=$K$4,\"T500\",F966=$K$5,\"T500\",F966=$K$6,\"T500\"),\"\")","v":"T500"}]
[20251230,"アイホン",6718,"電気機器",3.1999999999999999E-5,"TOPIX Small 2","6718",{"$f":"IFERROR(_xlfn.IFS(F967=$K$4,\"T500\",F967=$K$5,\"T500\",F967=$K$6,\"T500\"),\"\")","v":""}]
[20251230,"ルネサスエレクトロニクス",6723,"電気機器",4.3429999999999996E-3,"TOPIX Large70","6723",{"$f":"IFERROR(_xlfn.IFS(F968=$K$4,\"T500\",F968=$K$5,\"T500\",F968=$K$6,\"T500\"),\"\")","v":"T500"}]
[20251230,"セイコーエプソン",6724,"電気機器",5.1699999999999999E-4,"TOPIX Mid400","6724",{"$f":"IFERROR(_xlfn.IFS(F969=$K$4,\"T500\",F969=$K$5,\"T500\",F969=$K$6,\"T500\"),\"\")","v":"T500"}]
[20251230,"ワコム",6727,"電気機器",1.02E-4,"TOPIX Small 1","6727",{"$f":"IFERROR(_xlfn.IFS(F970=$K$4,\"T500\",F970=$K$5,\"T500\",F970=$K$6,\"T500\"),\"\")","v":""}]
[20251230,"アルバック",6728,"電気機器",3.2499999999999999E-4,"TOPIX Mid400","6728",{"$f":"IFERROR(_xlfn.IFS(F971=$K$4,\"T500\",F971=$K$5,\"T500\",F971=$K$6,\"T500\"),\"\")","v":"T500"}]
[20251230,"アクセル",6730,"電気機器",1.2E-5,"TOPIX Small 2","6730",{"$f":"IFERROR(_xlfn.IFS(F972=$K$4,\"T500\",F972=$K$5,\"T500\",F972=$K$6,\"T500\"),\"\")","v":""}]
[20251230,"ＥＩＺＯ",6737,"電気機器",6.8999999999999997E-5,"TOPIX Small 1","6737",{"$f":"IFERROR(_xlfn.IFS(F973=$K$4,\"T500\",F973=$K$5,\"T500\",F973=$K$6,\"T500\"),\"\")","v":""}]
[20251230,"ジャパンディスプレイ",6740,"電気機器",2.4000000000000001E-5,"TOPIX Small 2","6740",{"$f":"IFERROR(_xlfn.IFS(F974=$K$4,\"T500\",F974=$K$5,\"T500\",F974=$K$6,\"T500\"),\"\")","v":""}]
[20251230,"日本信号",6741,"電気機器",6.8999999999999997E-5,"TOPIX Small 2","6741",{"$f":"IFERROR(_xlfn.IFS(F975=$K$4,\"T500\",F975=$K$5,\"T500\",F975=$K$6,\"T500\"),\"\")","v":""}]
[20251230,"京三製作所",6742,"電気機器",3.0000000000000001E-5,"TOPIX Small 2","6742",{"$f":"IFERROR(_xlfn.IFS(F976=$K$4,\"T500\",F976=$K$5,\"T500\",F976=$K$6,\"T500\"),\"\")","v":""}]
[20251230,"能美防災",6744,"電気機器",1.0900000000000001E-4,"TOPIX Small 1","6744",{"$f":"IFERROR(_xlfn.IFS(F977=$K$4,\"T500\",F977=$K$5,\"T500\",F977=$K$6,\"T500\"),\"\")","v":""}]
[20251230,"ホーチキ",6745,"電気機器",7.2999999999999999E-5,"TOPIX Small 2","6745",{"$f":"IFERROR(_xlfn.IFS(F978=$K$4,\"T500\",F978=$K$5,\"T500\",F978=$K$6,\"T500\"),\"\")","v":""}]
[20251230,"エレコム",6750,"電気機器",8.6000000000000003E-5,"TOPIX Small 1","6750",{"$f":"IFERROR(_xlfn.IFS(F979=$K$4,\"T500\",F979=$K$5,\"T500\",F979=$K$6,\"T500\"),\"\")","v":""}]
[20251230,"パナソニック　ホールディングス",6752,"電気機器",5.0039999999999998E-3,"TOPIX Large70","6752",{"$f":"IFERROR(_xlfn.IFS(F980=$K$4,\"T500\",F980=$K$5,\"T500\",F980=$K$6,\"T500\"),\"\")","v":"T500"}]
[20251230,"シャープ",6753,"電気機器",1.94E-4,"TOPIX Mid400","6753",{"$f":"IFERROR(_xlfn.IFS(F981=$K$4,\"T500\",F981=$K$5,\"T500\",F981=$K$6,\"T500\"),\"\")","v":"T500"}]
[20251230,"アンリツ",6754,"電気機器",3.0699999999999998E-4,"TOPIX Mid400","6754",{"$f":"IFERROR(_xlfn.IFS(F982=$K$4,\"T500\",F982=$K$5,\"T500\",F982=$K$6,\"T500\"),\"\")","v":"T500"}]
[20251230,"ソニーグループ",6758,"電気機器",2.8768999999999999E-2,"TOPIX Core30","6758",{"$f":"IFERROR(_xlfn.IFS(F983=$K$4,\"T500\",F983=$K$5,\"T500\",F983=$K$6,\"T500\"),\"\")","v":"T500"}]
[20251230,"ＴＤＫ",6762,"電気機器",3.9969999999999997E-3,"TOPIX Large70","6762",{"$f":"IFERROR(_xlfn.IFS(F984=$K$4,\"T500\",F984=$K$5,\"T500\",F984=$K$6,\"T500\"),\"\")","v":"T500"}]
[20251230,"帝国通信工業",6763,"電気機器",2.5000000000000001E-5,"TOPIX Small 2","6763",{"$f":"IFERROR(_xlfn.IFS(F985=$K$4,\"T500\",F985=$K$5,\"T500\",F985=$K$6,\"T500\"),\"\")","v":""}]
[20251230,"タムラ製作所",6768,"電気機器",5.1E-5,"TOPIX Small 1","6768",{"$f":"IFERROR(_xlfn.IFS(F986=$K$4,\"T500\",F986=$K$5,\"T500\",F986=$K$6,\"T500\"),\"\")","v":""}]
[20251230,"アルプスアルパイン",6770,"電気機器",3.2200000000000002E-4,"TOPIX Mid400","6770",{"$f":"IFERROR(_xlfn.IFS(F987=$K$4,\"T500\",F987=$K$5,\"T500\",F987=$K$6,\"T500\"),\"\")","v":"T500"}]
[20251230,"日本電波工業",6779,"電気機器",2.5999999999999998E-5,"TOPIX Small 2","6779",{"$f":"IFERROR(_xlfn.IFS(F988=$K$4,\"T500\",F988=$K$5,\"T500\",F988=$K$6,\"T500\"),\"\")","v":""}]
[20251230,"鈴木",6785,"電気機器",2.6999999999999999E-5,"TOPIX Small 2","6785",{"$f":"IFERROR(_xlfn.IFS(F989=$K$4,\"T500\",F989=$K$5,\"T500\",F989=$K$6,\"T500\"),\"\")","v":""}]
[20251230,"メイコー",6787,"電気機器",2.0000000000000001E-4,"TOPIX Small 1","6787",{"$f":"IFERROR(_xlfn.IFS(F990=$K$4,\"T500\",F990=$K$5,\"T500\",F990=$K$6,\"T500\"),\"\")","v":""}]
[20251230,"日本トリム",6788,"電気機器",2.4000000000000001E-5,"TOPIX Small 2","6788",{"$f":"IFERROR(_xlfn.IFS(F991=$K$4,\"T500\",F991=$K$5,\"T500\",F991=$K$6,\"T500\"),\"\")","v":""}]
[20251230,"フォスター電機",6794,"電気機器",5.3000000000000001E-5,"TOPIX Small 2","6794",{"$f":"IFERROR(_xlfn.IFS(F992=$K$4,\"T500\",F992=$K$5,\"T500\",F992=$K$6,\"T500\"),\"\")","v":""}]
[20251230,"ＳＭＫ",6798,"電気機器",1.2999999999999999E-5,"TOPIX Small 2","6798",{"$f":"IFERROR(_xlfn.IFS(F993=$K$4,\"T500\",F993=$K$5,\"T500\",F993=$K$6,\"T500\"),\"\")","v":""}]
[20251230,"ヨコオ",6800,"電気機器",4.1999999999999998E-5,"TOPIX Small 2","6800",{"$f":"IFERROR(_xlfn.IFS(F994=$K$4,\"T500\",F994=$K$5,\"T500\",F994=$K$6,\"T500\"),\"\")","v":""}]
[20251230,"ホシデン",6804,"電気機器",1.0399999999999999E-4,"TOPIX Small 1","6804",{"$f":"IFERROR(_xlfn.IFS(F995=$K$4,\"T500\",F995=$K$5,\"T500\",F995=$K$6,\"T500\"),\"\")","v":""}]
[20251230,"ヒロセ電機",6806,"電気機器",5.2599999999999999E-4,"TOPIX Mid400","6806",{"$f":"IFERROR(_xlfn.IFS(F996=$K$4,\"T500\",F996=$K$5,\"T500\",F996=$K$6,\"T500\"),\"\")","v":"T500"}]
[20251230,"日本航空電子工業",6807,"電気機器",1.2300000000000001E-4,"TOPIX Small 1","6807",{"$f":"IFERROR(_xlfn.IFS(F997=$K$4,\"T500\",F997=$K$5,\"T500\",F997=$K$6,\"T500\"),\"\")","v":""}]
[20251230,"ＴＯＡ",6809,"電気機器",3.4E-5,"TOPIX Small 2","6809",{"$f":"IFERROR(_xlfn.IFS(F998=$K$4,\"T500\",F998=$K$5,\"T500\",F998=$K$6,\"T500\"),\"\")","v":""}]
[20251230,"マクセル",6810,"電気機器",1.05E-4,"TOPIX Small 1","6810",{"$f":"IFERROR(_xlfn.IFS(F999=$K$4,\"T500\",F999=$K$5,\"T500\",F999=$K$6,\"T500\"),\"\")","v":""}]
[20251230,"古野電気",6814,"電気機器",2.1699999999999999E-4,"TOPIX Small 1","6814",{"$f":"IFERROR(_xlfn.IFS(F1000=$K$4,\"T500\",F1000=$K$5,\"T500\",F1000=$K$6,\"T500\"),\"\")","v":""}]
[20251230,"スミダコーポレーション",6817,"電気機器",4.1E-5,"TOPIX Small 2","6817",{"$f":"IFERROR(_xlfn.IFS(F1001=$K$4,\"T500\",F1001=$K$5,\"T500\",F1001=$K$6,\"T500\"),\"\")","v":""}]
[20251230,"アイコム",6820,"電気機器",2.3E-5,"TOPIX Small 2","6820",{"$f":"IFERROR(_xlfn.IFS(F1002=$K$4,\"T500\",F1002=$K$5,\"T500\",F1002=$K$6,\"T500\"),\"\")","v":""}]
[20251230,"リオン",6823,"電気機器",2.3E-5,"TOPIX Small 2","6823",{"$f":"IFERROR(_xlfn.IFS(F1003=$K$4,\"T500\",F1003=$K$5,\"T500\",F1003=$K$6,\"T500\"),\"\")","v":""}]
[20251230,"横河電機",6841,"電気機器",1.1490000000000001E-3,"TOPIX Mid400","6841",{"$f":"IFERROR(_xlfn.IFS(F1004=$K$4,\"T500\",F1004=$K$5,\"T500\",F1004=$K$6,\"T500\"),\"\")","v":"T500"}]
[20251230,"新電元工業",6844,"電気機器",3.0000000000000001E-5,"TOPIX Small 2","6844",{"$f":"IFERROR(_xlfn.IFS(F1005=$K$4,\"T500\",F1005=$K$5,\"T500\",F1005=$K$6,\"T500\"),\"\")","v":""}]
[20251230,"アズビル",6845,"電気機器",7.1599999999999995E-4,"TOPIX Mid400","6845",{"$f":"IFERROR(_xlfn.IFS(F1006=$K$4,\"T500\",F1006=$K$5,\"T500\",F1006=$K$6,\"T500\"),\"\")","v":"T500"}]
[20251230,"日本光電工業",6849,"電気機器",2.9E-4,"TOPIX Mid400","6849",{"$f":"IFERROR(_xlfn.IFS(F1007=$K$4,\"T500\",F1007=$K$5,\"T500\",F1007=$K$6,\"T500\"),\"\")","v":"T500"}]
[20251230,"チノー",6850,"電気機器",2.4000000000000001E-5,"TOPIX Small 2","6850",{"$f":"IFERROR(_xlfn.IFS(F1008=$K$4,\"T500\",F1008=$K$5,\"T500\",F1008=$K$6,\"T500\"),\"\")","v":""}]
[20251230,"日本電子材料",6855,"電気機器",4.8999999999999998E-5,"TOPIX Small 2","6855",{"$f":"IFERROR(_xlfn.IFS(F1009=$K$4,\"T500\",F1009=$K$5,\"T500\",F1009=$K$6,\"T500\"),\"\")","v":""}]
[20251230,"堀場製作所",6856,"電気機器",6.2699999999999995E-4,"TOPIX Mid400","6856",{"$f":"IFERROR(_xlfn.IFS(F1010=$K$4,\"T500\",F1010=$K$5,\"T500\",F1010=$K$6,\"T500\"),\"\")","v":"T500"}]
[20251230,"アドバンテスト",6857,"電気機器",1.2825E-2,"TOPIX Core30","6857",{"$f":"IFERROR(_xlfn.IFS(F1011=$K$4,\"T500\",F1011=$K$5,\"T500\",F1011=$K$6,\"T500\"),\"\")","v":"T500"}]
[20251230,"エスペック",6859,"電気機器",6.7999999999999999E-5,"TOPIX Small 1","6859",{"$f":"IFERROR(_xlfn.IFS(F1012=$K$4,\"T500\",F1012=$K$5,\"T500\",F1012=$K$6,\"T500\"),\"\")","v":""}]
[20251230,"キーエンス",6861,"電気機器",1.1752E-2,"TOPIX Core30","6861",{"$f":"IFERROR(_xlfn.IFS(F1013=$K$4,\"T500\",F1013=$K$5,\"T500\",F1013=$K$6,\"T500\"),\"\")","v":"T500"}]
[20251230,"日置電機",6866,"電気機器",6.6000000000000005E-5,"TOPIX Small 1","6866",{"$f":"IFERROR(_xlfn.IFS(F1014=$K$4,\"T500\",F1014=$K$5,\"T500\",F1014=$K$6,\"T500\"),\"\")","v":""}]
[20251230,"シスメックス",6869,"電気機器",8.2799999999999996E-4,"TOPIX Mid400","6869",{"$f":"IFERROR(_xlfn.IFS(F1015=$K$4,\"T500\",F1015=$K$5,\"T500\",F1015=$K$6,\"T500\"),\"\")","v":"T500"}]
[20251230,"日本マイクロニクス",6871,"電気機器",2.41E-4,"TOPIX Small 1","6871",{"$f":"IFERROR(_xlfn.IFS(F1016=$K$4,\"T500\",F1016=$K$5,\"T500\",F1016=$K$6,\"T500\"),\"\")","v":""}]
[20251230,"メガチップス",6875,"電気機器",1.1400000000000001E-4,"TOPIX Small 1","6875",{"$f":"IFERROR(_xlfn.IFS(F1017=$K$4,\"T500\",F1017=$K$5,\"T500\",F1017=$K$6,\"T500\"),\"\")","v":""}]
[20251230,"ＯＢＡＲＡ　ＧＲＯＵＰ",6877,"電気機器",4.3000000000000002E-5,"TOPIX Small 2","6877",{"$f":"IFERROR(_xlfn.IFS(F1018=$K$4,\"T500\",F1018=$K$5,\"T500\",F1018=$K$6,\"T500\"),\"\")","v":""}]
[20251230,"デンソー",6902,"輸送用機器",4.3819999999999996E-3,"TOPIX Large70","6902",{"$f":"IFERROR(_xlfn.IFS(F1019=$K$4,\"T500\",F1019=$K$5,\"T500\",F1019=$K$6,\"T500\"),\"\")","v":"T500"}]
[20251230,"コーセル",6905,"電気機器",2.8E-5,"TOPIX Small 2","6905",{"$f":"IFERROR(_xlfn.IFS(F1020=$K$4,\"T500\",F1020=$K$5,\"T500\",F1020=$K$6,\"T500\"),\"\")","v":""}]
[20251230,"イリソ電子工業",6908,"電気機器",5.5000000000000002E-5,"TOPIX Small 1","6908",{"$f":"IFERROR(_xlfn.IFS(F1021=$K$4,\"T500\",F1021=$K$5,\"T500\",F1021=$K$6,\"T500\"),\"\")","v":""}]
[20251230,"オプテックスグループ",6914,"電気機器",9.0000000000000006E-5,"TOPIX Small 1","6914",{"$f":"IFERROR(_xlfn.IFS(F1022=$K$4,\"T500\",F1022=$K$5,\"T500\",F1022=$K$6,\"T500\"),\"\")","v":""}]
[20251230,"千代田インテグレ",6915,"電気機器",1.7E-5,"TOPIX Small 2","6915",{"$f":"IFERROR(_xlfn.IFS(F1023=$K$4,\"T500\",F1023=$K$5,\"T500\",F1023=$K$6,\"T500\"),\"\")","v":""}]
[20251230,"レーザーテック",6920,"電気機器",2.3830000000000001E-3,"TOPIX Large70","6920",{"$f":"IFERROR(_xlfn.IFS(F1024=$K$4,\"T500\",F1024=$K$5,\"T500\",F1024=$K$6,\"T500\"),\"\")","v":"T500"}]
[20251230,"スタンレー電気",6923,"電気機器",3.2600000000000001E-4,"TOPIX Mid400","6923",{"$f":"IFERROR(_xlfn.IFS(F1025=$K$4,\"T500\",F1025=$K$5,\"T500\",F1025=$K$6,\"T500\"),\"\")","v":"T500"}]
[20251230,"ウシオ電機",6925,"電気機器",2.1499999999999999E-4,"TOPIX Mid400","6925",{"$f":"IFERROR(_xlfn.IFS(F1026=$K$4,\"T500\",F1026=$K$5,\"T500\",F1026=$K$6,\"T500\"),\"\")","v":"T500"}]
[20251230,"日本セラミック",6929,"電気機器",6.3999999999999997E-5,"TOPIX Small 1",{"$f":"TEXT(C1027,0)","v":"6929"},{"$f":"IFERROR(_xlfn.IFS(F1027=$K$4,\"T500\",F1027=$K$5,\"T500\",F1027=$K$6,\"T500\"),\"\")","v":""}]
[20251230,"山一電機",6941,"電気機器",1.1900000000000001E-4,"TOPIX Small 1","6941",{"$f":"IFERROR(_xlfn.IFS(F1028=$K$4,\"T500\",F1028=$K$5,\"T500\",F1028=$K$6,\"T500\"),\"\")","v":""}]
[20251230,"図研",6947,"電気機器",8.3999999999999995E-5,"TOPIX Small 1","6947",{"$f":"IFERROR(_xlfn.IFS(F1029=$K$4,\"T500\",F1029=$K$5,\"T500\",F1029=$K$6,\"T500\"),\"\")","v":""}]
[20251230,"日本電子",6951,"電気機器",2.41E-4,"TOPIX Mid400","6951",{"$f":"IFERROR(_xlfn.IFS(F1030=$K$4,\"T500\",F1030=$K$5,\"T500\",F1030=$K$6,\"T500\"),\"\")","v":"T500"}]
[20251230,"カシオ計算機",6952,"電気機器",2.1100000000000001E-4,"TOPIX Mid400","6952",{"$f":"IFERROR(_xlfn.IFS(F1031=$K$4,\"T500\",F1031=$K$5,\"T500\",F1031=$K$6,\"T500\"),\"\")","v":"T500"}]
[20251230,"ファナック",6954,"電気機器",6.0219999999999996E-3,"TOPIX Large70","6954",{"$f":"IFERROR(_xlfn.IFS(F1032=$K$4,\"T500\",F1032=$K$5,\"T500\",F1032=$K$6,\"T500\"),\"\")","v":"T500"}]
[20251230,"日本シイエムケイ",6958,"電気機器",3.4999999999999997E-5,"TOPIX Small 2","6958",{"$f":"IFERROR(_xlfn.IFS(F1033=$K$4,\"T500\",F1033=$K$5,\"T500\",F1033=$K$6,\"T500\"),\"\")","v":""}]
[20251230,"エンプラス",6961,"電気機器",5.5999999999999999E-5,"TOPIX Small 2","6961",{"$f":"IFERROR(_xlfn.IFS(F1034=$K$4,\"T500\",F1034=$K$5,\"T500\",F1034=$K$6,\"T500\"),\"\")","v":""}]
[20251230,"大真空",6962,"電気機器",1.7E-5,"TOPIX Small 2","6962",{"$f":"IFERROR(_xlfn.IFS(F1035=$K$4,\"T500\",F1035=$K$5,\"T500\",F1035=$K$6,\"T500\"),\"\")","v":""}]
[20251230,"ローム",6963,"電気機器",9.0300000000000005E-4,"TOPIX Mid400","6963",{"$f":"IFERROR(_xlfn.IFS(F1036=$K$4,\"T500\",F1036=$K$5,\"T500\",F1036=$K$6,\"T500\"),\"\")","v":"T500"}]
[20251230,"浜松ホトニクス",6965,"電気機器",5.7499999999999999E-4,"TOPIX Mid400","6965",{"$f":"IFERROR(_xlfn.IFS(F1037=$K$4,\"T500\",F1037=$K$5,\"T500\",F1037=$K$6,\"T500\"),\"\")","v":"T500"}]
[20251230,"三井ハイテック",6966,"電気機器",8.1000000000000004E-5,"TOPIX Small 1","6966",{"$f":"IFERROR(_xlfn.IFS(F1038=$K$4,\"T500\",F1038=$K$5,\"T500\",F1038=$K$6,\"T500\"),\"\")","v":""}]
[20251230,"京セラ",6971,"電気機器",2.8279999999999998E-3,"TOPIX Large70","6971",{"$f":"IFERROR(_xlfn.IFS(F1039=$K$4,\"T500\",F1039=$K$5,\"T500\",F1039=$K$6,\"T500\"),\"\")","v":"T500"}]
[20251230,"太陽誘電",6976,"電気機器",3.9300000000000001E-4,"TOPIX Mid400","6976",{"$f":"IFERROR(_xlfn.IFS(F1040=$K$4,\"T500\",F1040=$K$5,\"T500\",F1040=$K$6,\"T500\"),\"\")","v":"T500"}]
[20251230,"村田製作所",6981,"電気機器",6.4200000000000004E-3,"TOPIX Large70","6981",{"$f":"IFERROR(_xlfn.IFS(F1041=$K$4,\"T500\",F1041=$K$5,\"T500\",F1041=$K$6,\"T500\"),\"\")","v":"T500"}]
[20251230,"双葉電子工業",6986,"電気機器",2.5000000000000001E-5,"TOPIX Small 2","6986",{"$f":"IFERROR(_xlfn.IFS(F1042=$K$4,\"T500\",F1042=$K$5,\"T500\",F1042=$K$6,\"T500\"),\"\")","v":""}]
[20251230,"日東電工",6988,"化学",2.3449999999999999E-3,"TOPIX Mid400","6988",{"$f":"IFERROR(_xlfn.IFS(F1043=$K$4,\"T500\",F1043=$K$5,\"T500\",F1043=$K$6,\"T500\"),\"\")","v":"T500"}]
[20251230,"東海理化電機製作所",6995,"輸送用機器",1.7200000000000001E-4,"TOPIX Small 1","6995",{"$f":"IFERROR(_xlfn.IFS(F1044=$K$4,\"T500\",F1044=$K$5,\"T500\",F1044=$K$6,\"T500\"),\"\")","v":""}]
[20251230,"ニチコン",6996,"電気機器",8.8999999999999995E-5,"TOPIX Small 1","6996",{"$f":"IFERROR(_xlfn.IFS(F1045=$K$4,\"T500\",F1045=$K$5,\"T500\",F1045=$K$6,\"T500\"),\"\")","v":""}]
[20251230,"日本ケミコン",6997,"電気機器",3.8999999999999999E-5,"TOPIX Small 2","6997",{"$f":"IFERROR(_xlfn.IFS(F1046=$K$4,\"T500\",F1046=$K$5,\"T500\",F1046=$K$6,\"T500\"),\"\")","v":""}]
[20251230,"ＫＯＡ",6999,"電気機器",5.1999999999999997E-5,"TOPIX Small 1","6999",{"$f":"IFERROR(_xlfn.IFS(F1047=$K$4,\"T500\",F1047=$K$5,\"T500\",F1047=$K$6,\"T500\"),\"\")","v":""}]
[20251230,"三井Ｅ＆Ｓ",7003,"機械",5.7799999999999995E-4,"TOPIX Mid400","7003",{"$f":"IFERROR(_xlfn.IFS(F1048=$K$4,\"T500\",F1048=$K$5,\"T500\",F1048=$K$6,\"T500\"),\"\")","v":"T500"}]
[20251230,"カナデビア",7004,"機械",1.63E-4,"TOPIX Small 1","7004",{"$f":"IFERROR(_xlfn.IFS(F1049=$K$4,\"T500\",F1049=$K$5,\"T500\",F1049=$K$6,\"T500\"),\"\")","v":""}]
[20251230,"三菱重工業",7011,"機械",1.506E-2,"TOPIX Core30","7011",{"$f":"IFERROR(_xlfn.IFS(F1050=$K$4,\"T500\",F1050=$K$5,\"T500\",F1050=$K$6,\"T500\"),\"\")","v":"T500"}]
[20251230,"川崎重工業",7012,"輸送用機器",1.621E-3,"TOPIX Mid400","7012",{"$f":"IFERROR(_xlfn.IFS(F1051=$K$4,\"T500\",F1051=$K$5,\"T500\",F1051=$K$6,\"T500\"),\"\")","v":"T500"}]
[20251230,"ＩＨＩ",7013,"機械",3.0049999999999999E-3,"TOPIX Mid400","7013",{"$f":"IFERROR(_xlfn.IFS(F1052=$K$4,\"T500\",F1052=$K$5,\"T500\",F1052=$K$6,\"T500\"),\"\")","v":"T500"}]
[20251230,"名村造船所",7014,"輸送用機器",2.2900000000000001E-4,"TOPIX Small 1","7014",{"$f":"IFERROR(_xlfn.IFS(F1053=$K$4,\"T500\",F1053=$K$5,\"T500\",F1053=$K$6,\"T500\"),\"\")","v":""}]
[20251230,"マネジメントソリューションズ",7033,"サービス業",1.5999999999999999E-5,"TOPIX Small 2","7033",{"$f":"IFERROR(_xlfn.IFS(F1054=$K$4,\"T500\",F1054=$K$5,\"T500\",F1054=$K$6,\"T500\"),\"\")","v":""}]
[20251230,"プロレド・パートナーズ",7034,"サービス業",3.0000000000000001E-6,"TOPIX Small 2","7034",{"$f":"IFERROR(_xlfn.IFS(F1055=$K$4,\"T500\",F1055=$K$5,\"T500\",F1055=$K$6,\"T500\"),\"\")","v":""}]
[20251230,"フロンティア・マネジメント",7038,"サービス業",5.0000000000000004E-6,"TOPIX Small 2","7038",{"$f":"IFERROR(_xlfn.IFS(F1056=$K$4,\"T500\",F1056=$K$5,\"T500\",F1056=$K$6,\"T500\"),\"\")","v":""}]
[20251230,"アンビスホールディングス",7071,"サービス業",2.1999999999999999E-5,"TOPIX Small 2","7071",{"$f":"IFERROR(_xlfn.IFS(F1057=$K$4,\"T500\",F1057=$K$5,\"T500\",F1057=$K$6,\"T500\"),\"\")","v":""}]
[20251230,"カーブスホールディングス",7085,"サービス業",4.6999999999999997E-5,"TOPIX Small 1","7085",{"$f":"IFERROR(_xlfn.IFS(F1058=$K$4,\"T500\",F1058=$K$5,\"T500\",F1058=$K$6,\"T500\"),\"\")","v":""}]
[20251230,"フォーラムエンジニアリング",7088,"サービス業",4.1999999999999998E-5,"TOPIX Small 2","7088",{"$f":"IFERROR(_xlfn.IFS(F1059=$K$4,\"T500\",F1059=$K$5,\"T500\",F1059=$K$6,\"T500\"),\"\")","v":""}]
[20251230,"Ｆａｓｔ　Ｆｉｔｎｅｓｓ　Ｊａｐａｎ",7092,"サービス業",1.2999999999999999E-5,"TOPIX Small 2","7092",{"$f":"IFERROR(_xlfn.IFS(F1060=$K$4,\"T500\",F1060=$K$5,\"T500\",F1060=$K$6,\"T500\"),\"\")","v":""}]
[20251230,"Ｍａｃｂｅｅ　Ｐｌａｎｅｔ",7095,"サービス業",1.2E-5,"TOPIX Small 2","7095",{"$f":"IFERROR(_xlfn.IFS(F1061=$K$4,\"T500\",F1061=$K$5,\"T500\",F1061=$K$6,\"T500\"),\"\")","v":""}]
[20251230,"日本車輌製造",7102,"輸送用機器",3.0000000000000001E-5,"TOPIX Small 2","7102",{"$f":"IFERROR(_xlfn.IFS(F1062=$K$4,\"T500\",F1062=$K$5,\"T500\",F1062=$K$6,\"T500\"),\"\")","v":""}]
[20251230,"三菱ロジスネクスト",7105,"輸送用機器",5.1E-5,"TOPIX Small 1","7105",{"$f":"IFERROR(_xlfn.IFS(F1063=$K$4,\"T500\",F1063=$K$5,\"T500\",F1063=$K$6,\"T500\"),\"\")","v":""}]
[20251230,"フルサト・マルカホールディングス",7128,"卸売業",4.1999999999999998E-5,"TOPIX Small 1","7128",{"$f":"IFERROR(_xlfn.IFS(F1064=$K$4,\"T500\",F1064=$K$5,\"T500\",F1064=$K$6,\"T500\"),\"\")","v":""}]
[20251230,"ヤマエグループホールディングス",7130,"卸売業",5.5000000000000002E-5,"TOPIX Small 1","7130",{"$f":"IFERROR(_xlfn.IFS(F1065=$K$4,\"T500\",F1065=$K$5,\"T500\",F1065=$K$6,\"T500\"),\"\")","v":""}]
[20251230,"ＦＰＧ",7148,"証券、商品先物取引業",1.25E-4,"TOPIX Small 1","7148",{"$f":"IFERROR(_xlfn.IFS(F1066=$K$4,\"T500\",F1066=$K$5,\"T500\",F1066=$K$6,\"T500\"),\"\")","v":""}]
[20251230,"ライフネット生命保険",7157,"保険業",6.3999999999999997E-5,"TOPIX Small 1","7157",{"$f":"IFERROR(_xlfn.IFS(F1067=$K$4,\"T500\",F1067=$K$5,\"T500\",F1067=$K$6,\"T500\"),\"\")","v":""}]
[20251230,"全国保証",7164,"その他金融業",3.6600000000000001E-4,"TOPIX Mid400","7164",{"$f":"IFERROR(_xlfn.IFS(F1068=$K$4,\"T500\",F1068=$K$5,\"T500\",F1068=$K$6,\"T500\"),\"\")","v":"T500"}]
[20251230,"めぶきフィナンシャルグループ",7167,"銀行業",9.8999999999999999E-4,"TOPIX Mid400","7167",{"$f":"IFERROR(_xlfn.IFS(F1069=$K$4,\"T500\",F1069=$K$5,\"T500\",F1069=$K$6,\"T500\"),\"\")","v":"T500"}]
[20251230,"ジャパンインベストメントアドバイザー",7172,"証券、商品先物取引業",6.7000000000000002E-5,"TOPIX Small 1","7172",{"$f":"IFERROR(_xlfn.IFS(F1070=$K$4,\"T500\",F1070=$K$5,\"T500\",F1070=$K$6,\"T500\"),\"\")","v":""}]
[20251230,"東京きらぼしフィナンシャルグループ",7173,"銀行業",2.2699999999999999E-4,"TOPIX Small 1","7173",{"$f":"IFERROR(_xlfn.IFS(F1071=$K$4,\"T500\",F1071=$K$5,\"T500\",F1071=$K$6,\"T500\"),\"\")","v":""}]
[20251230,"九州フィナンシャルグループ",7180,"銀行業",4.0200000000000001E-4,"TOPIX Mid400","7180",{"$f":"IFERROR(_xlfn.IFS(F1072=$K$4,\"T500\",F1072=$K$5,\"T500\",F1072=$K$6,\"T500\"),\"\")","v":"T500"}]
[20251230,"かんぽ生命保険",7181,"保険業",1.0859999999999999E-3,"TOPIX Mid400","7181",{"$f":"IFERROR(_xlfn.IFS(F1073=$K$4,\"T500\",F1073=$K$5,\"T500\",F1073=$K$6,\"T500\"),\"\")","v":"T500"}]
[20251230,"ゆうちょ銀行",7182,"銀行業",4.8979999999999996E-3,"TOPIX Large70","7182",{"$f":"IFERROR(_xlfn.IFS(F1074=$K$4,\"T500\",F1074=$K$5,\"T500\",F1074=$K$6,\"T500\"),\"\")","v":"T500"}]
[20251230,"富山第一銀行",7184,"銀行業",1.18E-4,"TOPIX Small 1","7184",{"$f":"IFERROR(_xlfn.IFS(F1075=$K$4,\"T500\",F1075=$K$5,\"T500\",F1075=$K$6,\"T500\"),\"\")","v":""}]
[20251230,"横浜フィナンシャルグループ",7186,"銀行業",1.377E-3,"TOPIX Mid400","7186",{"$f":"IFERROR(_xlfn.IFS(F1076=$K$4,\"T500\",F1076=$K$5,\"T500\",F1076=$K$6,\"T500\"),\"\")","v":"T500"}]
[20251230,"ジェイリース",7187,"その他金融業",2.1999999999999999E-5,"TOPIX Small 2","7187",{"$f":"IFERROR(_xlfn.IFS(F1077=$K$4,\"T500\",F1077=$K$5,\"T500\",F1077=$K$6,\"T500\"),\"\")","v":""}]
[20251230,"西日本フィナンシャルホールディングス",7189,"銀行業",4.0099999999999999E-4,"TOPIX Mid400","7189",{"$f":"IFERROR(_xlfn.IFS(F1078=$K$4,\"T500\",F1078=$K$5,\"T500\",F1078=$K$6,\"T500\"),\"\")","v":"T500"}]
[20251230,"ＳＢＩアルヒ",7198,"その他金融業",1.9000000000000001E-5,"TOPIX Small 2","7198",{"$f":"IFERROR(_xlfn.IFS(F1079=$K$4,\"T500\",F1079=$K$5,\"T500\",F1079=$K$6,\"T500\"),\"\")","v":""}]
[20251230,"プレミアグループ",7199,"その他金融業",6.7000000000000002E-5,"TOPIX Small 1","7199",{"$f":"IFERROR(_xlfn.IFS(F1080=$K$4,\"T500\",F1080=$K$5,\"T500\",F1080=$K$6,\"T500\"),\"\")","v":""}]
[20251230,"日産自動車",7201,"輸送用機器",1.235E-3,"TOPIX Mid400","7201",{"$f":"IFERROR(_xlfn.IFS(F1081=$K$4,\"T500\",F1081=$K$5,\"T500\",F1081=$K$6,\"T500\"),\"\")","v":"T500"}]
[20251230,"いすゞ自動車",7202,"輸送用機器",1.3489999999999999E-3,"TOPIX Mid400","7202",{"$f":"IFERROR(_xlfn.IFS(F1082=$K$4,\"T500\",F1082=$K$5,\"T500\",F1082=$K$6,\"T500\"),\"\")","v":"T500"}]
[20251230,"トヨタ自動車",7203,"輸送用機器",3.6974E-2,"TOPIX Core30","7203",{"$f":"IFERROR(_xlfn.IFS(F1083=$K$4,\"T500\",F1083=$K$5,\"T500\",F1083=$K$6,\"T500\"),\"\")","v":"T500"}]
[20251230,"日野自動車",7205,"輸送用機器",1.2E-4,"TOPIX Small 1","7205",{"$f":"IFERROR(_xlfn.IFS(F1084=$K$4,\"T500\",F1084=$K$5,\"T500\",F1084=$K$6,\"T500\"),\"\")","v":""}]
[20251230,"三菱自動車工業",7211,"輸送用機器",2.9399999999999999E-4,"TOPIX Mid400","7211",{"$f":"IFERROR(_xlfn.IFS(F1085=$K$4,\"T500\",F1085=$K$5,\"T500\",F1085=$K$6,\"T500\"),\"\")","v":"T500"}]
[20251230,"武蔵精密工業",7220,"輸送用機器",1.17E-4,"TOPIX Small 1","7220",{"$f":"IFERROR(_xlfn.IFS(F1086=$K$4,\"T500\",F1086=$K$5,\"T500\",F1086=$K$6,\"T500\"),\"\")","v":""}]
[20251230,"日産車体",7222,"輸送用機器",3.1999999999999999E-5,"TOPIX Small 2","7222",{"$f":"IFERROR(_xlfn.IFS(F1087=$K$4,\"T500\",F1087=$K$5,\"T500\",F1087=$K$6,\"T500\"),\"\")","v":""}]
[20251230,"新明和工業",7224,"輸送用機器",1.1400000000000001E-4,"TOPIX Small 1","7224",{"$f":"IFERROR(_xlfn.IFS(F1088=$K$4,\"T500\",F1088=$K$5,\"T500\",F1088=$K$6,\"T500\"),\"\")","v":""}]
[20251230,"極東開発工業",7226,"輸送用機器",1.07E-4,"TOPIX Small 1","7226",{"$f":"IFERROR(_xlfn.IFS(F1089=$K$4,\"T500\",F1089=$K$5,\"T500\",F1089=$K$6,\"T500\"),\"\")","v":""}]
[20251230,"トピー工業",7231,"輸送用機器",4.6E-5,"TOPIX Small 2","7231",{"$f":"IFERROR(_xlfn.IFS(F1090=$K$4,\"T500\",F1090=$K$5,\"T500\",F1090=$K$6,\"T500\"),\"\")","v":""}]
[20251230,"ティラド",7236,"輸送用機器",3.0000000000000001E-5,"TOPIX Small 2",{"$f":"TEXT(C1091,0)","v":"7236"},{"$f":"IFERROR(_xlfn.IFS(F1091=$K$4,\"T500\",F1091=$K$5,\"T500\",F1091=$K$6,\"T500\"),\"\")","v":""}]
[20251230,"曙ブレーキ工業",7238,"輸送用機器",1.5E-5,"TOPIX Small 2","7238",{"$f":"IFERROR(_xlfn.IFS(F1092=$K$4,\"T500\",F1092=$K$5,\"T500\",F1092=$K$6,\"T500\"),\"\")","v":""}]
[20251230,"タチエス",7239,"輸送用機器",8.0000000000000007E-5,"TOPIX Small 1","7239",{"$f":"IFERROR(_xlfn.IFS(F1093=$K$4,\"T500\",F1093=$K$5,\"T500\",F1093=$K$6,\"T500\"),\"\")","v":""}]
[20251230,"ＮＯＫ",7240,"輸送用機器",2.1599999999999999E-4,"TOPIX Mid400","7240",{"$f":"IFERROR(_xlfn.IFS(F1094=$K$4,\"T500\",F1094=$K$5,\"T500\",F1094=$K$6,\"T500\"),\"\")","v":"T500"}]
[20251230,"フタバ産業",7241,"輸送用機器",5.8E-5,"TOPIX Small 1","7241",{"$f":"IFERROR(_xlfn.IFS(F1095=$K$4,\"T500\",F1095=$K$5,\"T500\",F1095=$K$6,\"T500\"),\"\")","v":""}]
[20251230,"カヤバ",7242,"輸送用機器",1.5699999999999999E-4,"TOPIX Small 1","7242",{"$f":"IFERROR(_xlfn.IFS(F1096=$K$4,\"T500\",F1096=$K$5,\"T500\",F1096=$K$6,\"T500\"),\"\")","v":""}]
[20251230,"市光工業",7244,"電気機器",2.3E-5,"TOPIX Small 2","7244",{"$f":"IFERROR(_xlfn.IFS(F1097=$K$4,\"T500\",F1097=$K$5,\"T500\",F1097=$K$6,\"T500\"),\"\")","v":""}]
[20251230,"大同メタル工業",7245,"輸送用機器",4.0000000000000003E-5,"TOPIX Small 2","7245",{"$f":"IFERROR(_xlfn.IFS(F1098=$K$4,\"T500\",F1098=$K$5,\"T500\",F1098=$K$6,\"T500\"),\"\")","v":""}]
[20251230,"プレス工業",7246,"輸送用機器",6.8999999999999997E-5,"TOPIX Small 1","7246",{"$f":"IFERROR(_xlfn.IFS(F1099=$K$4,\"T500\",F1099=$K$5,\"T500\",F1099=$K$6,\"T500\"),\"\")","v":""}]
[20251230,"太平洋工業",7250,"輸送用機器",1.54E-4,"TOPIX Small 1","7250",{"$f":"IFERROR(_xlfn.IFS(F1100=$K$4,\"T500\",F1100=$K$5,\"T500\",F1100=$K$6,\"T500\"),\"\")","v":""}]
[20251230,"アイシン",7259,"輸送用機器",1.549E-3,"TOPIX Mid400","7259",{"$f":"IFERROR(_xlfn.IFS(F1101=$K$4,\"T500\",F1101=$K$5,\"T500\",F1101=$K$6,\"T500\"),\"\")","v":"T500"}]
[20251230,"マツダ",7261,"輸送用機器",8.3600000000000005E-4,"TOPIX Mid400","7261",{"$f":"IFERROR(_xlfn.IFS(F1102=$K$4,\"T500\",F1102=$K$5,\"T500\",F1102=$K$6,\"T500\"),\"\")","v":"T500"}]
[20251230,"本田技研工業",7267,"輸送用機器",6.914E-3,"TOPIX Core30","7267",{"$f":"IFERROR(_xlfn.IFS(F1103=$K$4,\"T500\",F1103=$K$5,\"T500\",F1103=$K$6,\"T500\"),\"\")","v":"T500"}]
[20251230,"スズキ",7269,"輸送用機器",3.555E-3,"TOPIX Large70","7269",{"$f":"IFERROR(_xlfn.IFS(F1104=$K$4,\"T500\",F1104=$K$5,\"T500\",F1104=$K$6,\"T500\"),\"\")","v":"T500"}]
[20251230,"ＳＵＢＡＲＵ",7270,"輸送用機器",2.1220000000000002E-3,"TOPIX Large70","7270",{"$f":"IFERROR(_xlfn.IFS(F1105=$K$4,\"T500\",F1105=$K$5,\"T500\",F1105=$K$6,\"T500\"),\"\")","v":"T500"}]
[20251230,"ヤマハ発動機",7272,"輸送用機器",1.189E-3,"TOPIX Mid400","7272",{"$f":"IFERROR(_xlfn.IFS(F1106=$K$4,\"T500\",F1106=$K$5,\"T500\",F1106=$K$6,\"T500\"),\"\")","v":"T500"}]
[20251230,"小糸製作所",7276,"電気機器",4.9600000000000002E-4,"TOPIX Mid400","7276",{"$f":"IFERROR(_xlfn.IFS(F1107=$K$4,\"T500\",F1107=$K$5,\"T500\",F1107=$K$6,\"T500\"),\"\")","v":"T500"}]
[20251230,"エクセディ",7278,"輸送用機器",1.9000000000000001E-4,"TOPIX Small 1","7278",{"$f":"IFERROR(_xlfn.IFS(F1108=$K$4,\"T500\",F1108=$K$5,\"T500\",F1108=$K$6,\"T500\"),\"\")","v":""}]
[20251230,"ミツバ",7280,"電気機器",4.1E-5,"TOPIX Small 1","7280",{"$f":"IFERROR(_xlfn.IFS(F1109=$K$4,\"T500\",F1109=$K$5,\"T500\",F1109=$K$6,\"T500\"),\"\")","v":""}]
[20251230,"豊田合成",7282,"輸送用機器",2.7300000000000002E-4,"TOPIX Mid400","7282",{"$f":"IFERROR(_xlfn.IFS(F1110=$K$4,\"T500\",F1110=$K$5,\"T500\",F1110=$K$6,\"T500\"),\"\")","v":"T500"}]
[20251230,"愛三工業",7283,"輸送用機器",7.7000000000000001E-5,"TOPIX Small 1","7283",{"$f":"IFERROR(_xlfn.IFS(F1111=$K$4,\"T500\",F1111=$K$5,\"T500\",F1111=$K$6,\"T500\"),\"\")","v":""}]
[20251230,"ヨロズ",7294,"輸送用機器",2.0000000000000002E-5,"TOPIX Small 2","7294",{"$f":"IFERROR(_xlfn.IFS(F1112=$K$4,\"T500\",F1112=$K$5,\"T500\",F1112=$K$6,\"T500\"),\"\")","v":""}]
[20251230,"エフ・シー・シー",7296,"輸送用機器",1.4999999999999999E-4,"TOPIX Small 1","7296",{"$f":"IFERROR(_xlfn.IFS(F1113=$K$4,\"T500\",F1113=$K$5,\"T500\",F1113=$K$6,\"T500\"),\"\")","v":""}]
[20251230,"シマノ",7309,"輸送用機器",1.4419999999999999E-3,"TOPIX Large70","7309",{"$f":"IFERROR(_xlfn.IFS(F1114=$K$4,\"T500\",F1114=$K$5,\"T500\",F1114=$K$6,\"T500\"),\"\")","v":"T500"}]
[20251230,"テイ・エス　テック",7313,"輸送用機器",1.4200000000000001E-4,"TOPIX Mid400","7313",{"$f":"IFERROR(_xlfn.IFS(F1115=$K$4,\"T500\",F1115=$K$5,\"T500\",F1115=$K$6,\"T500\"),\"\")","v":"T500"}]
[20251230,"三十三フィナンシャルグループ",7322,"銀行業",8.7000000000000001E-5,"TOPIX Small 2","7322",{"$f":"IFERROR(_xlfn.IFS(F1116=$K$4,\"T500\",F1116=$K$5,\"T500\",F1116=$K$6,\"T500\"),\"\")","v":""}]
[20251230,"第四北越フィナンシャルグループ",7327,"銀行業",3.1300000000000002E-4,"TOPIX Small 1","7327",{"$f":"IFERROR(_xlfn.IFS(F1117=$K$4,\"T500\",F1117=$K$5,\"T500\",F1117=$K$6,\"T500\"),\"\")","v":""}]
[20251230,"ひろぎんホールディングス",7337,"銀行業",4.4900000000000002E-4,"TOPIX Mid400","7337",{"$f":"IFERROR(_xlfn.IFS(F1118=$K$4,\"T500\",F1118=$K$5,\"T500\",F1118=$K$6,\"T500\"),\"\")","v":"T500"}]
[20251230,"おきなわフィナンシャルグループ",7350,"銀行業",8.2999999999999998E-5,"TOPIX Small 1","7350",{"$f":"IFERROR(_xlfn.IFS(F1119=$K$4,\"T500\",F1119=$K$5,\"T500\",F1119=$K$6,\"T500\"),\"\")","v":""}]
[20251230,"ダイレクトマーケティングミックス",7354,"サービス業",6.0000000000000002E-6,"TOPIX Small 2","7354",{"$f":"IFERROR(_xlfn.IFS(F1120=$K$4,\"T500\",F1120=$K$5,\"T500\",F1120=$K$6,\"T500\"),\"\")","v":""}]
[20251230,"ポピンズ",7358,"サービス業",3.9999999999999998E-6,"TOPIX Small 2","7358",{"$f":"IFERROR(_xlfn.IFS(F1121=$K$4,\"T500\",F1121=$K$5,\"T500\",F1121=$K$6,\"T500\"),\"\")","v":""}]
[20251230,"ＬＩＴＡＬＩＣＯ",7366,"サービス業",2.5000000000000001E-5,"TOPIX Small 2","7366",{"$f":"IFERROR(_xlfn.IFS(F1122=$K$4,\"T500\",F1122=$K$5,\"T500\",F1122=$K$6,\"T500\"),\"\")","v":""}]
[20251230,"十六フィナンシャルグループ",7380,"銀行業",2.0599999999999999E-4,"TOPIX Small 1","7380",{"$f":"IFERROR(_xlfn.IFS(F1123=$K$4,\"T500\",F1123=$K$5,\"T500\",F1123=$K$6,\"T500\"),\"\")","v":""}]
[20251230,"ＣＣＩグループ",7381,"銀行業",1.7200000000000001E-4,"TOPIX Small 1","7381",{"$f":"IFERROR(_xlfn.IFS(F1124=$K$4,\"T500\",F1124=$K$5,\"T500\",F1124=$K$6,\"T500\"),\"\")","v":""}]
[20251230,"ネットプロテクションズホールディングス",7383,"その他金融業",3.1999999999999999E-5,"TOPIX Small 1","7383",{"$f":"IFERROR(_xlfn.IFS(F1125=$K$4,\"T500\",F1125=$K$5,\"T500\",F1125=$K$6,\"T500\"),\"\")","v":""}]
[20251230,"プロクレアホールディングス",7384,"銀行業",5.3999999999999998E-5,"TOPIX Small 2","7384",{"$f":"IFERROR(_xlfn.IFS(F1126=$K$4,\"T500\",F1126=$K$5,\"T500\",F1126=$K$6,\"T500\"),\"\")","v":""}]
[20251230,"ＦＰパートナー",7388,"保険業",1.9000000000000001E-5,"TOPIX Small 2","7388",{"$f":"IFERROR(_xlfn.IFS(F1127=$K$4,\"T500\",F1127=$K$5,\"T500\",F1127=$K$6,\"T500\"),\"\")","v":""}]
[20251230,"あいちフィナンシャルグループ",7389,"銀行業",1.93E-4,"TOPIX Small 1","7389",{"$f":"IFERROR(_xlfn.IFS(F1128=$K$4,\"T500\",F1128=$K$5,\"T500\",F1128=$K$6,\"T500\"),\"\")","v":""}]
[20251230,"小野建",7414,"卸売業",3.3000000000000003E-5,"TOPIX Small 2","7414",{"$f":"IFERROR(_xlfn.IFS(F1129=$K$4,\"T500\",F1129=$K$5,\"T500\",F1129=$K$6,\"T500\"),\"\")","v":""}]
[20251230,"ノジマ",7419,"小売業",2.5500000000000002E-4,"TOPIX Small 1","7419",{"$f":"IFERROR(_xlfn.IFS(F1130=$K$4,\"T500\",F1130=$K$5,\"T500\",F1130=$K$6,\"T500\"),\"\")","v":""}]
[20251230,"佐鳥電機",7420,"卸売業",2.5999999999999998E-5,"TOPIX Small 2","7420",{"$f":"IFERROR(_xlfn.IFS(F1131=$K$4,\"T500\",F1131=$K$5,\"T500\",F1131=$K$6,\"T500\"),\"\")","v":""}]
[20251230,"カッパ・クリエイト",7421,"小売業",5.3000000000000001E-5,"TOPIX Small 1","7421",{"$f":"IFERROR(_xlfn.IFS(F1132=$K$4,\"T500\",F1132=$K$5,\"T500\",F1132=$K$6,\"T500\"),\"\")","v":""}]
[20251230,"伯東",7433,"卸売業",5.1E-5,"TOPIX Small 1","7433",{"$f":"IFERROR(_xlfn.IFS(F1133=$K$4,\"T500\",F1133=$K$5,\"T500\",F1133=$K$6,\"T500\"),\"\")","v":""}]
[20251230,"コンドーテック",7438,"卸売業",2.9E-5,"TOPIX Small 2","7438",{"$f":"IFERROR(_xlfn.IFS(F1134=$K$4,\"T500\",F1134=$K$5,\"T500\",F1134=$K$6,\"T500\"),\"\")","v":""}]
[20251230,"ナガイレーベン",7447,"卸売業",4.3000000000000002E-5,"TOPIX Small 2","7447",{"$f":"IFERROR(_xlfn.IFS(F1135=$K$4,\"T500\",F1135=$K$5,\"T500\",F1135=$K$6,\"T500\"),\"\")","v":""}]
[20251230,"良品計画",7453,"小売業",1.3320000000000001E-3,"TOPIX Mid400","7453",{"$f":"IFERROR(_xlfn.IFS(F1136=$K$4,\"T500\",F1136=$K$5,\"T500\",F1136=$K$6,\"T500\"),\"\")","v":"T500"}]
[20251230,"松田産業",7456,"卸売業",8.7999999999999998E-5,"TOPIX Small 1","7456",{"$f":"IFERROR(_xlfn.IFS(F1137=$K$4,\"T500\",F1137=$K$5,\"T500\",F1137=$K$6,\"T500\"),\"\")","v":""}]
[20251230,"第一興商",7458,"卸売業",1.22E-4,"TOPIX Mid400","7458",{"$f":"IFERROR(_xlfn.IFS(F1138=$K$4,\"T500\",F1138=$K$5,\"T500\",F1138=$K$6,\"T500\"),\"\")","v":"T500"}]
[20251230,"メディパルホールディングス",7459,"卸売業",6.4899999999999995E-4,"TOPIX Mid400","7459",{"$f":"IFERROR(_xlfn.IFS(F1139=$K$4,\"T500\",F1139=$K$5,\"T500\",F1139=$K$6,\"T500\"),\"\")","v":"T500"}]
[20251230,"アドヴァングループ",7463,"小売業",1.2999999999999999E-5,"TOPIX Small 2","7463",{"$f":"IFERROR(_xlfn.IFS(F1140=$K$4,\"T500\",F1140=$K$5,\"T500\",F1140=$K$6,\"T500\"),\"\")","v":""}]
[20251230,"ＳＰＫ",7466,"卸売業",2.0999999999999999E-5,"TOPIX Small 2","7466",{"$f":"IFERROR(_xlfn.IFS(F1141=$K$4,\"T500\",F1141=$K$5,\"T500\",F1141=$K$6,\"T500\"),\"\")","v":""}]
[20251230,"萩原電気ホールディングス",7467,"卸売業",3.4999999999999997E-5,"TOPIX Small 2","7467",{"$f":"IFERROR(_xlfn.IFS(F1142=$K$4,\"T500\",F1142=$K$5,\"T500\",F1142=$K$6,\"T500\"),\"\")","v":""}]
[20251230,"アルビス",7475,"小売業",1.9000000000000001E-5,"TOPIX Small 2","7475",{"$f":"IFERROR(_xlfn.IFS(F1143=$K$4,\"T500\",F1143=$K$5,\"T500\",F1143=$K$6,\"T500\"),\"\")","v":""}]
[20251230,"アズワン",7476,"卸売業",1.6799999999999999E-4,"TOPIX Mid400","7476",{"$f":"IFERROR(_xlfn.IFS(F1144=$K$4,\"T500\",F1144=$K$5,\"T500\",F1144=$K$6,\"T500\"),\"\")","v":"T500"}]
[20251230,"スズデン",7480,"卸売業",2.0999999999999999E-5,"TOPIX Small 2","7480",{"$f":"IFERROR(_xlfn.IFS(F1145=$K$4,\"T500\",F1145=$K$5,\"T500\",F1145=$K$6,\"T500\"),\"\")","v":""}]
[20251230,"シモジマ",7482,"卸売業",2.1999999999999999E-5,"TOPIX Small 2","7482",{"$f":"IFERROR(_xlfn.IFS(F1146=$K$4,\"T500\",F1146=$K$5,\"T500\",F1146=$K$6,\"T500\"),\"\")","v":""}]
[20251230,"ドウシシャ",7483,"卸売業",8.6000000000000003E-5,"TOPIX Small 2","7483",{"$f":"IFERROR(_xlfn.IFS(F1147=$K$4,\"T500\",F1147=$K$5,\"T500\",F1147=$K$6,\"T500\"),\"\")","v":""}]
[20251230,"高速",7504,"卸売業",4.3999999999999999E-5,"TOPIX Small 2","7504",{"$f":"IFERROR(_xlfn.IFS(F1148=$K$4,\"T500\",F1148=$K$5,\"T500\",F1148=$K$6,\"T500\"),\"\")","v":""}]
[20251230,"Ｇ‐７ホールディングス",7508,"小売業",3.4E-5,"TOPIX Small 2","7508",{"$f":"IFERROR(_xlfn.IFS(F1149=$K$4,\"T500\",F1149=$K$5,\"T500\",F1149=$K$6,\"T500\"),\"\")","v":""}]
[20251230,"たけびし",7510,"卸売業",1.9000000000000001E-5,"TOPIX Small 2","7510",{"$f":"IFERROR(_xlfn.IFS(F1150=$K$4,\"T500\",F1150=$K$5,\"T500\",F1150=$K$6,\"T500\"),\"\")","v":""}]
[20251230,"イオン北海道",7512,"小売業",5.8999999999999998E-5,"TOPIX Small 1","7512",{"$f":"IFERROR(_xlfn.IFS(F1151=$K$4,\"T500\",F1151=$K$5,\"T500\",F1151=$K$6,\"T500\"),\"\")","v":""}]
[20251230,"コジマ",7513,"小売業",4.3000000000000002E-5,"TOPIX Small 1","7513",{"$f":"IFERROR(_xlfn.IFS(F1152=$K$4,\"T500\",F1152=$K$5,\"T500\",F1152=$K$6,\"T500\"),\"\")","v":""}]
[20251230,"コーナン商事",7516,"小売業",9.7E-5,"TOPIX Small 1","7516",{"$f":"IFERROR(_xlfn.IFS(F1153=$K$4,\"T500\",F1153=$K$5,\"T500\",F1153=$K$6,\"T500\"),\"\")","v":""}]
[20251230,"エコス",7520,"小売業",2.5000000000000001E-5,"TOPIX Small 2","7520",{"$f":"IFERROR(_xlfn.IFS(F1154=$K$4,\"T500\",F1154=$K$5,\"T500\",F1154=$K$6,\"T500\"),\"\")","v":""}]
[20251230,"ワタミ",7522,"小売業",2.5999999999999998E-5,"TOPIX Small 2",{"$f":"TEXT(C1155,0)","v":"7522"},{"$f":"IFERROR(_xlfn.IFS(F1155=$K$4,\"T500\",F1155=$K$5,\"T500\",F1155=$K$6,\"T500\"),\"\")","v":""}]
[20251230,"リックス",7525,"卸売業",2.0999999999999999E-5,"TOPIX Small 2","7525",{"$f":"IFERROR(_xlfn.IFS(F1156=$K$4,\"T500\",F1156=$K$5,\"T500\",F1156=$K$6,\"T500\"),\"\")","v":""}]
[20251230,"システムソフト",7527,"情報・通信業",5.0000000000000004E-6,"TOPIX Small 2","7527",{"$f":"IFERROR(_xlfn.IFS(F1157=$K$4,\"T500\",F1157=$K$5,\"T500\",F1157=$K$6,\"T500\"),\"\")","v":""}]
[20251230,"パン・パシフィック・インターナショナルホールディングス",7532,"小売業",2.0660000000000001E-3,"TOPIX Mid400","7532",{"$f":"IFERROR(_xlfn.IFS(F1158=$K$4,\"T500\",F1158=$K$5,\"T500\",F1158=$K$6,\"T500\"),\"\")","v":"T500"}]
[20251230,"丸文",7537,"卸売業",2.5000000000000001E-5,"TOPIX Small 2","7537",{"$f":"IFERROR(_xlfn.IFS(F1159=$K$4,\"T500\",F1159=$K$5,\"T500\",F1159=$K$6,\"T500\"),\"\")","v":""}]
[20251230,"西松屋チェーン",7545,"小売業",9.8999999999999994E-5,"TOPIX Small 1","7545",{"$f":"IFERROR(_xlfn.IFS(F1160=$K$4,\"T500\",F1160=$K$5,\"T500\",F1160=$K$6,\"T500\"),\"\")","v":""}]
[20251230,"ゼンショーホールディングス",7550,"小売業",1.0059999999999999E-3,"TOPIX Mid400","7550",{"$f":"IFERROR(_xlfn.IFS(F1161=$K$4,\"T500\",F1161=$K$5,\"T500\",F1161=$K$6,\"T500\"),\"\")","v":"T500"}]
[20251230,"ハピネット",7552,"卸売業",8.7999999999999998E-5,"TOPIX Small 1","7552",{"$f":"IFERROR(_xlfn.IFS(F1162=$K$4,\"T500\",F1162=$K$5,\"T500\",F1162=$K$6,\"T500\"),\"\")","v":""}]
[20251230,"幸楽苑",7554,"小売業",2.4000000000000001E-5,"TOPIX Small 2","7554",{"$f":"IFERROR(_xlfn.IFS(F1163=$K$4,\"T500\",F1163=$K$5,\"T500\",F1163=$K$6,\"T500\"),\"\")","v":""}]
[20251230,"橋本総業ホールディングス",7570,"卸売業",1.0000000000000001E-5,"TOPIX Small 2","7570",{"$f":"IFERROR(_xlfn.IFS(F1164=$K$4,\"T500\",F1164=$K$5,\"T500\",F1164=$K$6,\"T500\"),\"\")","v":""}]
[20251230,"日本ライフライン",7575,"卸売業",8.7000000000000001E-5,"TOPIX Small 1","7575",{"$f":"IFERROR(_xlfn.IFS(F1165=$K$4,\"T500\",F1165=$K$5,\"T500\",F1165=$K$6,\"T500\"),\"\")","v":""}]
[20251230,"サイゼリヤ",7581,"小売業",1.55E-4,"TOPIX Small 1","7581",{"$f":"IFERROR(_xlfn.IFS(F1166=$K$4,\"T500\",F1166=$K$5,\"T500\",F1166=$K$6,\"T500\"),\"\")","v":""}]
[20251230,"タカショー",7590,"卸売業",6.9999999999999999E-6,"TOPIX Small 2","7590",{"$f":"IFERROR(_xlfn.IFS(F1167=$K$4,\"T500\",F1167=$K$5,\"T500\",F1167=$K$6,\"T500\"),\"\")","v":""}]
[20251230,"ＶＴホールディングス",7593,"小売業",4.6E-5,"TOPIX Small 1","7593",{"$f":"IFERROR(_xlfn.IFS(F1168=$K$4,\"T500\",F1168=$K$5,\"T500\",F1168=$K$6,\"T500\"),\"\")","v":""}]
[20251230,"アルゴグラフィックス",7595,"情報・通信業",1.21E-4,"TOPIX Small 1","7595",{"$f":"IFERROR(_xlfn.IFS(F1169=$K$4,\"T500\",F1169=$K$5,\"T500\",F1169=$K$6,\"T500\"),\"\")","v":""}]
[20251230,"魚力",7596,"小売業",1.8E-5,"TOPIX Small 2","7596",{"$f":"IFERROR(_xlfn.IFS(F1170=$K$4,\"T500\",F1170=$K$5,\"T500\",F1170=$K$6,\"T500\"),\"\")","v":""}]
[20251230,"ＩＤＯＭ",7599,"卸売業",8.5000000000000006E-5,"TOPIX Small 1","7599",{"$f":"IFERROR(_xlfn.IFS(F1171=$K$4,\"T500\",F1171=$K$5,\"T500\",F1171=$K$6,\"T500\"),\"\")","v":""}]
[20251230,"日本エム・ディ・エム",7600,"精密機器",7.9999999999999996E-6,"TOPIX Small 2","7600",{"$f":"IFERROR(_xlfn.IFS(F1172=$K$4,\"T500\",F1172=$K$5,\"T500\",F1172=$K$6,\"T500\"),\"\")","v":""}]
[20251230,"ユナイテッドアローズ",7606,"小売業",5.8E-5,"TOPIX Small 1","7606",{"$f":"IFERROR(_xlfn.IFS(F1173=$K$4,\"T500\",F1173=$K$5,\"T500\",F1173=$K$6,\"T500\"),\"\")","v":""}]
[20251230,"進和",7607,"卸売業",4.0000000000000003E-5,"TOPIX Small 2","7607",{"$f":"IFERROR(_xlfn.IFS(F1174=$K$4,\"T500\",F1174=$K$5,\"T500\",F1174=$K$6,\"T500\"),\"\")","v":""}]
[20251230,"ダイトロン",7609,"卸売業",4.3999999999999999E-5,"TOPIX Small 2","7609",{"$f":"IFERROR(_xlfn.IFS(F1175=$K$4,\"T500\",F1175=$K$5,\"T500\",F1175=$K$6,\"T500\"),\"\")","v":""}]
[20251230,"ハイデイ日高",7611,"小売業",1.2300000000000001E-4,"TOPIX Small 1","7611",{"$f":"IFERROR(_xlfn.IFS(F1176=$K$4,\"T500\",F1176=$K$5,\"T500\",F1176=$K$6,\"T500\"),\"\")","v":""}]
[20251230,"シークス",7613,"卸売業",4.6E-5,"TOPIX Small 1","7613",{"$f":"IFERROR(_xlfn.IFS(F1177=$K$4,\"T500\",F1177=$K$5,\"T500\",F1177=$K$6,\"T500\"),\"\")","v":""}]
[20251230,"コロワイド",7616,"小売業",2.1800000000000001E-4,"TOPIX Mid400","7616",{"$f":"IFERROR(_xlfn.IFS(F1178=$K$4,\"T500\",F1178=$K$5,\"T500\",F1178=$K$6,\"T500\"),\"\")","v":"T500"}]
[20251230,"オーハシテクニカ",7628,"卸売業",2.4000000000000001E-5,"TOPIX Small 2","7628",{"$f":"IFERROR(_xlfn.IFS(F1179=$K$4,\"T500\",F1179=$K$5,\"T500\",F1179=$K$6,\"T500\"),\"\")","v":""}]
[20251230,"壱番屋",7630,"小売業",7.8999999999999996E-5,"TOPIX Small 1","7630",{"$f":"IFERROR(_xlfn.IFS(F1180=$K$4,\"T500\",F1180=$K$5,\"T500\",F1180=$K$6,\"T500\"),\"\")","v":""}]
[20251230,"白銅",7637,"卸売業",1.4E-5,"TOPIX Small 2","7637",{"$f":"IFERROR(_xlfn.IFS(F1181=$K$4,\"T500\",F1181=$K$5,\"T500\",F1181=$K$6,\"T500\"),\"\")","v":""}]
[20251230,"スギホールディングス",7649,"小売業",4.3399999999999998E-4,"TOPIX Mid400","7649",{"$f":"IFERROR(_xlfn.IFS(F1182=$K$4,\"T500\",F1182=$K$5,\"T500\",F1182=$K$6,\"T500\"),\"\")","v":"T500"}]
[20251230,"薬王堂ホールディングス",7679,"小売業",2.6999999999999999E-5,"TOPIX Small 2","7679",{"$f":"IFERROR(_xlfn.IFS(F1183=$K$4,\"T500\",F1183=$K$5,\"T500\",F1183=$K$6,\"T500\"),\"\")","v":""}]
[20251230,"ダブルエー",7683,"小売業",1.2E-5,"TOPIX Small 2","7683",{"$f":"IFERROR(_xlfn.IFS(F1184=$K$4,\"T500\",F1184=$K$5,\"T500\",F1184=$K$6,\"T500\"),\"\")","v":""}]
[20251230,"島津製作所",7701,"精密機器",1.1479999999999999E-3,"TOPIX Mid400","7701",{"$f":"IFERROR(_xlfn.IFS(F1185=$K$4,\"T500\",F1185=$K$5,\"T500\",F1185=$K$6,\"T500\"),\"\")","v":"T500"}]
[20251230,"ＪＭＳ",7702,"精密機器",7.9999999999999996E-6,"TOPIX Small 2","7702",{"$f":"IFERROR(_xlfn.IFS(F1186=$K$4,\"T500\",F1186=$K$5,\"T500\",F1186=$K$6,\"T500\"),\"\")","v":""}]
[20251230,"長野計器",7715,"精密機器",3.3000000000000003E-5,"TOPIX Small 2","7715",{"$f":"IFERROR(_xlfn.IFS(F1187=$K$4,\"T500\",F1187=$K$5,\"T500\",F1187=$K$6,\"T500\"),\"\")","v":""}]
[20251230,"ブイ・テクノロジー",7717,"精密機器",3.0000000000000001E-5,"TOPIX Small 2","7717",{"$f":"IFERROR(_xlfn.IFS(F1188=$K$4,\"T500\",F1188=$K$5,\"T500\",F1188=$K$6,\"T500\"),\"\")","v":""}]
[20251230,"スター精密",7718,"機械",7.3999999999999996E-5,"TOPIX Small 1","7718",{"$f":"IFERROR(_xlfn.IFS(F1189=$K$4,\"T500\",F1189=$K$5,\"T500\",F1189=$K$6,\"T500\"),\"\")","v":""}]
[20251230,"東京計器",7721,"精密機器",9.2E-5,"TOPIX Small 1","7721",{"$f":"IFERROR(_xlfn.IFS(F1190=$K$4,\"T500\",F1190=$K$5,\"T500\",F1190=$K$6,\"T500\"),\"\")","v":""}]
[20251230,"愛知時計電機",7723,"精密機器",2.6999999999999999E-5,"TOPIX Small 2","7723",{"$f":"IFERROR(_xlfn.IFS(F1191=$K$4,\"T500\",F1191=$K$5,\"T500\",F1191=$K$6,\"T500\"),\"\")","v":""}]
[20251230,"インターアクション",7725,"精密機器",1.8E-5,"TOPIX Small 2","7725",{"$f":"IFERROR(_xlfn.IFS(F1192=$K$4,\"T500\",F1192=$K$5,\"T500\",F1192=$K$6,\"T500\"),\"\")","v":""}]
[20251230,"東京精密",7729,"精密機器",4.37E-4,"TOPIX Mid400","7729",{"$f":"IFERROR(_xlfn.IFS(F1193=$K$4,\"T500\",F1193=$K$5,\"T500\",F1193=$K$6,\"T500\"),\"\")","v":"T500"}]
[20251230,"マニー",7730,"精密機器",1.2E-4,"TOPIX Small 1","7730",{"$f":"IFERROR(_xlfn.IFS(F1194=$K$4,\"T500\",F1194=$K$5,\"T500\",F1194=$K$6,\"T500\"),\"\")","v":""}]
[20251230,"ニコン",7731,"精密機器",4.5100000000000001E-4,"TOPIX Mid400","7731",{"$f":"IFERROR(_xlfn.IFS(F1195=$K$4,\"T500\",F1195=$K$5,\"T500\",F1195=$K$6,\"T500\"),\"\")","v":"T500"}]
[20251230,"オリンパス",7733,"精密機器",2.2279999999999999E-3,"TOPIX Large70","7733",{"$f":"IFERROR(_xlfn.IFS(F1196=$K$4,\"T500\",F1196=$K$5,\"T500\",F1196=$K$6,\"T500\"),\"\")","v":"T500"}]
[20251230,"理研計器",7734,"精密機器",9.3999999999999994E-5,"TOPIX Small 1","7734",{"$f":"IFERROR(_xlfn.IFS(F1197=$K$4,\"T500\",F1197=$K$5,\"T500\",F1197=$K$6,\"T500\"),\"\")","v":""}]
[20251230,"ＳＣＲＥＥＮホールディングス",7735,"電気機器",1.127E-3,"TOPIX Mid400","7735",{"$f":"IFERROR(_xlfn.IFS(F1198=$K$4,\"T500\",F1198=$K$5,\"T500\",F1198=$K$6,\"T500\"),\"\")","v":"T500"}]
[20251230,"キヤノン電子",7739,"電気機器",8.2999999999999998E-5,"TOPIX Small 1","7739",{"$f":"IFERROR(_xlfn.IFS(F1199=$K$4,\"T500\",F1199=$K$5,\"T500\",F1199=$K$6,\"T500\"),\"\")","v":""}]
[20251230,"タムロン",7740,"精密機器",1.0900000000000001E-4,"TOPIX Small 1","7740",{"$f":"IFERROR(_xlfn.IFS(F1200=$K$4,\"T500\",F1200=$K$5,\"T500\",F1200=$K$6,\"T500\"),\"\")","v":""}]
[20251230,"ＨＯＹＡ",7741,"精密機器",9.4479999999999998E-3,"TOPIX Core30","7741",{"$f":"IFERROR(_xlfn.IFS(F1201=$K$4,\"T500\",F1201=$K$5,\"T500\",F1201=$K$6,\"T500\"),\"\")","v":"T500"}]
[20251230,"ノーリツ鋼機",7744,"精密機器",1.0900000000000001E-4,"TOPIX Small 1","7744",{"$f":"IFERROR(_xlfn.IFS(F1202=$K$4,\"T500\",F1202=$K$5,\"T500\",F1202=$K$6,\"T500\"),\"\")","v":""}]
[20251230,"Ａ＆Ｄホロンホールディングス",7745,"精密機器",5.7000000000000003E-5,"TOPIX Small 1","7745",{"$f":"IFERROR(_xlfn.IFS(F1203=$K$4,\"T500\",F1203=$K$5,\"T500\",F1203=$K$6,\"T500\"),\"\")","v":""}]
[20251230,"朝日インテック",7747,"精密機器",7.2499999999999995E-4,"TOPIX Mid400","7747",{"$f":"IFERROR(_xlfn.IFS(F1204=$K$4,\"T500\",F1204=$K$5,\"T500\",F1204=$K$6,\"T500\"),\"\")","v":"T500"}]
[20251230,"キヤノン",7751,"電気機器",4.3099999999999996E-3,"TOPIX Large70","7751",{"$f":"IFERROR(_xlfn.IFS(F1205=$K$4,\"T500\",F1205=$K$5,\"T500\",F1205=$K$6,\"T500\"),\"\")","v":"T500"}]
[20251230,"リコー",7752,"電気機器",6.6699999999999995E-4,"TOPIX Mid400","7752",{"$f":"IFERROR(_xlfn.IFS(F1206=$K$4,\"T500\",F1206=$K$5,\"T500\",F1206=$K$6,\"T500\"),\"\")","v":"T500"}]
[20251230,"シチズン時計",7762,"精密機器",2.1900000000000001E-4,"TOPIX Small 1","7762",{"$f":"IFERROR(_xlfn.IFS(F1207=$K$4,\"T500\",F1207=$K$5,\"T500\",F1207=$K$6,\"T500\"),\"\")","v":""}]
[20251230,"メニコン",7780,"精密機器",1.2400000000000001E-4,"TOPIX Small 1","7780",{"$f":"IFERROR(_xlfn.IFS(F1208=$K$4,\"T500\",F1208=$K$5,\"T500\",F1208=$K$6,\"T500\"),\"\")","v":""}]
[20251230,"パラマウントベッドホールディングス",7817,"その他製品",6.3E-5,"TOPIX Small 1","7817",{"$f":"IFERROR(_xlfn.IFS(F1209=$K$4,\"T500\",F1209=$K$5,\"T500\",F1209=$K$6,\"T500\"),\"\")","v":""}]
[20251230,"トランザクション",7818,"その他製品",2.4000000000000001E-5,"TOPIX Small 2","7818",{"$f":"IFERROR(_xlfn.IFS(F1210=$K$4,\"T500\",F1210=$K$5,\"T500\",F1210=$K$6,\"T500\"),\"\")","v":""}]
[20251230,"ニホンフラッシュ",7820,"その他製品",1.5999999999999999E-5,"TOPIX Small 2","7820",{"$f":"IFERROR(_xlfn.IFS(F1211=$K$4,\"T500\",F1211=$K$5,\"T500\",F1211=$K$6,\"T500\"),\"\")","v":""}]
[20251230,"前田工繊",7821,"その他製品",8.2999999999999998E-5,"TOPIX Small 1","7821",{"$f":"IFERROR(_xlfn.IFS(F1212=$K$4,\"T500\",F1212=$K$5,\"T500\",F1212=$K$6,\"T500\"),\"\")","v":""}]
[20251230,"アートネイチャー",7823,"その他製品",1.5E-5,"TOPIX Small 2","7823",{"$f":"IFERROR(_xlfn.IFS(F1213=$K$4,\"T500\",F1213=$K$5,\"T500\",F1213=$K$6,\"T500\"),\"\")","v":""}]
[20251230,"フルヤ金属",7826,"その他製品",6.2000000000000003E-5,"TOPIX Small 1","7826",{"$f":"IFERROR(_xlfn.IFS(F1214=$K$4,\"T500\",F1214=$K$5,\"T500\",F1214=$K$6,\"T500\"),\"\")","v":""}]
[20251230,"バンダイナムコホールディングス",7832,"その他製品",2.3119999999999998E-3,"TOPIX Large70","7832",{"$f":"IFERROR(_xlfn.IFS(F1215=$K$4,\"T500\",F1215=$K$5,\"T500\",F1215=$K$6,\"T500\"),\"\")","v":"T500"}]
[20251230,"ＳＨＯＥＩ",7839,"その他製品",9.6000000000000002E-5,"TOPIX Small 1","7839",{"$f":"IFERROR(_xlfn.IFS(F1216=$K$4,\"T500\",F1216=$K$5,\"T500\",F1216=$K$6,\"T500\"),\"\")","v":""}]
[20251230,"フランスベッドホールディングス",7840,"その他製品",3.8999999999999999E-5,"TOPIX Small 2","7840",{"$f":"IFERROR(_xlfn.IFS(F1217=$K$4,\"T500\",F1217=$K$5,\"T500\",F1217=$K$6,\"T500\"),\"\")","v":""}]
[20251230,"マーベラス",7844,"情報・通信業",2.0000000000000002E-5,"TOPIX Small 2","7844",{"$f":"IFERROR(_xlfn.IFS(F1218=$K$4,\"T500\",F1218=$K$5,\"T500\",F1218=$K$6,\"T500\"),\"\")","v":""}]
[20251230,"パイロットコーポレーション",7846,"その他製品",1.54E-4,"TOPIX Mid400",{"$f":"TEXT(C1219,0)","v":"7846"},{"$f":"IFERROR(_xlfn.IFS(F1219=$K$4,\"T500\",F1219=$K$5,\"T500\",F1219=$K$6,\"T500\"),\"\")","v":"T500"}]
[20251230,"萩原工業",7856,"その他製品",2.3E-5,"TOPIX Small 2","7856",{"$f":"IFERROR(_xlfn.IFS(F1220=$K$4,\"T500\",F1220=$K$5,\"T500\",F1220=$K$6,\"T500\"),\"\")","v":""}]
[20251230,"エイベックス",7860,"情報・通信業",4.5000000000000003E-5,"TOPIX Small 1","7860",{"$f":"IFERROR(_xlfn.IFS(F1221=$K$4,\"T500\",F1221=$K$5,\"T500\",F1221=$K$6,\"T500\"),\"\")","v":""}]
[20251230,"フジシールインターナショナル",7864,"その他製品",1.3200000000000001E-4,"TOPIX Small 1","7864",{"$f":"IFERROR(_xlfn.IFS(F1222=$K$4,\"T500\",F1222=$K$5,\"T500\",F1222=$K$6,\"T500\"),\"\")","v":""}]
[20251230,"タカラトミー",7867,"その他製品",2.7999999999999998E-4,"TOPIX Mid400","7867",{"$f":"IFERROR(_xlfn.IFS(F1223=$K$4,\"T500\",F1223=$K$5,\"T500\",F1223=$K$6,\"T500\"),\"\")","v":"T500"}]
[20251230,"広済堂ホールディングス",7868,"その他製品",3.0000000000000001E-5,"TOPIX Small 2","7868",{"$f":"IFERROR(_xlfn.IFS(F1224=$K$4,\"T500\",F1224=$K$5,\"T500\",F1224=$K$6,\"T500\"),\"\")","v":""}]
[20251230,"レック",7874,"化学",2.1999999999999999E-5,"TOPIX Small 2","7874",{"$f":"IFERROR(_xlfn.IFS(F1225=$K$4,\"T500\",F1225=$K$5,\"T500\",F1225=$K$6,\"T500\"),\"\")","v":""}]
[20251230,"三光合成",7888,"化学",2.3E-5,"TOPIX Small 2","7888",{"$f":"IFERROR(_xlfn.IFS(F1226=$K$4,\"T500\",F1226=$K$5,\"T500\",F1226=$K$6,\"T500\"),\"\")","v":""}]
[20251230,"プロネクサス",7893,"その他製品",2.5000000000000001E-5,"TOPIX Small 2","7893",{"$f":"IFERROR(_xlfn.IFS(F1227=$K$4,\"T500\",F1227=$K$5,\"T500\",F1227=$K$6,\"T500\"),\"\")","v":""}]
[20251230,"ＴＯＰＰＡＮホールディングス",7911,"その他製品",1.1709999999999999E-3,"TOPIX Mid400","7911",{"$f":"IFERROR(_xlfn.IFS(F1228=$K$4,\"T500\",F1228=$K$5,\"T500\",F1228=$K$6,\"T500\"),\"\")","v":"T500"}]
[20251230,"大日本印刷",7912,"その他製品",1.2049999999999999E-3,"TOPIX Mid400","7912",{"$f":"IFERROR(_xlfn.IFS(F1229=$K$4,\"T500\",F1229=$K$5,\"T500\",F1229=$K$6,\"T500\"),\"\")","v":"T500"}]
[20251230,"共同印刷",7914,"その他製品",3.6999999999999998E-5,"TOPIX Small 2","7914",{"$f":"IFERROR(_xlfn.IFS(F1230=$K$4,\"T500\",F1230=$K$5,\"T500\",F1230=$K$6,\"T500\"),\"\")","v":""}]
[20251230,"ＮＩＳＳＨＡ",7915,"その他製品",4.8999999999999998E-5,"TOPIX Small 1","7915",{"$f":"IFERROR(_xlfn.IFS(F1231=$K$4,\"T500\",F1231=$K$5,\"T500\",F1231=$K$6,\"T500\"),\"\")","v":""}]
[20251230,"ＺＡＣＲＯＳ",7917,"化学",7.6000000000000004E-5,"TOPIX Small 2","7917",{"$f":"IFERROR(_xlfn.IFS(F1232=$K$4,\"T500\",F1232=$K$5,\"T500\",F1232=$K$6,\"T500\"),\"\")","v":""}]
[20251230,"ＴＡＫＡＲＡ　＆　ＣＯＭＰＡＮＹ",7921,"その他製品",5.3000000000000001E-5,"TOPIX Small 2","7921",{"$f":"IFERROR(_xlfn.IFS(F1233=$K$4,\"T500\",F1233=$K$5,\"T500\",F1233=$K$6,\"T500\"),\"\")","v":""}]
[20251230,"前澤化成工業",7925,"化学",3.0000000000000001E-5,"TOPIX Small 2","7925",{"$f":"IFERROR(_xlfn.IFS(F1234=$K$4,\"T500\",F1234=$K$5,\"T500\",F1234=$K$6,\"T500\"),\"\")","v":""}]
[20251230,"未来工業",7931,"化学",3.4E-5,"TOPIX Small 2","7931",{"$f":"IFERROR(_xlfn.IFS(F1235=$K$4,\"T500\",F1235=$K$5,\"T500\",F1235=$K$6,\"T500\"),\"\")","v":""}]
[20251230,"アシックス",7936,"その他製品",2.9919999999999999E-3,"TOPIX Large70","7936",{"$f":"IFERROR(_xlfn.IFS(F1236=$K$4,\"T500\",F1236=$K$5,\"T500\",F1236=$K$6,\"T500\"),\"\")","v":"T500"}]
[20251230,"ツツミ",7937,"その他製品",1.2E-5,"TOPIX Small 2","7937",{"$f":"IFERROR(_xlfn.IFS(F1237=$K$4,\"T500\",F1237=$K$5,\"T500\",F1237=$K$6,\"T500\"),\"\")","v":""}]
[20251230,"ＪＳＰ",7942,"化学",3.6000000000000001E-5,"TOPIX Small 2","7942",{"$f":"IFERROR(_xlfn.IFS(F1238=$K$4,\"T500\",F1238=$K$5,\"T500\",F1238=$K$6,\"T500\"),\"\")","v":""}]
[20251230,"ニチハ",7943,"ガラス・土石製品",7.8999999999999996E-5,"TOPIX Small 1","7943",{"$f":"IFERROR(_xlfn.IFS(F1239=$K$4,\"T500\",F1239=$K$5,\"T500\",F1239=$K$6,\"T500\"),\"\")","v":""}]
[20251230,"ローランド",7944,"その他製品",5.8999999999999998E-5,"TOPIX Small 1","7944",{"$f":"IFERROR(_xlfn.IFS(F1240=$K$4,\"T500\",F1240=$K$5,\"T500\",F1240=$K$6,\"T500\"),\"\")","v":""}]
[20251230,"エフピコ",7947,"化学",1.03E-4,"TOPIX Small 1","7947",{"$f":"IFERROR(_xlfn.IFS(F1241=$K$4,\"T500\",F1241=$K$5,\"T500\",F1241=$K$6,\"T500\"),\"\")","v":""}]
[20251230,"小松ウオール工業",7949,"その他製品",4.1999999999999998E-5,"TOPIX Small 2","7949",{"$f":"IFERROR(_xlfn.IFS(F1242=$K$4,\"T500\",F1242=$K$5,\"T500\",F1242=$K$6,\"T500\"),\"\")","v":""}]
[20251230,"ヤマハ",7951,"その他製品",3.8299999999999999E-4,"TOPIX Mid400","7951",{"$f":"IFERROR(_xlfn.IFS(F1243=$K$4,\"T500\",F1243=$K$5,\"T500\",F1243=$K$6,\"T500\"),\"\")","v":"T500"}]
[20251230,"河合楽器製作所",7952,"その他製品",1.5E-5,"TOPIX Small 2","7952",{"$f":"IFERROR(_xlfn.IFS(F1244=$K$4,\"T500\",F1244=$K$5,\"T500\",F1244=$K$6,\"T500\"),\"\")","v":""}]
[20251230,"クリナップ",7955,"その他製品",2.0000000000000002E-5,"TOPIX Small 2","7955",{"$f":"IFERROR(_xlfn.IFS(F1245=$K$4,\"T500\",F1245=$K$5,\"T500\",F1245=$K$6,\"T500\"),\"\")","v":""}]
[20251230,"ピジョン",7956,"その他製品",1.9799999999999999E-4,"TOPIX Mid400","7956",{"$f":"IFERROR(_xlfn.IFS(F1246=$K$4,\"T500\",F1246=$K$5,\"T500\",F1246=$K$6,\"T500\"),\"\")","v":"T500"}]
[20251230,"キングジム",7962,"その他製品",1.5E-5,"TOPIX Small 2","7962",{"$f":"IFERROR(_xlfn.IFS(F1247=$K$4,\"T500\",F1247=$K$5,\"T500\",F1247=$K$6,\"T500\"),\"\")","v":""}]
[20251230,"象印マホービン",7965,"電気機器",8.7999999999999998E-5,"TOPIX Small 1","7965",{"$f":"IFERROR(_xlfn.IFS(F1248=$K$4,\"T500\",F1248=$K$5,\"T500\",F1248=$K$6,\"T500\"),\"\")","v":""}]
[20251230,"リンテック",7966,"その他製品",1.9900000000000001E-4,"TOPIX Small 1","7966",{"$f":"IFERROR(_xlfn.IFS(F1249=$K$4,\"T500\",F1249=$K$5,\"T500\",F1249=$K$6,\"T500\"),\"\")","v":""}]
[20251230,"信越ポリマー",7970,"化学",9.0000000000000006E-5,"TOPIX Small 1","7970",{"$f":"IFERROR(_xlfn.IFS(F1250=$K$4,\"T500\",F1250=$K$5,\"T500\",F1250=$K$6,\"T500\"),\"\")","v":""}]
[20251230,"イトーキ",7972,"その他製品",1.11E-4,"TOPIX Small 1","7972",{"$f":"IFERROR(_xlfn.IFS(F1251=$K$4,\"T500\",F1251=$K$5,\"T500\",F1251=$K$6,\"T500\"),\"\")","v":""}]
[20251230,"任天堂",7974,"その他製品",1.3863E-2,"TOPIX Core30","7974",{"$f":"IFERROR(_xlfn.IFS(F1252=$K$4,\"T500\",F1252=$K$5,\"T500\",F1252=$K$6,\"T500\"),\"\")","v":"T500"}]
[20251230,"三菱鉛筆",7976,"その他製品",6.0999999999999999E-5,"TOPIX Small 1","7976",{"$f":"IFERROR(_xlfn.IFS(F1253=$K$4,\"T500\",F1253=$K$5,\"T500\",F1253=$K$6,\"T500\"),\"\")","v":""}]
[20251230,"松風",7979,"精密機器",3.4E-5,"TOPIX Small 2","7979",{"$f":"IFERROR(_xlfn.IFS(F1254=$K$4,\"T500\",F1254=$K$5,\"T500\",F1254=$K$6,\"T500\"),\"\")","v":""}]
[20251230,"タカラスタンダード",7981,"その他製品",1.37E-4,"TOPIX Small 1","7981",{"$f":"IFERROR(_xlfn.IFS(F1255=$K$4,\"T500\",F1255=$K$5,\"T500\",F1255=$K$6,\"T500\"),\"\")","v":""}]
[20251230,"コクヨ",7984,"その他製品",3.77E-4,"TOPIX Mid400","7984",{"$f":"IFERROR(_xlfn.IFS(F1256=$K$4,\"T500\",F1256=$K$5,\"T500\",F1256=$K$6,\"T500\"),\"\")","v":"T500"}]
[20251230,"ナカバヤシ",7987,"その他製品",1.2999999999999999E-5,"TOPIX Small 2","7987",{"$f":"IFERROR(_xlfn.IFS(F1257=$K$4,\"T500\",F1257=$K$5,\"T500\",F1257=$K$6,\"T500\"),\"\")","v":""}]
[20251230,"ニフコ",7988,"化学",3.7599999999999998E-4,"TOPIX Mid400","7988",{"$f":"IFERROR(_xlfn.IFS(F1258=$K$4,\"T500\",F1258=$K$5,\"T500\",F1258=$K$6,\"T500\"),\"\")","v":"T500"}]
[20251230,"立川ブラインド工業",7989,"金属製品",2.0999999999999999E-5,"TOPIX Small 2","7989",{"$f":"IFERROR(_xlfn.IFS(F1259=$K$4,\"T500\",F1259=$K$5,\"T500\",F1259=$K$6,\"T500\"),\"\")","v":""}]
[20251230,"グローブライド",7990,"その他製品",4.1999999999999998E-5,"TOPIX Small 1","7990",{"$f":"IFERROR(_xlfn.IFS(F1260=$K$4,\"T500\",F1260=$K$5,\"T500\",F1260=$K$6,\"T500\"),\"\")","v":""}]
[20251230,"オカムラ",7994,"その他製品",1.4300000000000001E-4,"TOPIX Small 1","7994",{"$f":"IFERROR(_xlfn.IFS(F1261=$K$4,\"T500\",F1261=$K$5,\"T500\",F1261=$K$6,\"T500\"),\"\")","v":""}]
[20251230,"バルカー",7995,"化学",7.1000000000000005E-5,"TOPIX Small 1","7995",{"$f":"IFERROR(_xlfn.IFS(F1262=$K$4,\"T500\",F1262=$K$5,\"T500\",F1262=$K$6,\"T500\"),\"\")","v":""}]
[20251230,"伊藤忠商事",8001,"卸売業",1.4555999999999999E-2,"TOPIX Core30","8001",{"$f":"IFERROR(_xlfn.IFS(F1263=$K$4,\"T500\",F1263=$K$5,\"T500\",F1263=$K$6,\"T500\"),\"\")","v":"T500"}]
[20251230,"丸紅",8002,"卸売業",7.2839999999999997E-3,"TOPIX Large70","8002",{"$f":"IFERROR(_xlfn.IFS(F1264=$K$4,\"T500\",F1264=$K$5,\"T500\",F1264=$K$6,\"T500\"),\"\")","v":"T500"}]
[20251230,"スクロール",8005,"小売業",5.0000000000000002E-5,"TOPIX Small 2","8005",{"$f":"IFERROR(_xlfn.IFS(F1265=$K$4,\"T500\",F1265=$K$5,\"T500\",F1265=$K$6,\"T500\"),\"\")","v":""}]
[20251230,"ヨンドシーホールディングス",8008,"小売業",3.6999999999999998E-5,"TOPIX Small 1","8008",{"$f":"IFERROR(_xlfn.IFS(F1266=$K$4,\"T500\",F1266=$K$5,\"T500\",F1266=$K$6,\"T500\"),\"\")","v":""}]
[20251230,"三陽商会",8011,"繊維製品",3.8000000000000002E-5,"TOPIX Small 2","8011",{"$f":"IFERROR(_xlfn.IFS(F1267=$K$4,\"T500\",F1267=$K$5,\"T500\",F1267=$K$6,\"T500\"),\"\")","v":""}]
[20251230,"長瀬産業",8012,"卸売業",3.5599999999999998E-4,"TOPIX Mid400","8012",{"$f":"IFERROR(_xlfn.IFS(F1268=$K$4,\"T500\",F1268=$K$5,\"T500\",F1268=$K$6,\"T500\"),\"\")","v":"T500"}]
[20251230,"蝶理",8014,"卸売業",4.8000000000000001E-5,"TOPIX Small 2","8014",{"$f":"IFERROR(_xlfn.IFS(F1269=$K$4,\"T500\",F1269=$K$5,\"T500\",F1269=$K$6,\"T500\"),\"\")","v":""}]
[20251230,"豊田通商",8015,"卸売業",3.473E-3,"TOPIX Large70","8015",{"$f":"IFERROR(_xlfn.IFS(F1270=$K$4,\"T500\",F1270=$K$5,\"T500\",F1270=$K$6,\"T500\"),\"\")","v":"T500"}]
[20251230,"オンワードホールディングス",8016,"繊維製品",8.8999999999999995E-5,"TOPIX Small 1","8016",{"$f":"IFERROR(_xlfn.IFS(F1271=$K$4,\"T500\",F1271=$K$5,\"T500\",F1271=$K$6,\"T500\"),\"\")","v":""}]
[20251230,"三共生興",8018,"卸売業",2.0000000000000002E-5,"TOPIX Small 2","8018",{"$f":"IFERROR(_xlfn.IFS(F1272=$K$4,\"T500\",F1272=$K$5,\"T500\",F1272=$K$6,\"T500\"),\"\")","v":""}]
[20251230,"兼松",8020,"卸売業",3.3E-4,"TOPIX Mid400","8020",{"$f":"IFERROR(_xlfn.IFS(F1273=$K$4,\"T500\",F1273=$K$5,\"T500\",F1273=$K$6,\"T500\"),\"\")","v":"T500"}]
[20251230,"美津濃",8022,"その他製品",1.7200000000000001E-4,"TOPIX Small 1","8022",{"$f":"IFERROR(_xlfn.IFS(F1274=$K$4,\"T500\",F1274=$K$5,\"T500\",F1274=$K$6,\"T500\"),\"\")","v":""}]
[20251230,"ルックホールディングス",8029,"繊維製品",1.7E-5,"TOPIX Small 2","8029",{"$f":"IFERROR(_xlfn.IFS(F1275=$K$4,\"T500\",F1275=$K$5,\"T500\",F1275=$K$6,\"T500\"),\"\")","v":""}]
[20251230,"三井物産",8031,"卸売業",1.4638999999999999E-2,"TOPIX Core30","8031",{"$f":"IFERROR(_xlfn.IFS(F1276=$K$4,\"T500\",F1276=$K$5,\"T500\",F1276=$K$6,\"T500\"),\"\")","v":"T500"}]
[20251230,"日本紙パルプ商事",8032,"卸売業",1.03E-4,"TOPIX Small 2","8032",{"$f":"IFERROR(_xlfn.IFS(F1277=$K$4,\"T500\",F1277=$K$5,\"T500\",F1277=$K$6,\"T500\"),\"\")","v":""}]
[20251230,"東京エレクトロン",8035,"電気機器",1.5054E-2,"TOPIX Core30","8035",{"$f":"IFERROR(_xlfn.IFS(F1278=$K$4,\"T500\",F1278=$K$5,\"T500\",F1278=$K$6,\"T500\"),\"\")","v":"T500"}]
[20251230,"カメイ",8037,"卸売業",6.2000000000000003E-5,"TOPIX Small 2","8037",{"$f":"IFERROR(_xlfn.IFS(F1279=$K$4,\"T500\",F1279=$K$5,\"T500\",F1279=$K$6,\"T500\"),\"\")","v":""}]
[20251230,"スターゼン",8043,"卸売業",6.3E-5,"TOPIX Small 2","8043",{"$f":"IFERROR(_xlfn.IFS(F1280=$K$4,\"T500\",F1280=$K$5,\"T500\",F1280=$K$6,\"T500\"),\"\")","v":""}]
[20251230,"セイコーグループ",8050,"精密機器",2.1000000000000001E-4,"TOPIX Small 1","8050",{"$f":"IFERROR(_xlfn.IFS(F1281=$K$4,\"T500\",F1281=$K$5,\"T500\",F1281=$K$6,\"T500\"),\"\")","v":""}]
[20251230,"山善",8051,"卸売業",9.8999999999999994E-5,"TOPIX Small 1","8051",{"$f":"IFERROR(_xlfn.IFS(F1282=$K$4,\"T500\",F1282=$K$5,\"T500\",F1282=$K$6,\"T500\"),\"\")","v":""}]
[20251230,"椿本興業",8052,"卸売業",4.3999999999999999E-5,"TOPIX Small 2",{"$f":"TEXT(C1283,0)","v":"8052"},{"$f":"IFERROR(_xlfn.IFS(F1283=$K$4,\"T500\",F1283=$K$5,\"T500\",F1283=$K$6,\"T500\"),\"\")","v":""}]
[20251230,"住友商事",8053,"卸売業",7.1139999999999997E-3,"TOPIX Large70","8053",{"$f":"IFERROR(_xlfn.IFS(F1284=$K$4,\"T500\",F1284=$K$5,\"T500\",F1284=$K$6,\"T500\"),\"\")","v":"T500"}]
[20251230,"ＢＩＰＲＯＧＹ",8056,"情報・通信業",3.8000000000000002E-4,"TOPIX Mid400","8056",{"$f":"IFERROR(_xlfn.IFS(F1285=$K$4,\"T500\",F1285=$K$5,\"T500\",F1285=$K$6,\"T500\"),\"\")","v":"T500"}]
[20251230,"内田洋行",8057,"卸売業",8.7000000000000001E-5,"TOPIX Small 1","8057",{"$f":"IFERROR(_xlfn.IFS(F1286=$K$4,\"T500\",F1286=$K$5,\"T500\",F1286=$K$6,\"T500\"),\"\")","v":""}]
[20251230,"三菱商事",8058,"卸売業",1.5675999999999999E-2,"TOPIX Core30","8058",{"$f":"IFERROR(_xlfn.IFS(F1287=$K$4,\"T500\",F1287=$K$5,\"T500\",F1287=$K$6,\"T500\"),\"\")","v":"T500"}]
[20251230,"第一実業",8059,"卸売業",6.2000000000000003E-5,"TOPIX Small 2","8059",{"$f":"IFERROR(_xlfn.IFS(F1288=$K$4,\"T500\",F1288=$K$5,\"T500\",F1288=$K$6,\"T500\"),\"\")","v":""}]
[20251230,"キヤノンマーケティングジャパン",8060,"卸売業",3.5500000000000001E-4,"TOPIX Mid400","8060",{"$f":"IFERROR(_xlfn.IFS(F1289=$K$4,\"T500\",F1289=$K$5,\"T500\",F1289=$K$6,\"T500\"),\"\")","v":"T500"}]
[20251230,"西華産業",8061,"卸売業",7.4999999999999993E-5,"TOPIX Small 1","8061",{"$f":"IFERROR(_xlfn.IFS(F1290=$K$4,\"T500\",F1290=$K$5,\"T500\",F1290=$K$6,\"T500\"),\"\")","v":""}]
[20251230,"佐藤商事",8065,"卸売業",3.4E-5,"TOPIX Small 2","8065",{"$f":"IFERROR(_xlfn.IFS(F1291=$K$4,\"T500\",F1291=$K$5,\"T500\",F1291=$K$6,\"T500\"),\"\")","v":""}]
[20251230,"東京産業",8070,"卸売業",2.1999999999999999E-5,"TOPIX Small 2","8070",{"$f":"IFERROR(_xlfn.IFS(F1292=$K$4,\"T500\",F1292=$K$5,\"T500\",F1292=$K$6,\"T500\"),\"\")","v":""}]
[20251230,"ユアサ商事",8074,"卸売業",1E-4,"TOPIX Small 1","8074",{"$f":"IFERROR(_xlfn.IFS(F1293=$K$4,\"T500\",F1293=$K$5,\"T500\",F1293=$K$6,\"T500\"),\"\")","v":""}]
[20251230,"神鋼商事",8075,"卸売業",4.1999999999999998E-5,"TOPIX Small 2","8075",{"$f":"IFERROR(_xlfn.IFS(F1294=$K$4,\"T500\",F1294=$K$5,\"T500\",F1294=$K$6,\"T500\"),\"\")","v":""}]
[20251230,"阪和興業",8078,"卸売業",2.5900000000000001E-4,"TOPIX Small 1","8078",{"$f":"IFERROR(_xlfn.IFS(F1295=$K$4,\"T500\",F1295=$K$5,\"T500\",F1295=$K$6,\"T500\"),\"\")","v":""}]
[20251230,"正栄食品工業",8079,"卸売業",5.8999999999999998E-5,"TOPIX Small 1","8079",{"$f":"IFERROR(_xlfn.IFS(F1296=$K$4,\"T500\",F1296=$K$5,\"T500\",F1296=$K$6,\"T500\"),\"\")","v":""}]
[20251230,"カナデン",8081,"卸売業",3.6999999999999998E-5,"TOPIX Small 2","8081",{"$f":"IFERROR(_xlfn.IFS(F1297=$K$4,\"T500\",F1297=$K$5,\"T500\",F1297=$K$6,\"T500\"),\"\")","v":""}]
[20251230,"ＲＹＯＤＥＮ",8084,"卸売業",6.0000000000000002E-5,"TOPIX Small 2","8084",{"$f":"IFERROR(_xlfn.IFS(F1298=$K$4,\"T500\",F1298=$K$5,\"T500\",F1298=$K$6,\"T500\"),\"\")","v":""}]
[20251230,"ニプロ",8086,"精密機器",2.5500000000000002E-4,"TOPIX Mid400","8086",{"$f":"IFERROR(_xlfn.IFS(F1299=$K$4,\"T500\",F1299=$K$5,\"T500\",F1299=$K$6,\"T500\"),\"\")","v":"T500"}]
[20251230,"岩谷産業",8088,"卸売業",3.59E-4,"TOPIX Mid400","8088",{"$f":"IFERROR(_xlfn.IFS(F1300=$K$4,\"T500\",F1300=$K$5,\"T500\",F1300=$K$6,\"T500\"),\"\")","v":"T500"}]
[20251230,"極東貿易",8093,"卸売業",2.3E-5,"TOPIX Small 2","8093",{"$f":"IFERROR(_xlfn.IFS(F1301=$K$4,\"T500\",F1301=$K$5,\"T500\",F1301=$K$6,\"T500\"),\"\")","v":""}]
[20251230,"アステナホールディングス",8095,"卸売業",2.0000000000000002E-5,"TOPIX Small 2","8095",{"$f":"IFERROR(_xlfn.IFS(F1302=$K$4,\"T500\",F1302=$K$5,\"T500\",F1302=$K$6,\"T500\"),\"\")","v":""}]
[20251230,"三愛オブリ",8097,"卸売業",1.08E-4,"TOPIX Small 1","8097",{"$f":"IFERROR(_xlfn.IFS(F1303=$K$4,\"T500\",F1303=$K$5,\"T500\",F1303=$K$6,\"T500\"),\"\")","v":""}]
[20251230,"稲畑産業",8098,"卸売業",1.8699999999999999E-4,"TOPIX Small 1","8098",{"$f":"IFERROR(_xlfn.IFS(F1304=$K$4,\"T500\",F1304=$K$5,\"T500\",F1304=$K$6,\"T500\"),\"\")","v":""}]
[20251230,"ＧＳＩクレオス",8101,"卸売業",3.1999999999999999E-5,"TOPIX Small 2","8101",{"$f":"IFERROR(_xlfn.IFS(F1305=$K$4,\"T500\",F1305=$K$5,\"T500\",F1305=$K$6,\"T500\"),\"\")","v":""}]
[20251230,"明和産業",8103,"卸売業",3.0000000000000001E-5,"TOPIX Small 2","8103",{"$f":"IFERROR(_xlfn.IFS(F1306=$K$4,\"T500\",F1306=$K$5,\"T500\",F1306=$K$6,\"T500\"),\"\")","v":""}]
[20251230,"ゴールドウイン",8111,"繊維製品",3.0499999999999999E-4,"TOPIX Mid400","8111",{"$f":"IFERROR(_xlfn.IFS(F1307=$K$4,\"T500\",F1307=$K$5,\"T500\",F1307=$K$6,\"T500\"),\"\")","v":"T500"}]
[20251230,"ユニ・チャーム",8113,"化学",1.163E-3,"TOPIX Large70","8113",{"$f":"IFERROR(_xlfn.IFS(F1308=$K$4,\"T500\",F1308=$K$5,\"T500\",F1308=$K$6,\"T500\"),\"\")","v":"T500"}]
[20251230,"ワキタ",8125,"卸売業",6.9999999999999994E-5,"TOPIX Small 1","8125",{"$f":"IFERROR(_xlfn.IFS(F1309=$K$4,\"T500\",F1309=$K$5,\"T500\",F1309=$K$6,\"T500\"),\"\")","v":""}]
[20251230,"東邦ホールディングス",8129,"卸売業",2.9100000000000003E-4,"TOPIX Mid400","8129",{"$f":"IFERROR(_xlfn.IFS(F1310=$K$4,\"T500\",F1310=$K$5,\"T500\",F1310=$K$6,\"T500\"),\"\")","v":"T500"}]
[20251230,"サンゲツ",8130,"卸売業",1.7100000000000001E-4,"TOPIX Small 1","8130",{"$f":"IFERROR(_xlfn.IFS(F1311=$K$4,\"T500\",F1311=$K$5,\"T500\",F1311=$K$6,\"T500\"),\"\")","v":""}]
[20251230,"ミツウロコグループホールディングス",8131,"卸売業",5.8E-5,"TOPIX Small 2","8131",{"$f":"IFERROR(_xlfn.IFS(F1312=$K$4,\"T500\",F1312=$K$5,\"T500\",F1312=$K$6,\"T500\"),\"\")","v":""}]
[20251230,"シナネンホールディングス",8132,"卸売業",2.6999999999999999E-5,"TOPIX Small 2","8132",{"$f":"IFERROR(_xlfn.IFS(F1313=$K$4,\"T500\",F1313=$K$5,\"T500\",F1313=$K$6,\"T500\"),\"\")","v":""}]
[20251230,"伊藤忠エネクス",8133,"卸売業",1.03E-4,"TOPIX Small 1","8133",{"$f":"IFERROR(_xlfn.IFS(F1314=$K$4,\"T500\",F1314=$K$5,\"T500\",F1314=$K$6,\"T500\"),\"\")","v":""}]
[20251230,"サンリオ",8136,"卸売業",1.0709999999999999E-3,"TOPIX Mid400","8136",{"$f":"IFERROR(_xlfn.IFS(F1315=$K$4,\"T500\",F1315=$K$5,\"T500\",F1315=$K$6,\"T500\"),\"\")","v":"T500"}]
[20251230,"サンワテクノス",8137,"卸売業",3.6999999999999998E-5,"TOPIX Small 2","8137",{"$f":"IFERROR(_xlfn.IFS(F1316=$K$4,\"T500\",F1316=$K$5,\"T500\",F1316=$K$6,\"T500\"),\"\")","v":""}]
[20251230,"新光商事",8141,"卸売業",2.8E-5,"TOPIX Small 2","8141",{"$f":"IFERROR(_xlfn.IFS(F1317=$K$4,\"T500\",F1317=$K$5,\"T500\",F1317=$K$6,\"T500\"),\"\")","v":""}]
[20251230,"トーホー",8142,"卸売業",3.3000000000000003E-5,"TOPIX Small 2","8142",{"$f":"IFERROR(_xlfn.IFS(F1318=$K$4,\"T500\",F1318=$K$5,\"T500\",F1318=$K$6,\"T500\"),\"\")","v":""}]
[20251230,"三信電気",8150,"卸売業",3.8999999999999999E-5,"TOPIX Small 2","8150",{"$f":"IFERROR(_xlfn.IFS(F1319=$K$4,\"T500\",F1319=$K$5,\"T500\",F1319=$K$6,\"T500\"),\"\")","v":""}]
[20251230,"東陽テクニカ",8151,"卸売業",3.4999999999999997E-5,"TOPIX Small 2","8151",{"$f":"IFERROR(_xlfn.IFS(F1320=$K$4,\"T500\",F1320=$K$5,\"T500\",F1320=$K$6,\"T500\"),\"\")","v":""}]
[20251230,"モスフードサービス",8153,"卸売業",1.37E-4,"TOPIX Small 1","8153",{"$f":"IFERROR(_xlfn.IFS(F1321=$K$4,\"T500\",F1321=$K$5,\"T500\",F1321=$K$6,\"T500\"),\"\")","v":""}]
[20251230,"加賀電子",8154,"卸売業",1.5799999999999999E-4,"TOPIX Small 1","8154",{"$f":"IFERROR(_xlfn.IFS(F1322=$K$4,\"T500\",F1322=$K$5,\"T500\",F1322=$K$6,\"T500\"),\"\")","v":""}]
[20251230,"都築電気",8157,"情報・通信業",4.6E-5,"TOPIX Small 2","8157",{"$f":"IFERROR(_xlfn.IFS(F1323=$K$4,\"T500\",F1323=$K$5,\"T500\",F1323=$K$6,\"T500\"),\"\")","v":""}]
[20251230,"ソーダニッカ",8158,"卸売業",2.3E-5,"TOPIX Small 2","8158",{"$f":"IFERROR(_xlfn.IFS(F1324=$K$4,\"T500\",F1324=$K$5,\"T500\",F1324=$K$6,\"T500\"),\"\")","v":""}]
[20251230,"立花エレテック",8159,"卸売業",4.0000000000000003E-5,"TOPIX Small 2","8159",{"$f":"IFERROR(_xlfn.IFS(F1325=$K$4,\"T500\",F1325=$K$5,\"T500\",F1325=$K$6,\"T500\"),\"\")","v":""}]
[20251230,"木曽路",8160,"小売業",8.3999999999999995E-5,"TOPIX Small 1","8160",{"$f":"IFERROR(_xlfn.IFS(F1326=$K$4,\"T500\",F1326=$K$5,\"T500\",F1326=$K$6,\"T500\"),\"\")","v":""}]
[20251230,"ＳＲＳホールディングス",8163,"小売業",4.3999999999999999E-5,"TOPIX Small 2","8163",{"$f":"IFERROR(_xlfn.IFS(F1327=$K$4,\"T500\",F1327=$K$5,\"T500\",F1327=$K$6,\"T500\"),\"\")","v":""}]
[20251230,"千趣会",8165,"小売業",9.0000000000000002E-6,"TOPIX Small 2","8165",{"$f":"IFERROR(_xlfn.IFS(F1328=$K$4,\"T500\",F1328=$K$5,\"T500\",F1328=$K$6,\"T500\"),\"\")","v":""}]
[20251230,"リテールパートナーズ",8167,"小売業",4.3999999999999999E-5,"TOPIX Small 2","8167",{"$f":"IFERROR(_xlfn.IFS(F1329=$K$4,\"T500\",F1329=$K$5,\"T500\",F1329=$K$6,\"T500\"),\"\")","v":""}]
[20251230,"上新電機",8173,"小売業",6.4999999999999994E-5,"TOPIX Small 1","8173",{"$f":"IFERROR(_xlfn.IFS(F1330=$K$4,\"T500\",F1330=$K$5,\"T500\",F1330=$K$6,\"T500\"),\"\")","v":""}]
[20251230,"日本瓦斯",8174,"小売業",3.1199999999999999E-4,"TOPIX Mid400","8174",{"$f":"IFERROR(_xlfn.IFS(F1331=$K$4,\"T500\",F1331=$K$5,\"T500\",F1331=$K$6,\"T500\"),\"\")","v":"T500"}]
[20251230,"ロイヤルホールディングス",8179,"小売業",1.12E-4,"TOPIX Small 1","8179",{"$f":"IFERROR(_xlfn.IFS(F1332=$K$4,\"T500\",F1332=$K$5,\"T500\",F1332=$K$6,\"T500\"),\"\")","v":""}]
[20251230,"チヨダ",8185,"小売業",2.3E-5,"TOPIX Small 2","8185",{"$f":"IFERROR(_xlfn.IFS(F1333=$K$4,\"T500\",F1333=$K$5,\"T500\",F1333=$K$6,\"T500\"),\"\")","v":""}]
[20251230,"ライフコーポレーション",8194,"小売業",1.08E-4,"TOPIX Small 1","8194",{"$f":"IFERROR(_xlfn.IFS(F1334=$K$4,\"T500\",F1334=$K$5,\"T500\",F1334=$K$6,\"T500\"),\"\")","v":""}]
[20251230,"リンガーハット",8200,"小売業",6.8999999999999997E-5,"TOPIX Small 1","8200",{"$f":"IFERROR(_xlfn.IFS(F1335=$K$4,\"T500\",F1335=$K$5,\"T500\",F1335=$K$6,\"T500\"),\"\")","v":""}]
[20251230,"ＭｒＭａｘＨＤ",8203,"小売業",1.5E-5,"TOPIX Small 2","8203",{"$f":"IFERROR(_xlfn.IFS(F1336=$K$4,\"T500\",F1336=$K$5,\"T500\",F1336=$K$6,\"T500\"),\"\")","v":""}]
[20251230,"ＡＯＫＩホールディングス",8214,"小売業",8.5000000000000006E-5,"TOPIX Small 1","8214",{"$f":"IFERROR(_xlfn.IFS(F1337=$K$4,\"T500\",F1337=$K$5,\"T500\",F1337=$K$6,\"T500\"),\"\")","v":""}]
[20251230,"オークワ",8217,"小売業",2.5000000000000001E-5,"TOPIX Small 2","8217",{"$f":"IFERROR(_xlfn.IFS(F1338=$K$4,\"T500\",F1338=$K$5,\"T500\",F1338=$K$6,\"T500\"),\"\")","v":""}]
[20251230,"コメリ",8218,"小売業",1E-4,"TOPIX Small 1","8218",{"$f":"IFERROR(_xlfn.IFS(F1339=$K$4,\"T500\",F1339=$K$5,\"T500\",F1339=$K$6,\"T500\"),\"\")","v":""}]
[20251230,"青山商事",8219,"小売業",1.1900000000000001E-4,"TOPIX Small 1","8219",{"$f":"IFERROR(_xlfn.IFS(F1340=$K$4,\"T500\",F1340=$K$5,\"T500\",F1340=$K$6,\"T500\"),\"\")","v":""}]
[20251230,"しまむら",8227,"小売業",5.2599999999999999E-4,"TOPIX Mid400","8227",{"$f":"IFERROR(_xlfn.IFS(F1341=$K$4,\"T500\",F1341=$K$5,\"T500\",F1341=$K$6,\"T500\"),\"\")","v":"T500"}]
[20251230,"高島屋",8233,"小売業",5.22E-4,"TOPIX Mid400","8233",{"$f":"IFERROR(_xlfn.IFS(F1342=$K$4,\"T500\",F1342=$K$5,\"T500\",F1342=$K$6,\"T500\"),\"\")","v":"T500"}]
[20251230,"松屋",8237,"小売業",7.6000000000000004E-5,"TOPIX Small 1","8237",{"$f":"IFERROR(_xlfn.IFS(F1343=$K$4,\"T500\",F1343=$K$5,\"T500\",F1343=$K$6,\"T500\"),\"\")","v":""}]
[20251230,"エイチ・ツー・オー　リテイリング",8242,"小売業",2.1900000000000001E-4,"TOPIX Mid400","8242",{"$f":"IFERROR(_xlfn.IFS(F1344=$K$4,\"T500\",F1344=$K$5,\"T500\",F1344=$K$6,\"T500\"),\"\")","v":"T500"}]
[20251230,"近鉄百貨店",8244,"小売業",2.3E-5,"TOPIX Small 2","8244",{"$f":"IFERROR(_xlfn.IFS(F1345=$K$4,\"T500\",F1345=$K$5,\"T500\",F1345=$K$6,\"T500\"),\"\")","v":""}]
[20251230,"丸井グループ",8252,"小売業",4.1300000000000001E-4,"TOPIX Mid400","8252",{"$f":"IFERROR(_xlfn.IFS(F1346=$K$4,\"T500\",F1346=$K$5,\"T500\",F1346=$K$6,\"T500\"),\"\")","v":"T500"}]
[20251230,"クレディセゾン",8253,"その他金融業",4.84E-4,"TOPIX Mid400",{"$f":"TEXT(C1347,0)","v":"8253"},{"$f":"IFERROR(_xlfn.IFS(F1347=$K$4,\"T500\",F1347=$K$5,\"T500\",F1347=$K$6,\"T500\"),\"\")","v":"T500"}]
[20251230,"アクシアル　リテイリング",8255,"小売業",6.8999999999999997E-5,"TOPIX Small 2","8255",{"$f":"IFERROR(_xlfn.IFS(F1348=$K$4,\"T500\",F1348=$K$5,\"T500\",F1348=$K$6,\"T500\"),\"\")","v":""}]
[20251230,"イオン",8267,"小売業",6.4120000000000002E-3,"TOPIX Large70","8267",{"$f":"IFERROR(_xlfn.IFS(F1349=$K$4,\"T500\",F1349=$K$5,\"T500\",F1349=$K$6,\"T500\"),\"\")","v":"T500"}]
[20251230,"イズミ",8273,"小売業",1.17E-4,"TOPIX Small 1","8273",{"$f":"IFERROR(_xlfn.IFS(F1350=$K$4,\"T500\",F1350=$K$5,\"T500\",F1350=$K$6,\"T500\"),\"\")","v":""}]
[20251230,"フォーバル",8275,"卸売業",1.0000000000000001E-5,"TOPIX Small 2","8275",{"$f":"IFERROR(_xlfn.IFS(F1351=$K$4,\"T500\",F1351=$K$5,\"T500\",F1351=$K$6,\"T500\"),\"\")","v":""}]
[20251230,"平和堂",8276,"小売業",1.0399999999999999E-4,"TOPIX Small 1","8276",{"$f":"IFERROR(_xlfn.IFS(F1352=$K$4,\"T500\",F1352=$K$5,\"T500\",F1352=$K$6,\"T500\"),\"\")","v":""}]
[20251230,"フジ",8278,"小売業",7.2000000000000002E-5,"TOPIX Small 1","8278",{"$f":"IFERROR(_xlfn.IFS(F1353=$K$4,\"T500\",F1353=$K$5,\"T500\",F1353=$K$6,\"T500\"),\"\")","v":""}]
[20251230,"ゼビオホールディングス",8281,"小売業",2.8E-5,"TOPIX Small 1","8281",{"$f":"IFERROR(_xlfn.IFS(F1354=$K$4,\"T500\",F1354=$K$5,\"T500\",F1354=$K$6,\"T500\"),\"\")","v":""}]
[20251230,"ケーズホールディングス",8282,"小売業",2.41E-4,"TOPIX Mid400","8282",{"$f":"IFERROR(_xlfn.IFS(F1355=$K$4,\"T500\",F1355=$K$5,\"T500\",F1355=$K$6,\"T500\"),\"\")","v":"T500"}]
[20251230,"ＰＡＬＴＡＣ",8283,"卸売業",1.6200000000000001E-4,"TOPIX Mid400","8283",{"$f":"IFERROR(_xlfn.IFS(F1356=$K$4,\"T500\",F1356=$K$5,\"T500\",F1356=$K$6,\"T500\"),\"\")","v":"T500"}]
[20251230,"三谷産業",8285,"卸売業",2.1999999999999999E-5,"TOPIX Small 2","8285",{"$f":"IFERROR(_xlfn.IFS(F1357=$K$4,\"T500\",F1357=$K$5,\"T500\",F1357=$K$6,\"T500\"),\"\")","v":""}]
[20251230,"あおぞら銀行",8304,"銀行業",3.2600000000000001E-4,"TOPIX Mid400","8304",{"$f":"IFERROR(_xlfn.IFS(F1358=$K$4,\"T500\",F1358=$K$5,\"T500\",F1358=$K$6,\"T500\"),\"\")","v":"T500"}]
[20251230,"三菱ＵＦＪフィナンシャル・グループ",8306,"銀行業",3.2101999999999999E-2,"TOPIX Core30","8306",{"$f":"IFERROR(_xlfn.IFS(F1359=$K$4,\"T500\",F1359=$K$5,\"T500\",F1359=$K$6,\"T500\"),\"\")","v":"T500"}]
[20251230,"りそなホールディングス",8308,"銀行業",3.7369999999999999E-3,"TOPIX Large70","8308",{"$f":"IFERROR(_xlfn.IFS(F1360=$K$4,\"T500\",F1360=$K$5,\"T500\",F1360=$K$6,\"T500\"),\"\")","v":"T500"}]
[20251230,"三井住友トラストグループ",8309,"銀行業",3.395E-3,"TOPIX Large70","8309",{"$f":"IFERROR(_xlfn.IFS(F1361=$K$4,\"T500\",F1361=$K$5,\"T500\",F1361=$K$6,\"T500\"),\"\")","v":"T500"}]
[20251230,"三井住友フィナンシャルグループ",8316,"銀行業",2.2606000000000001E-2,"TOPIX Core30","8316",{"$f":"IFERROR(_xlfn.IFS(F1362=$K$4,\"T500\",F1362=$K$5,\"T500\",F1362=$K$6,\"T500\"),\"\")","v":"T500"}]
[20251230,"千葉銀行",8331,"銀行業",1.091E-3,"TOPIX Mid400","8331",{"$f":"IFERROR(_xlfn.IFS(F1363=$K$4,\"T500\",F1363=$K$5,\"T500\",F1363=$K$6,\"T500\"),\"\")","v":"T500"}]
[20251230,"群馬銀行",8334,"銀行業",6.3599999999999996E-4,"TOPIX Mid400","8334",{"$f":"IFERROR(_xlfn.IFS(F1364=$K$4,\"T500\",F1364=$K$5,\"T500\",F1364=$K$6,\"T500\"),\"\")","v":"T500"}]
[20251230,"武蔵野銀行",8336,"銀行業",1.3799999999999999E-4,"TOPIX Small 1","8336",{"$f":"IFERROR(_xlfn.IFS(F1365=$K$4,\"T500\",F1365=$K$5,\"T500\",F1365=$K$6,\"T500\"),\"\")","v":""}]
[20251230,"千葉興業銀行",8337,"銀行業",6.4999999999999994E-5,"TOPIX Small 1","8337",{"$f":"IFERROR(_xlfn.IFS(F1366=$K$4,\"T500\",F1366=$K$5,\"T500\",F1366=$K$6,\"T500\"),\"\")","v":""}]
[20251230,"筑波銀行",8338,"銀行業",3.6999999999999998E-5,"TOPIX Small 2","8338",{"$f":"IFERROR(_xlfn.IFS(F1367=$K$4,\"T500\",F1367=$K$5,\"T500\",F1367=$K$6,\"T500\"),\"\")","v":""}]
[20251230,"七十七銀行",8341,"銀行業",4.9299999999999995E-4,"TOPIX Mid400","8341",{"$f":"IFERROR(_xlfn.IFS(F1368=$K$4,\"T500\",F1368=$K$5,\"T500\",F1368=$K$6,\"T500\"),\"\")","v":"T500"}]
[20251230,"秋田銀行",8343,"銀行業",5.5000000000000002E-5,"TOPIX Small 2","8343",{"$f":"IFERROR(_xlfn.IFS(F1369=$K$4,\"T500\",F1369=$K$5,\"T500\",F1369=$K$6,\"T500\"),\"\")","v":""}]
[20251230,"山形銀行",8344,"銀行業",5.1E-5,"TOPIX Small 2","8344",{"$f":"IFERROR(_xlfn.IFS(F1370=$K$4,\"T500\",F1370=$K$5,\"T500\",F1370=$K$6,\"T500\"),\"\")","v":""}]
[20251230,"岩手銀行",8345,"銀行業",6.7000000000000002E-5,"TOPIX Small 2","8345",{"$f":"IFERROR(_xlfn.IFS(F1371=$K$4,\"T500\",F1371=$K$5,\"T500\",F1371=$K$6,\"T500\"),\"\")","v":""}]
[20251230,"東邦銀行",8346,"銀行業",1.27E-4,"TOPIX Small 1","8346",{"$f":"IFERROR(_xlfn.IFS(F1372=$K$4,\"T500\",F1372=$K$5,\"T500\",F1372=$K$6,\"T500\"),\"\")","v":""}]
[20251230,"ふくおかフィナンシャルグループ",8354,"銀行業",8.2600000000000002E-4,"TOPIX Mid400","8354",{"$f":"IFERROR(_xlfn.IFS(F1373=$K$4,\"T500\",F1373=$K$5,\"T500\",F1373=$K$6,\"T500\"),\"\")","v":"T500"}]
[20251230,"スルガ銀行",8358,"銀行業",2.3499999999999999E-4,"TOPIX Small 1","8358",{"$f":"IFERROR(_xlfn.IFS(F1374=$K$4,\"T500\",F1374=$K$5,\"T500\",F1374=$K$6,\"T500\"),\"\")","v":""}]
[20251230,"八十二銀行",8359,"銀行業",7.1500000000000003E-4,"TOPIX Mid400","8359",{"$f":"IFERROR(_xlfn.IFS(F1375=$K$4,\"T500\",F1375=$K$5,\"T500\",F1375=$K$6,\"T500\"),\"\")","v":"T500"}]
[20251230,"山梨中央銀行",8360,"銀行業",1E-4,"TOPIX Small 1","8360",{"$f":"IFERROR(_xlfn.IFS(F1376=$K$4,\"T500\",F1376=$K$5,\"T500\",F1376=$K$6,\"T500\"),\"\")","v":""}]
[20251230,"大垣共立銀行",8361,"銀行業",1.9799999999999999E-4,"TOPIX Small 1","8361",{"$f":"IFERROR(_xlfn.IFS(F1377=$K$4,\"T500\",F1377=$K$5,\"T500\",F1377=$K$6,\"T500\"),\"\")","v":""}]
[20251230,"福井銀行",8362,"銀行業",5.1E-5,"TOPIX Small 2","8362",{"$f":"IFERROR(_xlfn.IFS(F1378=$K$4,\"T500\",F1378=$K$5,\"T500\",F1378=$K$6,\"T500\"),\"\")","v":""}]
[20251230,"清水銀行",8364,"銀行業",2.0000000000000002E-5,"TOPIX Small 2","8364",{"$f":"IFERROR(_xlfn.IFS(F1379=$K$4,\"T500\",F1379=$K$5,\"T500\",F1379=$K$6,\"T500\"),\"\")","v":""}]
[20251230,"滋賀銀行",8366,"銀行業",2.22E-4,"TOPIX Small 1","8366",{"$f":"IFERROR(_xlfn.IFS(F1380=$K$4,\"T500\",F1380=$K$5,\"T500\",F1380=$K$6,\"T500\"),\"\")","v":""}]
[20251230,"南都銀行",8367,"銀行業",1.83E-4,"TOPIX Small 1","8367",{"$f":"IFERROR(_xlfn.IFS(F1381=$K$4,\"T500\",F1381=$K$5,\"T500\",F1381=$K$6,\"T500\"),\"\")","v":""}]
[20251230,"百五銀行",8368,"銀行業",2.2000000000000001E-4,"TOPIX Small 1","8368",{"$f":"IFERROR(_xlfn.IFS(F1382=$K$4,\"T500\",F1382=$K$5,\"T500\",F1382=$K$6,\"T500\"),\"\")","v":""}]
[20251230,"紀陽銀行",8370,"銀行業",2.2100000000000001E-4,"TOPIX Small 1","8370",{"$f":"IFERROR(_xlfn.IFS(F1383=$K$4,\"T500\",F1383=$K$5,\"T500\",F1383=$K$6,\"T500\"),\"\")","v":""}]
[20251230,"ほくほくフィナンシャルグループ",8377,"銀行業",5.71E-4,"TOPIX Mid400","8377",{"$f":"IFERROR(_xlfn.IFS(F1384=$K$4,\"T500\",F1384=$K$5,\"T500\",F1384=$K$6,\"T500\"),\"\")","v":"T500"}]
[20251230,"山陰合同銀行",8381,"銀行業",1.9000000000000001E-4,"TOPIX Small 1","8381",{"$f":"IFERROR(_xlfn.IFS(F1385=$K$4,\"T500\",F1385=$K$5,\"T500\",F1385=$K$6,\"T500\"),\"\")","v":""}]
[20251230,"百十四銀行",8386,"銀行業",1.3300000000000001E-4,"TOPIX Small 1","8386",{"$f":"IFERROR(_xlfn.IFS(F1386=$K$4,\"T500\",F1386=$K$5,\"T500\",F1386=$K$6,\"T500\"),\"\")","v":""}]
[20251230,"四国銀行",8387,"銀行業",5.5999999999999999E-5,"TOPIX Small 2","8387",{"$f":"IFERROR(_xlfn.IFS(F1387=$K$4,\"T500\",F1387=$K$5,\"T500\",F1387=$K$6,\"T500\"),\"\")","v":""}]
[20251230,"阿波銀行",8388,"銀行業",1.3300000000000001E-4,"TOPIX Small 1","8388",{"$f":"IFERROR(_xlfn.IFS(F1388=$K$4,\"T500\",F1388=$K$5,\"T500\",F1388=$K$6,\"T500\"),\"\")","v":""}]
[20251230,"大分銀行",8392,"銀行業",8.2999999999999998E-5,"TOPIX Small 2","8392",{"$f":"IFERROR(_xlfn.IFS(F1389=$K$4,\"T500\",F1389=$K$5,\"T500\",F1389=$K$6,\"T500\"),\"\")","v":""}]
[20251230,"宮崎銀行",8393,"銀行業",7.7999999999999999E-5,"TOPIX Small 2","8393",{"$f":"IFERROR(_xlfn.IFS(F1390=$K$4,\"T500\",F1390=$K$5,\"T500\",F1390=$K$6,\"T500\"),\"\")","v":""}]
[20251230,"佐賀銀行",8395,"銀行業",5.1999999999999997E-5,"TOPIX Small 2","8395",{"$f":"IFERROR(_xlfn.IFS(F1391=$K$4,\"T500\",F1391=$K$5,\"T500\",F1391=$K$6,\"T500\"),\"\")","v":""}]
[20251230,"琉球銀行",8399,"銀行業",8.0000000000000007E-5,"TOPIX Small 1","8399",{"$f":"IFERROR(_xlfn.IFS(F1392=$K$4,\"T500\",F1392=$K$5,\"T500\",F1392=$K$6,\"T500\"),\"\")","v":""}]
[20251230,"セブン銀行",8410,"銀行業",1.95E-4,"TOPIX Mid400","8410",{"$f":"IFERROR(_xlfn.IFS(F1393=$K$4,\"T500\",F1393=$K$5,\"T500\",F1393=$K$6,\"T500\"),\"\")","v":"T500"}]
[20251230,"みずほフィナンシャルグループ",8411,"銀行業",1.6499E-2,"TOPIX Core30","8411",{"$f":"IFERROR(_xlfn.IFS(F1394=$K$4,\"T500\",F1394=$K$5,\"T500\",F1394=$K$6,\"T500\"),\"\")","v":"T500"}]
[20251230,"山口フィナンシャルグループ",8418,"銀行業",4.2499999999999998E-4,"TOPIX Mid400","8418",{"$f":"IFERROR(_xlfn.IFS(F1395=$K$4,\"T500\",F1395=$K$5,\"T500\",F1395=$K$6,\"T500\"),\"\")","v":"T500"}]
[20251230,"芙蓉総合リース",8424,"その他金融業",2.42E-4,"TOPIX Mid400","8424",{"$f":"IFERROR(_xlfn.IFS(F1396=$K$4,\"T500\",F1396=$K$5,\"T500\",F1396=$K$6,\"T500\"),\"\")","v":"T500"}]
[20251230,"みずほリース",8425,"その他金融業",2.1699999999999999E-4,"TOPIX Small 1","8425",{"$f":"IFERROR(_xlfn.IFS(F1397=$K$4,\"T500\",F1397=$K$5,\"T500\",F1397=$K$6,\"T500\"),\"\")","v":""}]
[20251230,"東京センチュリー",8439,"その他金融業",3.0899999999999998E-4,"TOPIX Mid400","8439",{"$f":"IFERROR(_xlfn.IFS(F1398=$K$4,\"T500\",F1398=$K$5,\"T500\",F1398=$K$6,\"T500\"),\"\")","v":"T500"}]
[20251230,"ＳＢＩホールディングス",8473,"証券、商品先物取引業",2.4199999999999998E-3,"TOPIX Mid400","8473",{"$f":"IFERROR(_xlfn.IFS(F1399=$K$4,\"T500\",F1399=$K$5,\"T500\",F1399=$K$6,\"T500\"),\"\")","v":"T500"}]
[20251230,"日本証券金融",8511,"その他金融業",1.5200000000000001E-4,"TOPIX Small 1","8511",{"$f":"IFERROR(_xlfn.IFS(F1400=$K$4,\"T500\",F1400=$K$5,\"T500\",F1400=$K$6,\"T500\"),\"\")","v":""}]
[20251230,"アイフル",8515,"その他金融業",1.8900000000000001E-4,"TOPIX Small 1","8515",{"$f":"IFERROR(_xlfn.IFS(F1401=$K$4,\"T500\",F1401=$K$5,\"T500\",F1401=$K$6,\"T500\"),\"\")","v":""}]
[20251230,"名古屋銀行",8522,"銀行業",1.6699999999999999E-4,"TOPIX Small 1","8522",{"$f":"IFERROR(_xlfn.IFS(F1402=$K$4,\"T500\",F1402=$K$5,\"T500\",F1402=$K$6,\"T500\"),\"\")","v":""}]
[20251230,"北洋銀行",8524,"銀行業",2.24E-4,"TOPIX Small 1","8524",{"$f":"IFERROR(_xlfn.IFS(F1403=$K$4,\"T500\",F1403=$K$5,\"T500\",F1403=$K$6,\"T500\"),\"\")","v":""}]
[20251230,"愛媛銀行",8541,"銀行業",4.3999999999999999E-5,"TOPIX Small 2","8541",{"$f":"IFERROR(_xlfn.IFS(F1404=$K$4,\"T500\",F1404=$K$5,\"T500\",F1404=$K$6,\"T500\"),\"\")","v":""}]
[20251230,"京葉銀行",8544,"銀行業",1.47E-4,"TOPIX Small 1","8544",{"$f":"IFERROR(_xlfn.IFS(F1405=$K$4,\"T500\",F1405=$K$5,\"T500\",F1405=$K$6,\"T500\"),\"\")","v":""}]
[20251230,"栃木銀行",8550,"銀行業",8.0000000000000007E-5,"TOPIX Small 2","8550",{"$f":"IFERROR(_xlfn.IFS(F1406=$K$4,\"T500\",F1406=$K$5,\"T500\",F1406=$K$6,\"T500\"),\"\")","v":""}]
[20251230,"北日本銀行",8551,"銀行業",2.9E-5,"TOPIX Small 2","8551",{"$f":"IFERROR(_xlfn.IFS(F1407=$K$4,\"T500\",F1407=$K$5,\"T500\",F1407=$K$6,\"T500\"),\"\")","v":""}]
[20251230,"東和銀行",8558,"銀行業",4.3000000000000002E-5,"TOPIX Small 2","8558",{"$f":"IFERROR(_xlfn.IFS(F1408=$K$4,\"T500\",F1408=$K$5,\"T500\",F1408=$K$6,\"T500\"),\"\")","v":""}]
[20251230,"リコーリース",8566,"その他金融業",1.13E-4,"TOPIX Small 1","8566",{"$f":"IFERROR(_xlfn.IFS(F1409=$K$4,\"T500\",F1409=$K$5,\"T500\",F1409=$K$6,\"T500\"),\"\")","v":""}]
[20251230,"イオンフィナンシャルサービス",8570,"その他金融業",2.03E-4,"TOPIX Mid400","8570",{"$f":"IFERROR(_xlfn.IFS(F1410=$K$4,\"T500\",F1410=$K$5,\"T500\",F1410=$K$6,\"T500\"),\"\")","v":"T500"}]
[20251230,"アコム",8572,"その他金融業",1.8000000000000001E-4,"TOPIX Mid400",{"$f":"TEXT(C1411,0)","v":"8572"},{"$f":"IFERROR(_xlfn.IFS(F1411=$K$4,\"T500\",F1411=$K$5,\"T500\",F1411=$K$6,\"T500\"),\"\")","v":"T500"}]
[20251230,"ジャックス",8584,"その他金融業",1.06E-4,"TOPIX Small 1","8584",{"$f":"IFERROR(_xlfn.IFS(F1412=$K$4,\"T500\",F1412=$K$5,\"T500\",F1412=$K$6,\"T500\"),\"\")","v":""}]
[20251230,"オリエントコーポレーション",8585,"その他金融業",8.5000000000000006E-5,"TOPIX Small 1","8585",{"$f":"IFERROR(_xlfn.IFS(F1413=$K$4,\"T500\",F1413=$K$5,\"T500\",F1413=$K$6,\"T500\"),\"\")","v":""}]
[20251230,"オリックス",8591,"その他金融業",5.7460000000000002E-3,"TOPIX Large70","8591",{"$f":"IFERROR(_xlfn.IFS(F1414=$K$4,\"T500\",F1414=$K$5,\"T500\",F1414=$K$6,\"T500\"),\"\")","v":"T500"}]
[20251230,"三菱ＨＣキャピタル",8593,"その他金融業",1.341E-3,"TOPIX Mid400","8593",{"$f":"IFERROR(_xlfn.IFS(F1415=$K$4,\"T500\",F1415=$K$5,\"T500\",F1415=$K$6,\"T500\"),\"\")","v":"T500"}]
[20251230,"ジャフコ　グループ",8595,"証券、商品先物取引業",1.3200000000000001E-4,"TOPIX Mid400","8595",{"$f":"IFERROR(_xlfn.IFS(F1416=$K$4,\"T500\",F1416=$K$5,\"T500\",F1416=$K$6,\"T500\"),\"\")","v":"T500"}]
[20251230,"トモニホールディングス",8600,"銀行業",1.5300000000000001E-4,"TOPIX Small 1","8600",{"$f":"IFERROR(_xlfn.IFS(F1417=$K$4,\"T500\",F1417=$K$5,\"T500\",F1417=$K$6,\"T500\"),\"\")","v":""}]
[20251230,"大和証券グループ本社",8601,"証券、商品先物取引業",2E-3,"TOPIX Mid400","8601",{"$f":"IFERROR(_xlfn.IFS(F1418=$K$4,\"T500\",F1418=$K$5,\"T500\",F1418=$K$6,\"T500\"),\"\")","v":"T500"}]
[20251230,"野村ホールディングス",8604,"証券、商品先物取引業",4.4660000000000004E-3,"TOPIX Large70","8604",{"$f":"IFERROR(_xlfn.IFS(F1419=$K$4,\"T500\",F1419=$K$5,\"T500\",F1419=$K$6,\"T500\"),\"\")","v":"T500"}]
[20251230,"岡三証券グループ",8609,"証券、商品先物取引業",1.21E-4,"TOPIX Small 1","8609",{"$f":"IFERROR(_xlfn.IFS(F1420=$K$4,\"T500\",F1420=$K$5,\"T500\",F1420=$K$6,\"T500\"),\"\")","v":""}]
[20251230,"丸三証券",8613,"証券、商品先物取引業",6.8999999999999997E-5,"TOPIX Small 1","8613",{"$f":"IFERROR(_xlfn.IFS(F1421=$K$4,\"T500\",F1421=$K$5,\"T500\",F1421=$K$6,\"T500\"),\"\")","v":""}]
[20251230,"東洋証券",8614,"証券、商品先物取引業",4.1E-5,"TOPIX Small 2","8614",{"$f":"IFERROR(_xlfn.IFS(F1422=$K$4,\"T500\",F1422=$K$5,\"T500\",F1422=$K$6,\"T500\"),\"\")","v":""}]
[20251230,"東海東京フィナンシャル・ホールディングス",8616,"証券、商品先物取引業",1.66E-4,"TOPIX Small 1","8616",{"$f":"IFERROR(_xlfn.IFS(F1423=$K$4,\"T500\",F1423=$K$5,\"T500\",F1423=$K$6,\"T500\"),\"\")","v":""}]
[20251230,"水戸証券",8622,"証券、商品先物取引業",3.1000000000000001E-5,"TOPIX Small 2","8622",{"$f":"IFERROR(_xlfn.IFS(F1424=$K$4,\"T500\",F1424=$K$5,\"T500\",F1424=$K$6,\"T500\"),\"\")","v":""}]
[20251230,"いちよし証券",8624,"証券、商品先物取引業",4.1E-5,"TOPIX Small 2","8624",{"$f":"IFERROR(_xlfn.IFS(F1425=$K$4,\"T500\",F1425=$K$5,\"T500\",F1425=$K$6,\"T500\"),\"\")","v":""}]
[20251230,"松井証券",8628,"証券、商品先物取引業",1.2E-4,"TOPIX Small 1","8628",{"$f":"IFERROR(_xlfn.IFS(F1426=$K$4,\"T500\",F1426=$K$5,\"T500\",F1426=$K$6,\"T500\"),\"\")","v":""}]
[20251230,"ＳＯＭＰＯホールディングス",8630,"保険業",5.4089999999999997E-3,"TOPIX Large70","8630",{"$f":"IFERROR(_xlfn.IFS(F1427=$K$4,\"T500\",F1427=$K$5,\"T500\",F1427=$K$6,\"T500\"),\"\")","v":"T500"}]
[20251230,"日本取引所グループ",8697,"その他金融業",1.8760000000000001E-3,"TOPIX Large70","8697",{"$f":"IFERROR(_xlfn.IFS(F1428=$K$4,\"T500\",F1428=$K$5,\"T500\",F1428=$K$6,\"T500\"),\"\")","v":"T500"}]
[20251230,"マネックスグループ",8698,"証券、商品先物取引業",1.5799999999999999E-4,"TOPIX Small 1","8698",{"$f":"IFERROR(_xlfn.IFS(F1429=$K$4,\"T500\",F1429=$K$5,\"T500\",F1429=$K$6,\"T500\"),\"\")","v":""}]
[20251230,"極東証券",8706,"証券、商品先物取引業",4.6999999999999997E-5,"TOPIX Small 1","8706",{"$f":"IFERROR(_xlfn.IFS(F1430=$K$4,\"T500\",F1430=$K$5,\"T500\",F1430=$K$6,\"T500\"),\"\")","v":""}]
[20251230,"岩井コスモホールディングス",8707,"証券、商品先物取引業",6.9999999999999994E-5,"TOPIX Small 1","8707",{"$f":"IFERROR(_xlfn.IFS(F1431=$K$4,\"T500\",F1431=$K$5,\"T500\",F1431=$K$6,\"T500\"),\"\")","v":""}]
[20251230,"アイザワ証券グループ",8708,"証券、商品先物取引業",3.0000000000000001E-5,"TOPIX Small 2","8708",{"$f":"IFERROR(_xlfn.IFS(F1432=$K$4,\"T500\",F1432=$K$5,\"T500\",F1432=$K$6,\"T500\"),\"\")","v":""}]
[20251230,"フィデアホールディングス",8713,"銀行業",4.0000000000000003E-5,"TOPIX Small 2","8713",{"$f":"IFERROR(_xlfn.IFS(F1433=$K$4,\"T500\",F1433=$K$5,\"T500\",F1433=$K$6,\"T500\"),\"\")","v":""}]
[20251230,"池田泉州ホールディングス",8714,"銀行業",2.24E-4,"TOPIX Small 1","8714",{"$f":"IFERROR(_xlfn.IFS(F1434=$K$4,\"T500\",F1434=$K$5,\"T500\",F1434=$K$6,\"T500\"),\"\")","v":""}]
[20251230,"アニコム　ホールディングス",8715,"保険業",6.3999999999999997E-5,"TOPIX Small 1","8715",{"$f":"IFERROR(_xlfn.IFS(F1435=$K$4,\"T500\",F1435=$K$5,\"T500\",F1435=$K$6,\"T500\"),\"\")","v":""}]
[20251230,"ＭＳ＆ＡＤインシュアランスグループホールディングス",8725,"保険業",4.6860000000000001E-3,"TOPIX Large70","8725",{"$f":"IFERROR(_xlfn.IFS(F1436=$K$4,\"T500\",F1436=$K$5,\"T500\",F1436=$K$6,\"T500\"),\"\")","v":"T500"}]
[20251230,"ソニーフィナンシャルグループ",8729,"保険業",1.1869999999999999E-3,"TOPIX Core30","8729",{"$f":"IFERROR(_xlfn.IFS(F1437=$K$4,\"T500\",F1437=$K$5,\"T500\",F1437=$K$6,\"T500\"),\"\")","v":"T500"}]
[20251230,"スパークス・グループ",8739,"証券、商品先物取引業",3.6000000000000001E-5,"TOPIX Small 2","8739",{"$f":"IFERROR(_xlfn.IFS(F1438=$K$4,\"T500\",F1438=$K$5,\"T500\",F1438=$K$6,\"T500\"),\"\")","v":""}]
[20251230,"第一生命ホールディングス",8750,"保険業",5.2339999999999999E-3,"TOPIX Large70","8750",{"$f":"IFERROR(_xlfn.IFS(F1439=$K$4,\"T500\",F1439=$K$5,\"T500\",F1439=$K$6,\"T500\"),\"\")","v":"T500"}]
[20251230,"東京海上ホールディングス",8766,"保険業",1.2207000000000001E-2,"TOPIX Core30","8766",{"$f":"IFERROR(_xlfn.IFS(F1440=$K$4,\"T500\",F1440=$K$5,\"T500\",F1440=$K$6,\"T500\"),\"\")","v":"T500"}]
[20251230,"イー・ギャランティ",8771,"その他金融業",6.0000000000000002E-5,"TOPIX Small 1","8771",{"$f":"IFERROR(_xlfn.IFS(F1441=$K$4,\"T500\",F1441=$K$5,\"T500\",F1441=$K$6,\"T500\"),\"\")","v":""}]
[20251230,"ＮＥＣキャピタルソリューション",8793,"その他金融業",4.0000000000000003E-5,"TOPIX Small 2","8793",{"$f":"IFERROR(_xlfn.IFS(F1442=$K$4,\"T500\",F1442=$K$5,\"T500\",F1442=$K$6,\"T500\"),\"\")","v":""}]
[20251230,"Ｔ＆Ｄホールディングス",8795,"保険業",1.8289999999999999E-3,"TOPIX Mid400","8795",{"$f":"IFERROR(_xlfn.IFS(F1443=$K$4,\"T500\",F1443=$K$5,\"T500\",F1443=$K$6,\"T500\"),\"\")","v":"T500"}]
[20251230,"アドバンスクリエイト",8798,"保険業",5.0000000000000004E-6,"TOPIX Small 2","8798",{"$f":"IFERROR(_xlfn.IFS(F1444=$K$4,\"T500\",F1444=$K$5,\"T500\",F1444=$K$6,\"T500\"),\"\")","v":""}]
[20251230,"三井不動産",8801,"不動産業",5.3749999999999996E-3,"TOPIX Large70","8801",{"$f":"IFERROR(_xlfn.IFS(F1445=$K$4,\"T500\",F1445=$K$5,\"T500\",F1445=$K$6,\"T500\"),\"\")","v":"T500"}]
[20251230,"三菱地所",8802,"不動産業",4.6860000000000001E-3,"TOPIX Large70","8802",{"$f":"IFERROR(_xlfn.IFS(F1446=$K$4,\"T500\",F1446=$K$5,\"T500\",F1446=$K$6,\"T500\"),\"\")","v":"T500"}]
[20251230,"平和不動産",8803,"不動産業",9.3999999999999994E-5,"TOPIX Small 1","8803",{"$f":"IFERROR(_xlfn.IFS(F1447=$K$4,\"T500\",F1447=$K$5,\"T500\",F1447=$K$6,\"T500\"),\"\")","v":""}]
[20251230,"東京建物",8804,"不動産業",6.8599999999999998E-4,"TOPIX Mid400","8804",{"$f":"IFERROR(_xlfn.IFS(F1448=$K$4,\"T500\",F1448=$K$5,\"T500\",F1448=$K$6,\"T500\"),\"\")","v":"T500"}]
[20251230,"京阪神ビルディング",8818,"不動産業",5.8E-5,"TOPIX Small 2","8818",{"$f":"IFERROR(_xlfn.IFS(F1449=$K$4,\"T500\",F1449=$K$5,\"T500\",F1449=$K$6,\"T500\"),\"\")","v":""}]
[20251230,"住友不動産",8830,"不動産業",2.2820000000000002E-3,"TOPIX Large70","8830",{"$f":"IFERROR(_xlfn.IFS(F1450=$K$4,\"T500\",F1450=$K$5,\"T500\",F1450=$K$6,\"T500\"),\"\")","v":"T500"}]
[20251230,"テーオーシー",8841,"不動産業",3.1000000000000001E-5,"TOPIX Small 2","8841",{"$f":"IFERROR(_xlfn.IFS(F1451=$K$4,\"T500\",F1451=$K$5,\"T500\",F1451=$K$6,\"T500\"),\"\")","v":""}]
[20251230,"レオパレス２１",8848,"不動産業",1.1900000000000001E-4,"TOPIX Small 1","8848",{"$f":"IFERROR(_xlfn.IFS(F1452=$K$4,\"T500\",F1452=$K$5,\"T500\",F1452=$K$6,\"T500\"),\"\")","v":""}]
[20251230,"スターツコーポレーション",8850,"不動産業",1.8000000000000001E-4,"TOPIX Small 1","8850",{"$f":"IFERROR(_xlfn.IFS(F1453=$K$4,\"T500\",F1453=$K$5,\"T500\",F1453=$K$6,\"T500\"),\"\")","v":""}]
[20251230,"フジ住宅",8860,"不動産業",2.0999999999999999E-5,"TOPIX Small 2","8860",{"$f":"IFERROR(_xlfn.IFS(F1454=$K$4,\"T500\",F1454=$K$5,\"T500\",F1454=$K$6,\"T500\"),\"\")","v":""}]
[20251230,"空港施設",8864,"不動産業",2.9E-5,"TOPIX Small 2","8864",{"$f":"IFERROR(_xlfn.IFS(F1455=$K$4,\"T500\",F1455=$K$5,\"T500\",F1455=$K$6,\"T500\"),\"\")","v":""}]
[20251230,"明和地所",8869,"不動産業",1.9000000000000001E-5,"TOPIX Small 2","8869",{"$f":"IFERROR(_xlfn.IFS(F1456=$K$4,\"T500\",F1456=$K$5,\"T500\",F1456=$K$6,\"T500\"),\"\")","v":""}]
[20251230,"ゴールドクレスト",8871,"不動産業",3.6999999999999998E-5,"TOPIX Small 1","8871",{"$f":"IFERROR(_xlfn.IFS(F1457=$K$4,\"T500\",F1457=$K$5,\"T500\",F1457=$K$6,\"T500\"),\"\")","v":""}]
[20251230,"リログループ",8876,"サービス業",1.63E-4,"TOPIX Mid400","8876",{"$f":"IFERROR(_xlfn.IFS(F1458=$K$4,\"T500\",F1458=$K$5,\"T500\",F1458=$K$6,\"T500\"),\"\")","v":"T500"}]
[20251230,"エスリード",8877,"不動産業",6.3999999999999997E-5,"TOPIX Small 2","8877",{"$f":"IFERROR(_xlfn.IFS(F1459=$K$4,\"T500\",F1459=$K$5,\"T500\",F1459=$K$6,\"T500\"),\"\")","v":""}]
[20251230,"日神グループホールディングス",8881,"不動産業",2.4000000000000001E-5,"TOPIX Small 2","8881",{"$f":"IFERROR(_xlfn.IFS(F1460=$K$4,\"T500\",F1460=$K$5,\"T500\",F1460=$K$6,\"T500\"),\"\")","v":""}]
[20251230,"エスコン",8892,"不動産業",5.3999999999999998E-5,"TOPIX Small 1","8892",{"$f":"IFERROR(_xlfn.IFS(F1461=$K$4,\"T500\",F1461=$K$5,\"T500\",F1461=$K$6,\"T500\"),\"\")","v":""}]
[20251230,"ＭＩＲＡＲＴＨホールディングス",8897,"不動産業",5.0000000000000002E-5,"TOPIX Small 1","8897",{"$f":"IFERROR(_xlfn.IFS(F1462=$K$4,\"T500\",F1462=$K$5,\"T500\",F1462=$K$6,\"T500\"),\"\")","v":""}]
[20251230,"ランド",8918,"不動産業",1.1E-5,"TOPIX Small 2","8918",{"$f":"IFERROR(_xlfn.IFS(F1463=$K$4,\"T500\",F1463=$K$5,\"T500\",F1463=$K$6,\"T500\"),\"\")","v":""}]
[20251230,"カチタス",8919,"不動産業",1.75E-4,"TOPIX Small 1","8919",{"$f":"IFERROR(_xlfn.IFS(F1464=$K$4,\"T500\",F1464=$K$5,\"T500\",F1464=$K$6,\"T500\"),\"\")","v":""}]
[20251230,"東祥",8920,"サービス業",1.4E-5,"TOPIX Small 2","8920",{"$f":"IFERROR(_xlfn.IFS(F1465=$K$4,\"T500\",F1465=$K$5,\"T500\",F1465=$K$6,\"T500\"),\"\")","v":""}]
[20251230,"トーセイ",8923,"不動産業",1.0399999999999999E-4,"TOPIX Small 1","8923",{"$f":"IFERROR(_xlfn.IFS(F1466=$K$4,\"T500\",F1466=$K$5,\"T500\",F1466=$K$6,\"T500\"),\"\")","v":""}]
[20251230,"サンフロンティア不動産",8934,"不動産業",7.2999999999999999E-5,"TOPIX Small 1","8934",{"$f":"IFERROR(_xlfn.IFS(F1467=$K$4,\"T500\",F1467=$K$5,\"T500\",F1467=$K$6,\"T500\"),\"\")","v":""}]
[20251230,"ＦＪネクストホールディングス",8935,"不動産業",2.6999999999999999E-5,"TOPIX Small 2","8935",{"$f":"IFERROR(_xlfn.IFS(F1468=$K$4,\"T500\",F1468=$K$5,\"T500\",F1468=$K$6,\"T500\"),\"\")","v":""}]
[20251230,"グランディハウス",8999,"不動産業",1.2E-5,"TOPIX Small 2","8999",{"$f":"IFERROR(_xlfn.IFS(F1469=$K$4,\"T500\",F1469=$K$5,\"T500\",F1469=$K$6,\"T500\"),\"\")","v":""}]
[20251230,"東武鉄道",9001,"陸運業",5.6499999999999996E-4,"TOPIX Mid400","9001",{"$f":"IFERROR(_xlfn.IFS(F1470=$K$4,\"T500\",F1470=$K$5,\"T500\",F1470=$K$6,\"T500\"),\"\")","v":"T500"}]
[20251230,"相鉄ホールディングス",9003,"陸運業",2.2499999999999999E-4,"TOPIX Mid400","9003",{"$f":"IFERROR(_xlfn.IFS(F1471=$K$4,\"T500\",F1471=$K$5,\"T500\",F1471=$K$6,\"T500\"),\"\")","v":"T500"}]
[20251230,"東急",9005,"陸運業",9.7499999999999996E-4,"TOPIX Mid400","9005",{"$f":"IFERROR(_xlfn.IFS(F1472=$K$4,\"T500\",F1472=$K$5,\"T500\",F1472=$K$6,\"T500\"),\"\")","v":"T500"}]
[20251230,"京浜急行電鉄",9006,"陸運業",3.6099999999999999E-4,"TOPIX Mid400","9006",{"$f":"IFERROR(_xlfn.IFS(F1473=$K$4,\"T500\",F1473=$K$5,\"T500\",F1473=$K$6,\"T500\"),\"\")","v":"T500"}]
[20251230,"小田急電鉄",9007,"陸運業",5.3700000000000004E-4,"TOPIX Mid400","9007",{"$f":"IFERROR(_xlfn.IFS(F1474=$K$4,\"T500\",F1474=$K$5,\"T500\",F1474=$K$6,\"T500\"),\"\")","v":"T500"}]
[20251230,"京王電鉄",9008,"陸運業",3.7599999999999998E-4,"TOPIX Mid400",{"$f":"TEXT(C1475,0)","v":"9008"},{"$f":"IFERROR(_xlfn.IFS(F1475=$K$4,\"T500\",F1475=$K$5,\"T500\",F1475=$K$6,\"T500\"),\"\")","v":"T500"}]
[20251230,"京成電鉄",9009,"陸運業",4.6500000000000003E-4,"TOPIX Mid400","9009",{"$f":"IFERROR(_xlfn.IFS(F1476=$K$4,\"T500\",F1476=$K$5,\"T500\",F1476=$K$6,\"T500\"),\"\")","v":"T500"}]
[20251230,"富士急行",9010,"陸運業",5.3000000000000001E-5,"TOPIX Small 1","9010",{"$f":"IFERROR(_xlfn.IFS(F1477=$K$4,\"T500\",F1477=$K$5,\"T500\",F1477=$K$6,\"T500\"),\"\")","v":""}]
[20251230,"東日本旅客鉄道",9020,"陸運業",4.7229999999999998E-3,"TOPIX Large70","9020",{"$f":"IFERROR(_xlfn.IFS(F1478=$K$4,\"T500\",F1478=$K$5,\"T500\",F1478=$K$6,\"T500\"),\"\")","v":"T500"}]
[20251230,"西日本旅客鉄道",9021,"陸運業",1.5449999999999999E-3,"TOPIX Large70","9021",{"$f":"IFERROR(_xlfn.IFS(F1479=$K$4,\"T500\",F1479=$K$5,\"T500\",F1479=$K$6,\"T500\"),\"\")","v":"T500"}]
[20251230,"東海旅客鉄道",9022,"陸運業",3.8080000000000002E-3,"TOPIX Large70","9022",{"$f":"IFERROR(_xlfn.IFS(F1480=$K$4,\"T500\",F1480=$K$5,\"T500\",F1480=$K$6,\"T500\"),\"\")","v":"T500"}]
[20251230,"東京地下鉄",9023,"陸運業",5.2599999999999999E-4,"TOPIX Mid400","9023",{"$f":"IFERROR(_xlfn.IFS(F1481=$K$4,\"T500\",F1481=$K$5,\"T500\",F1481=$K$6,\"T500\"),\"\")","v":"T500"}]
[20251230,"西武ホールディングス",9024,"陸運業",9.7099999999999997E-4,"TOPIX Mid400","9024",{"$f":"IFERROR(_xlfn.IFS(F1482=$K$4,\"T500\",F1482=$K$5,\"T500\",F1482=$K$6,\"T500\"),\"\")","v":"T500"}]
[20251230,"鴻池運輸",9025,"陸運業",1.16E-4,"TOPIX Small 1","9025",{"$f":"IFERROR(_xlfn.IFS(F1483=$K$4,\"T500\",F1483=$K$5,\"T500\",F1483=$K$6,\"T500\"),\"\")","v":""}]
[20251230,"西日本鉄道",9031,"陸運業",1.6799999999999999E-4,"TOPIX Mid400","9031",{"$f":"IFERROR(_xlfn.IFS(F1484=$K$4,\"T500\",F1484=$K$5,\"T500\",F1484=$K$6,\"T500\"),\"\")","v":"T500"}]
[20251230,"ハマキョウレックス",9037,"陸運業",1.15E-4,"TOPIX Small 1","9037",{"$f":"IFERROR(_xlfn.IFS(F1485=$K$4,\"T500\",F1485=$K$5,\"T500\",F1485=$K$6,\"T500\"),\"\")","v":""}]
[20251230,"サカイ引越センター",9039,"陸運業",7.4999999999999993E-5,"TOPIX Small 1","9039",{"$f":"IFERROR(_xlfn.IFS(F1486=$K$4,\"T500\",F1486=$K$5,\"T500\",F1486=$K$6,\"T500\"),\"\")","v":""}]
[20251230,"近鉄グループホールディングス",9041,"陸運業",6.8000000000000005E-4,"TOPIX Mid400","9041",{"$f":"IFERROR(_xlfn.IFS(F1487=$K$4,\"T500\",F1487=$K$5,\"T500\",F1487=$K$6,\"T500\"),\"\")","v":"T500"}]
[20251230,"阪急阪神ホールディングス",9042,"陸運業",1.0759999999999999E-3,"TOPIX Mid400","9042",{"$f":"IFERROR(_xlfn.IFS(F1488=$K$4,\"T500\",F1488=$K$5,\"T500\",F1488=$K$6,\"T500\"),\"\")","v":"T500"}]
[20251230,"南海電気鉄道",9044,"陸運業",2.9399999999999999E-4,"TOPIX Mid400","9044",{"$f":"IFERROR(_xlfn.IFS(F1489=$K$4,\"T500\",F1489=$K$5,\"T500\",F1489=$K$6,\"T500\"),\"\")","v":"T500"}]
[20251230,"京阪ホールディングス",9045,"陸運業",3.6400000000000001E-4,"TOPIX Mid400","9045",{"$f":"IFERROR(_xlfn.IFS(F1490=$K$4,\"T500\",F1490=$K$5,\"T500\",F1490=$K$6,\"T500\"),\"\")","v":"T500"}]
[20251230,"神戸電鉄",9046,"陸運業",1.4E-5,"TOPIX Small 2","9046",{"$f":"IFERROR(_xlfn.IFS(F1491=$K$4,\"T500\",F1491=$K$5,\"T500\",F1491=$K$6,\"T500\"),\"\")","v":""}]
[20251230,"名古屋鉄道",9048,"陸運業",3.8499999999999998E-4,"TOPIX Mid400","9048",{"$f":"IFERROR(_xlfn.IFS(F1492=$K$4,\"T500\",F1492=$K$5,\"T500\",F1492=$K$6,\"T500\"),\"\")","v":"T500"}]
[20251230,"山陽電気鉄道",9052,"陸運業",3.1999999999999999E-5,"TOPIX Small 2","9052",{"$f":"IFERROR(_xlfn.IFS(F1493=$K$4,\"T500\",F1493=$K$5,\"T500\",F1493=$K$6,\"T500\"),\"\")","v":""}]
[20251230,"ヤマトホールディングス",9064,"陸運業",5.5500000000000005E-4,"TOPIX Mid400","9064",{"$f":"IFERROR(_xlfn.IFS(F1494=$K$4,\"T500\",F1494=$K$5,\"T500\",F1494=$K$6,\"T500\"),\"\")","v":"T500"}]
[20251230,"山九",9065,"陸運業",4.0000000000000002E-4,"TOPIX Mid400","9065",{"$f":"IFERROR(_xlfn.IFS(F1495=$K$4,\"T500\",F1495=$K$5,\"T500\",F1495=$K$6,\"T500\"),\"\")","v":"T500"}]
[20251230,"丸全昭和運輸",9068,"陸運業",1.05E-4,"TOPIX Small 1","9068",{"$f":"IFERROR(_xlfn.IFS(F1496=$K$4,\"T500\",F1496=$K$5,\"T500\",F1496=$K$6,\"T500\"),\"\")","v":""}]
[20251230,"センコーグループホールディングス",9069,"陸運業",2.9300000000000002E-4,"TOPIX Mid400","9069",{"$f":"IFERROR(_xlfn.IFS(F1497=$K$4,\"T500\",F1497=$K$5,\"T500\",F1497=$K$6,\"T500\"),\"\")","v":"T500"}]
[20251230,"ニッコンホールディングス",9072,"陸運業",2.9999999999999997E-4,"TOPIX Mid400","9072",{"$f":"IFERROR(_xlfn.IFS(F1498=$K$4,\"T500\",F1498=$K$5,\"T500\",F1498=$K$6,\"T500\"),\"\")","v":"T500"}]
[20251230,"福山通運",9075,"陸運業",9.7999999999999997E-5,"TOPIX Small 1","9075",{"$f":"IFERROR(_xlfn.IFS(F1499=$K$4,\"T500\",F1499=$K$5,\"T500\",F1499=$K$6,\"T500\"),\"\")","v":""}]
[20251230,"セイノーホールディングス",9076,"陸運業",2.4000000000000001E-4,"TOPIX Mid400","9076",{"$f":"IFERROR(_xlfn.IFS(F1500=$K$4,\"T500\",F1500=$K$5,\"T500\",F1500=$K$6,\"T500\"),\"\")","v":"T500"}]
[20251230,"神奈川中央交通",9081,"陸運業",2.1999999999999999E-5,"TOPIX Small 2","9081",{"$f":"IFERROR(_xlfn.IFS(F1501=$K$4,\"T500\",F1501=$K$5,\"T500\",F1501=$K$6,\"T500\"),\"\")","v":""}]
[20251230,"ＡＺ－ＣＯＭ丸和ホールディングス",9090,"陸運業",6.3E-5,"TOPIX Small 1","9090",{"$f":"IFERROR(_xlfn.IFS(F1502=$K$4,\"T500\",F1502=$K$5,\"T500\",F1502=$K$6,\"T500\"),\"\")","v":""}]
[20251230,"日本郵船",9101,"海運業",2.2209999999999999E-3,"TOPIX Large70","9101",{"$f":"IFERROR(_xlfn.IFS(F1503=$K$4,\"T500\",F1503=$K$5,\"T500\",F1503=$K$6,\"T500\"),\"\")","v":"T500"}]
[20251230,"商船三井",9104,"海運業",1.854E-3,"TOPIX Large70","9104",{"$f":"IFERROR(_xlfn.IFS(F1504=$K$4,\"T500\",F1504=$K$5,\"T500\",F1504=$K$6,\"T500\"),\"\")","v":"T500"}]
[20251230,"川崎汽船",9107,"海運業",9.7199999999999999E-4,"TOPIX Mid400","9107",{"$f":"IFERROR(_xlfn.IFS(F1505=$K$4,\"T500\",F1505=$K$5,\"T500\",F1505=$K$6,\"T500\"),\"\")","v":"T500"}]
[20251230,"ＮＳユナイテッド海運",9110,"海運業",7.8999999999999996E-5,"TOPIX Small 1","9110",{"$f":"IFERROR(_xlfn.IFS(F1506=$K$4,\"T500\",F1506=$K$5,\"T500\",F1506=$K$6,\"T500\"),\"\")","v":""}]
[20251230,"飯野海運",9119,"海運業",1.08E-4,"TOPIX Small 1","9119",{"$f":"IFERROR(_xlfn.IFS(F1507=$K$4,\"T500\",F1507=$K$5,\"T500\",F1507=$K$6,\"T500\"),\"\")","v":""}]
[20251230,"九州旅客鉄道",9142,"陸運業",6.3500000000000004E-4,"TOPIX Mid400","9142",{"$f":"IFERROR(_xlfn.IFS(F1508=$K$4,\"T500\",F1508=$K$5,\"T500\",F1508=$K$6,\"T500\"),\"\")","v":"T500"}]
[20251230,"ＳＧホールディングス",9143,"陸運業",4.9799999999999996E-4,"TOPIX Mid400","9143",{"$f":"IFERROR(_xlfn.IFS(F1509=$K$4,\"T500\",F1509=$K$5,\"T500\",F1509=$K$6,\"T500\"),\"\")","v":"T500"}]
[20251230,"ＮＩＰＰＯＮ　ＥＸＰＲＥＳＳホールディングス",9147,"陸運業",6.9399999999999996E-4,"TOPIX Mid400","9147",{"$f":"IFERROR(_xlfn.IFS(F1510=$K$4,\"T500\",F1510=$K$5,\"T500\",F1510=$K$6,\"T500\"),\"\")","v":"T500"}]
[20251230,"日本航空",9201,"空運業",1.3780000000000001E-3,"TOPIX Mid400","9201",{"$f":"IFERROR(_xlfn.IFS(F1511=$K$4,\"T500\",F1511=$K$5,\"T500\",F1511=$K$6,\"T500\"),\"\")","v":"T500"}]
[20251230,"ＡＮＡホールディングス",9202,"空運業",1.6770000000000001E-3,"TOPIX Large70","9202",{"$f":"IFERROR(_xlfn.IFS(F1512=$K$4,\"T500\",F1512=$K$5,\"T500\",F1512=$K$6,\"T500\"),\"\")","v":"T500"}]
[20251230,"ビーウィズ",9216,"サービス業",9.0000000000000002E-6,"TOPIX Small 2","9216",{"$f":"IFERROR(_xlfn.IFS(F1513=$K$4,\"T500\",F1513=$K$5,\"T500\",F1513=$K$6,\"T500\"),\"\")","v":""}]
[20251230,"サンウェルズ",9229,"サービス業",6.0000000000000002E-6,"TOPIX Small 2","9229",{"$f":"IFERROR(_xlfn.IFS(F1514=$K$4,\"T500\",F1514=$K$5,\"T500\",F1514=$K$6,\"T500\"),\"\")","v":""}]
[20251230,"ＴＲＥホールディングス",9247,"サービス業",7.8999999999999996E-5,"TOPIX Small 1","9247",{"$f":"IFERROR(_xlfn.IFS(F1515=$K$4,\"T500\",F1515=$K$5,\"T500\",F1515=$K$6,\"T500\"),\"\")","v":""}]
[20251230,"人・夢・技術グループ",9248,"サービス業",1.4E-5,"TOPIX Small 2","9248",{"$f":"IFERROR(_xlfn.IFS(F1516=$K$4,\"T500\",F1516=$K$5,\"T500\",F1516=$K$6,\"T500\"),\"\")","v":""}]
[20251230,"シルバーライフ",9262,"小売業",5.0000000000000004E-6,"TOPIX Small 2","9262",{"$f":"IFERROR(_xlfn.IFS(F1517=$K$4,\"T500\",F1517=$K$5,\"T500\",F1517=$K$6,\"T500\"),\"\")","v":""}]
[20251230,"Ｇｅｎｋｙ　ＤｒｕｇＳｔｏｒｅｓ",9267,"小売業",9.5000000000000005E-5,"TOPIX Small 1","9267",{"$f":"IFERROR(_xlfn.IFS(F1518=$K$4,\"T500\",F1518=$K$5,\"T500\",F1518=$K$6,\"T500\"),\"\")","v":""}]
[20251230,"コーア商事ホールディングス",9273,"卸売業",1.7E-5,"TOPIX Small 2","9273",{"$f":"IFERROR(_xlfn.IFS(F1519=$K$4,\"T500\",F1519=$K$5,\"T500\",F1519=$K$6,\"T500\"),\"\")","v":""}]
[20251230,"ＫＰＰグループホールディングス",9274,"卸売業",4.6999999999999997E-5,"TOPIX Small 1","9274",{"$f":"IFERROR(_xlfn.IFS(F1520=$K$4,\"T500\",F1520=$K$5,\"T500\",F1520=$K$6,\"T500\"),\"\")","v":""}]
[20251230,"ブックオフグループホールディングス",9278,"小売業",2.3E-5,"TOPIX Small 2","9278",{"$f":"IFERROR(_xlfn.IFS(F1521=$K$4,\"T500\",F1521=$K$5,\"T500\",F1521=$K$6,\"T500\"),\"\")","v":""}]
[20251230,"ギフトホールディングス",9279,"小売業",4.1999999999999998E-5,"TOPIX Small 2","9279",{"$f":"IFERROR(_xlfn.IFS(F1522=$K$4,\"T500\",F1522=$K$5,\"T500\",F1522=$K$6,\"T500\"),\"\")","v":""}]
[20251230,"三菱倉庫",9301,"倉庫・運輸関連業",2.81E-4,"TOPIX Mid400","9301",{"$f":"IFERROR(_xlfn.IFS(F1523=$K$4,\"T500\",F1523=$K$5,\"T500\",F1523=$K$6,\"T500\"),\"\")","v":"T500"}]
[20251230,"三井倉庫ホールディングス",9302,"倉庫・運輸関連業",2.3800000000000001E-4,"TOPIX Mid400","9302",{"$f":"IFERROR(_xlfn.IFS(F1524=$K$4,\"T500\",F1524=$K$5,\"T500\",F1524=$K$6,\"T500\"),\"\")","v":"T500"}]
[20251230,"住友倉庫",9303,"倉庫・運輸関連業",2.14E-4,"TOPIX Small 1","9303",{"$f":"IFERROR(_xlfn.IFS(F1525=$K$4,\"T500\",F1525=$K$5,\"T500\",F1525=$K$6,\"T500\"),\"\")","v":""}]
[20251230,"澁澤倉庫",9304,"倉庫・運輸関連業",4.1999999999999998E-5,"TOPIX Small 2","9304",{"$f":"IFERROR(_xlfn.IFS(F1526=$K$4,\"T500\",F1526=$K$5,\"T500\",F1526=$K$6,\"T500\"),\"\")","v":""}]
[20251230,"ヤマタネ",9305,"卸売業",4.1E-5,"TOPIX Small 2","9305",{"$f":"IFERROR(_xlfn.IFS(F1527=$K$4,\"T500\",F1527=$K$5,\"T500\",F1527=$K$6,\"T500\"),\"\")","v":""}]
[20251230,"乾汽船",9308,"海運業",3.6000000000000001E-5,"TOPIX Small 2","9308",{"$f":"IFERROR(_xlfn.IFS(F1528=$K$4,\"T500\",F1528=$K$5,\"T500\",F1528=$K$6,\"T500\"),\"\")","v":""}]
[20251230,"日本トランスシティ",9310,"倉庫・運輸関連業",5.8999999999999998E-5,"TOPIX Small 2","9310",{"$f":"IFERROR(_xlfn.IFS(F1529=$K$4,\"T500\",F1529=$K$5,\"T500\",F1529=$K$6,\"T500\"),\"\")","v":""}]
[20251230,"中央倉庫",9319,"倉庫・運輸関連業",1.5999999999999999E-5,"TOPIX Small 2","9319",{"$f":"IFERROR(_xlfn.IFS(F1530=$K$4,\"T500\",F1530=$K$5,\"T500\",F1530=$K$6,\"T500\"),\"\")","v":""}]
[20251230,"安田倉庫",9324,"倉庫・運輸関連業",3.1000000000000001E-5,"TOPIX Small 2","9324",{"$f":"IFERROR(_xlfn.IFS(F1531=$K$4,\"T500\",F1531=$K$5,\"T500\",F1531=$K$6,\"T500\"),\"\")","v":""}]
[20251230,"ＮＩＳＳＯホールディングス",9332,"サービス業",1.2999999999999999E-5,"TOPIX Small 2","9332",{"$f":"IFERROR(_xlfn.IFS(F1532=$K$4,\"T500\",F1532=$K$5,\"T500\",F1532=$K$6,\"T500\"),\"\")","v":""}]
[20251230,"大栄環境",9336,"サービス業",1.8000000000000001E-4,"TOPIX Small 1","9336",{"$f":"IFERROR(_xlfn.IFS(F1533=$K$4,\"T500\",F1533=$K$5,\"T500\",F1533=$K$6,\"T500\"),\"\")","v":""}]
[20251230,"ＧＥＮＯＶＡ",9341,"サービス業",6.9999999999999999E-6,"TOPIX Small 2","9341",{"$f":"IFERROR(_xlfn.IFS(F1534=$K$4,\"T500\",F1534=$K$5,\"T500\",F1534=$K$6,\"T500\"),\"\")","v":""}]
[20251230,"日本管財ホールディングス",9347,"サービス業",6.2000000000000003E-5,"TOPIX Small 2","9347",{"$f":"IFERROR(_xlfn.IFS(F1535=$K$4,\"T500\",F1535=$K$5,\"T500\",F1535=$K$6,\"T500\"),\"\")","v":""}]
[20251230,"上組",9364,"倉庫・運輸関連業",4.6000000000000001E-4,"TOPIX Mid400","9364",{"$f":"IFERROR(_xlfn.IFS(F1536=$K$4,\"T500\",F1536=$K$5,\"T500\",F1536=$K$6,\"T500\"),\"\")","v":"T500"}]
[20251230,"キユーソー流通システム",9369,"倉庫・運輸関連業",3.4E-5,"TOPIX Small 2","9369",{"$f":"IFERROR(_xlfn.IFS(F1537=$K$4,\"T500\",F1537=$K$5,\"T500\",F1537=$K$6,\"T500\"),\"\")","v":""}]
[20251230,"エーアイテイー",9381,"倉庫・運輸関連業",2.8E-5,"TOPIX Small 2","9381",{"$f":"IFERROR(_xlfn.IFS(F1538=$K$4,\"T500\",F1538=$K$5,\"T500\",F1538=$K$6,\"T500\"),\"\")","v":""}]
[20251230,"ＴＢＳホールディングス",9401,"情報・通信業",5.9299999999999999E-4,"TOPIX Mid400",{"$f":"TEXT(C1539,0)","v":"9401"},{"$f":"IFERROR(_xlfn.IFS(F1539=$K$4,\"T500\",F1539=$K$5,\"T500\",F1539=$K$6,\"T500\"),\"\")","v":"T500"}]
[20251230,"日本テレビホールディングス",9404,"情報・通信業",6.9999999999999999E-4,"TOPIX Mid400","9404",{"$f":"IFERROR(_xlfn.IFS(F1540=$K$4,\"T500\",F1540=$K$5,\"T500\",F1540=$K$6,\"T500\"),\"\")","v":"T500"}]
[20251230,"朝日放送グループホールディングス",9405,"情報・通信業",2.1999999999999999E-5,"TOPIX Small 2","9405",{"$f":"IFERROR(_xlfn.IFS(F1541=$K$4,\"T500\",F1541=$K$5,\"T500\",F1541=$K$6,\"T500\"),\"\")","v":""}]
[20251230,"テレビ朝日ホールディングス",9409,"情報・通信業",1.6799999999999999E-4,"TOPIX Small 1","9409",{"$f":"IFERROR(_xlfn.IFS(F1542=$K$4,\"T500\",F1542=$K$5,\"T500\",F1542=$K$6,\"T500\"),\"\")","v":""}]
[20251230,"スカパーＪＳＡＴホールディングス",9412,"情報・通信業",2.7599999999999999E-4,"TOPIX Small 1","9412",{"$f":"IFERROR(_xlfn.IFS(F1543=$K$4,\"T500\",F1543=$K$5,\"T500\",F1543=$K$6,\"T500\"),\"\")","v":""}]
[20251230,"テレビ東京ホールディングス",9413,"情報・通信業",5.8999999999999998E-5,"TOPIX Small 1","9413",{"$f":"IFERROR(_xlfn.IFS(F1544=$K$4,\"T500\",F1544=$K$5,\"T500\",F1544=$K$6,\"T500\"),\"\")","v":""}]
[20251230,"ビジョン",9416,"情報・通信業",5.5999999999999999E-5,"TOPIX Small 1","9416",{"$f":"IFERROR(_xlfn.IFS(F1545=$K$4,\"T500\",F1545=$K$5,\"T500\",F1545=$K$6,\"T500\"),\"\")","v":""}]
[20251230,"Ｕ－ＮＥＸＴ　ＨＯＬＤＩＮＧＳ",9418,"情報・通信業",1.3999999999999999E-4,"TOPIX Small 1","9418",{"$f":"IFERROR(_xlfn.IFS(F1546=$K$4,\"T500\",F1546=$K$5,\"T500\",F1546=$K$6,\"T500\"),\"\")","v":""}]
[20251230,"日本通信",9424,"情報・通信業",2.5000000000000001E-5,"TOPIX Small 2","9424",{"$f":"IFERROR(_xlfn.IFS(F1547=$K$4,\"T500\",F1547=$K$5,\"T500\",F1547=$K$6,\"T500\"),\"\")","v":""}]
[20251230,"ＮＴＴ",9432,"情報・通信業",8.9999999999999993E-3,"TOPIX Core30","9432",{"$f":"IFERROR(_xlfn.IFS(F1548=$K$4,\"T500\",F1548=$K$5,\"T500\",F1548=$K$6,\"T500\"),\"\")","v":"T500"}]
[20251230,"ＫＤＤＩ",9433,"情報・通信業",7.9120000000000006E-3,"TOPIX Core30","9433",{"$f":"IFERROR(_xlfn.IFS(F1549=$K$4,\"T500\",F1549=$K$5,\"T500\",F1549=$K$6,\"T500\"),\"\")","v":"T500"}]
[20251230,"ソフトバンク",9434,"情報・通信業",7.1809999999999999E-3,"TOPIX Core30","9434",{"$f":"IFERROR(_xlfn.IFS(F1550=$K$4,\"T500\",F1550=$K$5,\"T500\",F1550=$K$6,\"T500\"),\"\")","v":"T500"}]
[20251230,"光通信",9435,"情報・通信業",9.01E-4,"TOPIX Mid400","9435",{"$f":"IFERROR(_xlfn.IFS(F1551=$K$4,\"T500\",F1551=$K$5,\"T500\",F1551=$K$6,\"T500\"),\"\")","v":"T500"}]
[20251230,"エムティーアイ",9438,"情報・通信業",1.0000000000000001E-5,"TOPIX Small 2","9438",{"$f":"IFERROR(_xlfn.IFS(F1552=$K$4,\"T500\",F1552=$K$5,\"T500\",F1552=$K$6,\"T500\"),\"\")","v":""}]
[20251230,"ＧＭＯインターネットグループ",9449,"情報・通信業",2.63E-4,"TOPIX Mid400","9449",{"$f":"IFERROR(_xlfn.IFS(F1553=$K$4,\"T500\",F1553=$K$5,\"T500\",F1553=$K$6,\"T500\"),\"\")","v":"T500"}]
[20251230,"ファイバーゲート",9450,"情報・通信業",5.0000000000000004E-6,"TOPIX Small 2","9450",{"$f":"IFERROR(_xlfn.IFS(F1554=$K$4,\"T500\",F1554=$K$5,\"T500\",F1554=$K$6,\"T500\"),\"\")","v":""}]
[20251230,"ＫＡＤＯＫＡＷＡ",9468,"情報・通信業",3.6699999999999998E-4,"TOPIX Mid400","9468",{"$f":"IFERROR(_xlfn.IFS(F1555=$K$4,\"T500\",F1555=$K$5,\"T500\",F1555=$K$6,\"T500\"),\"\")","v":"T500"}]
[20251230,"学研ホールディングス",9470,"情報・通信業",4.3000000000000002E-5,"TOPIX Small 2","9470",{"$f":"IFERROR(_xlfn.IFS(F1556=$K$4,\"T500\",F1556=$K$5,\"T500\",F1556=$K$6,\"T500\"),\"\")","v":""}]
[20251230,"ゼンリン",9474,"情報・通信業",3.3000000000000003E-5,"TOPIX Small 2","9474",{"$f":"IFERROR(_xlfn.IFS(F1557=$K$4,\"T500\",F1557=$K$5,\"T500\",F1557=$K$6,\"T500\"),\"\")","v":""}]
[20251230,"東京電力ホールディングス",9501,"電気・ガス業",1.2279999999999999E-3,"TOPIX Mid400","9501",{"$f":"IFERROR(_xlfn.IFS(F1558=$K$4,\"T500\",F1558=$K$5,\"T500\",F1558=$K$6,\"T500\"),\"\")","v":"T500"}]
[20251230,"中部電力",9502,"電気・ガス業",1.8420000000000001E-3,"TOPIX Mid400","9502",{"$f":"IFERROR(_xlfn.IFS(F1559=$K$4,\"T500\",F1559=$K$5,\"T500\",F1559=$K$6,\"T500\"),\"\")","v":"T500"}]
[20251230,"関西電力",9503,"電気・ガス業",2.758E-3,"TOPIX Mid400","9503",{"$f":"IFERROR(_xlfn.IFS(F1560=$K$4,\"T500\",F1560=$K$5,\"T500\",F1560=$K$6,\"T500\"),\"\")","v":"T500"}]
[20251230,"中国電力",9504,"電気・ガス業",3.5799999999999997E-4,"TOPIX Mid400","9504",{"$f":"IFERROR(_xlfn.IFS(F1561=$K$4,\"T500\",F1561=$K$5,\"T500\",F1561=$K$6,\"T500\"),\"\")","v":"T500"}]
[20251230,"北陸電力",9505,"電気・ガス業",2.0699999999999999E-4,"TOPIX Mid400","9505",{"$f":"IFERROR(_xlfn.IFS(F1562=$K$4,\"T500\",F1562=$K$5,\"T500\",F1562=$K$6,\"T500\"),\"\")","v":"T500"}]
[20251230,"東北電力",9506,"電気・ガス業",6.29E-4,"TOPIX Mid400","9506",{"$f":"IFERROR(_xlfn.IFS(F1563=$K$4,\"T500\",F1563=$K$5,\"T500\",F1563=$K$6,\"T500\"),\"\")","v":"T500"}]
[20251230,"四国電力",9507,"電気・ガス業",2.99E-4,"TOPIX Mid400","9507",{"$f":"IFERROR(_xlfn.IFS(F1564=$K$4,\"T500\",F1564=$K$5,\"T500\",F1564=$K$6,\"T500\"),\"\")","v":"T500"}]
[20251230,"九州電力",9508,"電気・ガス業",8.0199999999999998E-4,"TOPIX Mid400","9508",{"$f":"IFERROR(_xlfn.IFS(F1565=$K$4,\"T500\",F1565=$K$5,\"T500\",F1565=$K$6,\"T500\"),\"\")","v":"T500"}]
[20251230,"北海道電力",9509,"電気・ガス業",2.4600000000000002E-4,"TOPIX Mid400","9509",{"$f":"IFERROR(_xlfn.IFS(F1566=$K$4,\"T500\",F1566=$K$5,\"T500\",F1566=$K$6,\"T500\"),\"\")","v":"T500"}]
[20251230,"沖縄電力",9511,"電気・ガス業",5.8999999999999998E-5,"TOPIX Small 1","9511",{"$f":"IFERROR(_xlfn.IFS(F1567=$K$4,\"T500\",F1567=$K$5,\"T500\",F1567=$K$6,\"T500\"),\"\")","v":""}]
[20251230,"電源開発",9513,"電気・ガス業",4.9399999999999997E-4,"TOPIX Mid400","9513",{"$f":"IFERROR(_xlfn.IFS(F1568=$K$4,\"T500\",F1568=$K$5,\"T500\",F1568=$K$6,\"T500\"),\"\")","v":"T500"}]
[20251230,"エフオン",9514,"電気・ガス業",5.0000000000000004E-6,"TOPIX Small 2","9514",{"$f":"IFERROR(_xlfn.IFS(F1569=$K$4,\"T500\",F1569=$K$5,\"T500\",F1569=$K$6,\"T500\"),\"\")","v":""}]
[20251230,"イーレックス",9517,"電気・ガス業",2.5999999999999998E-5,"TOPIX Small 2","9517",{"$f":"IFERROR(_xlfn.IFS(F1570=$K$4,\"T500\",F1570=$K$5,\"T500\",F1570=$K$6,\"T500\"),\"\")","v":""}]
[20251230,"レノバ",9519,"電気・ガス業",3.8999999999999999E-5,"TOPIX Small 1","9519",{"$f":"IFERROR(_xlfn.IFS(F1571=$K$4,\"T500\",F1571=$K$5,\"T500\",F1571=$K$6,\"T500\"),\"\")","v":""}]
[20251230,"東京瓦斯",9531,"電気・ガス業",2.32E-3,"TOPIX Mid400","9531",{"$f":"IFERROR(_xlfn.IFS(F1572=$K$4,\"T500\",F1572=$K$5,\"T500\",F1572=$K$6,\"T500\"),\"\")","v":"T500"}]
[20251230,"大阪瓦斯",9532,"電気・ガス業",2.0089999999999999E-3,"TOPIX Mid400","9532",{"$f":"IFERROR(_xlfn.IFS(F1573=$K$4,\"T500\",F1573=$K$5,\"T500\",F1573=$K$6,\"T500\"),\"\")","v":"T500"}]
[20251230,"東邦瓦斯",9533,"電気・ガス業",3.5500000000000001E-4,"TOPIX Mid400","9533",{"$f":"IFERROR(_xlfn.IFS(F1574=$K$4,\"T500\",F1574=$K$5,\"T500\",F1574=$K$6,\"T500\"),\"\")","v":"T500"}]
[20251230,"北海道瓦斯",9534,"電気・ガス業",4.6999999999999997E-5,"TOPIX Small 2","9534",{"$f":"IFERROR(_xlfn.IFS(F1575=$K$4,\"T500\",F1575=$K$5,\"T500\",F1575=$K$6,\"T500\"),\"\")","v":""}]
[20251230,"広島ガス",9535,"電気・ガス業",1.7E-5,"TOPIX Small 2","9535",{"$f":"IFERROR(_xlfn.IFS(F1576=$K$4,\"T500\",F1576=$K$5,\"T500\",F1576=$K$6,\"T500\"),\"\")","v":""}]
[20251230,"西部ガスホールディングス",9536,"電気・ガス業",5.3999999999999998E-5,"TOPIX Small 2","9536",{"$f":"IFERROR(_xlfn.IFS(F1577=$K$4,\"T500\",F1577=$K$5,\"T500\",F1577=$K$6,\"T500\"),\"\")","v":""}]
[20251230,"静岡ガス",9543,"電気・ガス業",5.7000000000000003E-5,"TOPIX Small 1","9543",{"$f":"IFERROR(_xlfn.IFS(F1578=$K$4,\"T500\",F1578=$K$5,\"T500\",F1578=$K$6,\"T500\"),\"\")","v":""}]
[20251230,"メタウォーター",9551,"電気・ガス業",9.2E-5,"TOPIX Small 1","9551",{"$f":"IFERROR(_xlfn.IFS(F1579=$K$4,\"T500\",F1579=$K$5,\"T500\",F1579=$K$6,\"T500\"),\"\")","v":""}]
[20251230,"Ｍ＆Ａ総研ホールディングス",9552,"サービス業",2.8E-5,"TOPIX Small 1","9552",{"$f":"IFERROR(_xlfn.IFS(F1580=$K$4,\"T500\",F1580=$K$5,\"T500\",F1580=$K$6,\"T500\"),\"\")","v":""}]
[20251230,"アイネット",9600,"情報・通信業",9.0000000000000002E-6,"TOPIX Small 2","9600",{"$f":"IFERROR(_xlfn.IFS(F1581=$K$4,\"T500\",F1581=$K$5,\"T500\",F1581=$K$6,\"T500\"),\"\")","v":""}]
[20251230,"松竹",9601,"情報・通信業",1.4100000000000001E-4,"TOPIX Small 1","9601",{"$f":"IFERROR(_xlfn.IFS(F1582=$K$4,\"T500\",F1582=$K$5,\"T500\",F1582=$K$6,\"T500\"),\"\")","v":""}]
[20251230,"東宝",9602,"情報・通信業",8.7100000000000003E-4,"TOPIX Mid400","9602",{"$f":"IFERROR(_xlfn.IFS(F1583=$K$4,\"T500\",F1583=$K$5,\"T500\",F1583=$K$6,\"T500\"),\"\")","v":"T500"}]
[20251230,"エイチ・アイ・エス",9603,"サービス業",8.2000000000000001E-5,"TOPIX Small 1","9603",{"$f":"IFERROR(_xlfn.IFS(F1584=$K$4,\"T500\",F1584=$K$5,\"T500\",F1584=$K$6,\"T500\"),\"\")","v":""}]
[20251230,"東映",9605,"情報・通信業",1.8699999999999999E-4,"TOPIX Small 1","9605",{"$f":"IFERROR(_xlfn.IFS(F1585=$K$4,\"T500\",F1585=$K$5,\"T500\",F1585=$K$6,\"T500\"),\"\")","v":""}]
[20251230,"ラックランド",9612,"サービス業",1.9000000000000001E-5,"TOPIX Small 2","9612",{"$f":"IFERROR(_xlfn.IFS(F1586=$K$4,\"T500\",F1586=$K$5,\"T500\",F1586=$K$6,\"T500\"),\"\")","v":""}]
[20251230,"共立メンテナンス",9616,"サービス業",2.2599999999999999E-4,"TOPIX Mid400","9616",{"$f":"IFERROR(_xlfn.IFS(F1587=$K$4,\"T500\",F1587=$K$5,\"T500\",F1587=$K$6,\"T500\"),\"\")","v":"T500"}]
[20251230,"イチネンホールディングス",9619,"サービス業",4.3000000000000002E-5,"TOPIX Small 2","9619",{"$f":"IFERROR(_xlfn.IFS(F1588=$K$4,\"T500\",F1588=$K$5,\"T500\",F1588=$K$6,\"T500\"),\"\")","v":""}]
[20251230,"建設技術研究所",9621,"サービス業",6.4999999999999994E-5,"TOPIX Small 1","9621",{"$f":"IFERROR(_xlfn.IFS(F1589=$K$4,\"T500\",F1589=$K$5,\"T500\",F1589=$K$6,\"T500\"),\"\")","v":""}]
[20251230,"スペース",9622,"サービス業",2.4000000000000001E-5,"TOPIX Small 2","9622",{"$f":"IFERROR(_xlfn.IFS(F1590=$K$4,\"T500\",F1590=$K$5,\"T500\",F1590=$K$6,\"T500\"),\"\")","v":""}]
[20251230,"アインホールディングス",9627,"小売業",1.47E-4,"TOPIX Mid400","9627",{"$f":"IFERROR(_xlfn.IFS(F1591=$K$4,\"T500\",F1591=$K$5,\"T500\",F1591=$K$6,\"T500\"),\"\")","v":"T500"}]
[20251230,"燦ホールディングス",9628,"サービス業",2.6999999999999999E-5,"TOPIX Small 2","9628",{"$f":"IFERROR(_xlfn.IFS(F1592=$K$4,\"T500\",F1592=$K$5,\"T500\",F1592=$K$6,\"T500\"),\"\")","v":""}]
[20251230,"ピー・シー・エー",9629,"情報・通信業",2.5999999999999998E-5,"TOPIX Small 2","9629",{"$f":"IFERROR(_xlfn.IFS(F1593=$K$4,\"T500\",F1593=$K$5,\"T500\",F1593=$K$6,\"T500\"),\"\")","v":""}]
[20251230,"スバル興業",9632,"サービス業",2.3E-5,"TOPIX Small 2","9632",{"$f":"IFERROR(_xlfn.IFS(F1594=$K$4,\"T500\",F1594=$K$5,\"T500\",F1594=$K$6,\"T500\"),\"\")","v":""}]
[20251230,"タナベコンサルティンググループ",9644,"サービス業",1.2999999999999999E-5,"TOPIX Small 2","9644",{"$f":"IFERROR(_xlfn.IFS(F1595=$K$4,\"T500\",F1595=$K$5,\"T500\",F1595=$K$6,\"T500\"),\"\")","v":""}]
[20251230,"ビジネスブレイン太田昭和",9658,"情報・通信業",2.5999999999999998E-5,"TOPIX Small 2","9658",{"$f":"IFERROR(_xlfn.IFS(F1596=$K$4,\"T500\",F1596=$K$5,\"T500\",F1596=$K$6,\"T500\"),\"\")","v":""}]
[20251230,"ナガワ",9663,"サービス業",3.6999999999999998E-5,"TOPIX Small 2","9663",{"$f":"IFERROR(_xlfn.IFS(F1597=$K$4,\"T500\",F1597=$K$5,\"T500\",F1597=$K$6,\"T500\"),\"\")","v":""}]
[20251230,"東京都競馬",9672,"サービス業",8.8999999999999995E-5,"TOPIX Small 1","9672",{"$f":"IFERROR(_xlfn.IFS(F1598=$K$4,\"T500\",F1598=$K$5,\"T500\",F1598=$K$6,\"T500\"),\"\")","v":""}]
[20251230,"カナモト",9678,"サービス業",1.18E-4,"TOPIX Small 1","9678",{"$f":"IFERROR(_xlfn.IFS(F1599=$K$4,\"T500\",F1599=$K$5,\"T500\",F1599=$K$6,\"T500\"),\"\")","v":""}]
[20251230,"ＤＴＳ",9682,"情報・通信業",2.03E-4,"TOPIX Small 1","9682",{"$f":"IFERROR(_xlfn.IFS(F1600=$K$4,\"T500\",F1600=$K$5,\"T500\",F1600=$K$6,\"T500\"),\"\")","v":""}]
[20251230,"スクウェア・エニックス・ホールディングス",9684,"情報・通信業",9.7799999999999992E-4,"TOPIX Mid400","9684",{"$f":"IFERROR(_xlfn.IFS(F1601=$K$4,\"T500\",F1601=$K$5,\"T500\",F1601=$K$6,\"T500\"),\"\")","v":"T500"}]
[20251230,"シーイーシー",9692,"情報・通信業",6.0999999999999999E-5,"TOPIX Small 1","9692",{"$f":"IFERROR(_xlfn.IFS(F1602=$K$4,\"T500\",F1602=$K$5,\"T500\",F1602=$K$6,\"T500\"),\"\")","v":""}]
[20251230,"カプコン",9697,"情報・通信業",1.508E-3,"TOPIX Mid400",{"$f":"TEXT(C1603,0)","v":"9697"},{"$f":"IFERROR(_xlfn.IFS(F1603=$K$4,\"T500\",F1603=$K$5,\"T500\",F1603=$K$6,\"T500\"),\"\")","v":"T500"}]
[20251230,"ニシオホールディングス",9699,"サービス業",8.2999999999999998E-5,"TOPIX Small 1","9699",{"$f":"IFERROR(_xlfn.IFS(F1604=$K$4,\"T500\",F1604=$K$5,\"T500\",F1604=$K$6,\"T500\"),\"\")","v":""}]
[20251230,"アイ・エス・ビー",9702,"情報・通信業",1.7E-5,"TOPIX Small 2","9702",{"$f":"IFERROR(_xlfn.IFS(F1605=$K$4,\"T500\",F1605=$K$5,\"T500\",F1605=$K$6,\"T500\"),\"\")","v":""}]
[20251230,"日本空港ビルデング",9706,"不動産業",3.1700000000000001E-4,"TOPIX Mid400","9706",{"$f":"IFERROR(_xlfn.IFS(F1606=$K$4,\"T500\",F1606=$K$5,\"T500\",F1606=$K$6,\"T500\"),\"\")","v":"T500"}]
[20251230,"トランス・コスモス",9715,"サービス業",1.06E-4,"TOPIX Small 1","9715",{"$f":"IFERROR(_xlfn.IFS(F1607=$K$4,\"T500\",F1607=$K$5,\"T500\",F1607=$K$6,\"T500\"),\"\")","v":""}]
[20251230,"乃村工藝社",9716,"サービス業",1.2300000000000001E-4,"TOPIX Small 1","9716",{"$f":"IFERROR(_xlfn.IFS(F1608=$K$4,\"T500\",F1608=$K$5,\"T500\",F1608=$K$6,\"T500\"),\"\")","v":""}]
[20251230,"ＳＣＳＫ",9719,"情報・通信業",4.1199999999999999E-4,"TOPIX Mid400","9719",{"$f":"IFERROR(_xlfn.IFS(F1609=$K$4,\"T500\",F1609=$K$5,\"T500\",F1609=$K$6,\"T500\"),\"\")","v":"T500"}]
[20251230,"藤田観光",9722,"サービス業",1.12E-4,"TOPIX Small 1","9722",{"$f":"IFERROR(_xlfn.IFS(F1610=$K$4,\"T500\",F1610=$K$5,\"T500\",F1610=$K$6,\"T500\"),\"\")","v":""}]
[20251230,"ＫＮＴ－ＣＴホールディングス",9726,"サービス業",1.7E-5,"TOPIX Small 2","9726",{"$f":"IFERROR(_xlfn.IFS(F1611=$K$4,\"T500\",F1611=$K$5,\"T500\",F1611=$K$6,\"T500\"),\"\")","v":""}]
[20251230,"トーカイ",9729,"サービス業",3.8999999999999999E-5,"TOPIX Small 2","9729",{"$f":"IFERROR(_xlfn.IFS(F1612=$K$4,\"T500\",F1612=$K$5,\"T500\",F1612=$K$6,\"T500\"),\"\")","v":""}]
[20251230,"セコム",9735,"サービス業",2.2169999999999998E-3,"TOPIX Large70","9735",{"$f":"IFERROR(_xlfn.IFS(F1613=$K$4,\"T500\",F1613=$K$5,\"T500\",F1613=$K$6,\"T500\"),\"\")","v":"T500"}]
[20251230,"ＮＳＷ",9739,"情報・通信業",2.3E-5,"TOPIX Small 2","9739",{"$f":"IFERROR(_xlfn.IFS(F1614=$K$4,\"T500\",F1614=$K$5,\"T500\",F1614=$K$6,\"T500\"),\"\")","v":""}]
[20251230,"セントラル警備保障",9740,"サービス業",3.1000000000000001E-5,"TOPIX Small 2","9740",{"$f":"IFERROR(_xlfn.IFS(F1615=$K$4,\"T500\",F1615=$K$5,\"T500\",F1615=$K$6,\"T500\"),\"\")","v":""}]
[20251230,"アイネス",9742,"情報・通信業",3.1999999999999999E-5,"TOPIX Small 2","9742",{"$f":"IFERROR(_xlfn.IFS(F1616=$K$4,\"T500\",F1616=$K$5,\"T500\",F1616=$K$6,\"T500\"),\"\")","v":""}]
[20251230,"丹青社",9743,"サービス業",7.1000000000000005E-5,"TOPIX Small 1","9743",{"$f":"IFERROR(_xlfn.IFS(F1617=$K$4,\"T500\",F1617=$K$5,\"T500\",F1617=$K$6,\"T500\"),\"\")","v":""}]
[20251230,"メイテックグループホールディングス",9744,"サービス業",2.7900000000000001E-4,"TOPIX Mid400","9744",{"$f":"IFERROR(_xlfn.IFS(F1618=$K$4,\"T500\",F1618=$K$5,\"T500\",F1618=$K$6,\"T500\"),\"\")","v":"T500"}]
[20251230,"ＴＫＣ",9746,"情報・通信業",1.3799999999999999E-4,"TOPIX Small 1","9746",{"$f":"IFERROR(_xlfn.IFS(F1619=$K$4,\"T500\",F1619=$K$5,\"T500\",F1619=$K$6,\"T500\"),\"\")","v":""}]
[20251230,"応用地質",9755,"サービス業",5.3000000000000001E-5,"TOPIX Small 2","9755",{"$f":"IFERROR(_xlfn.IFS(F1620=$K$4,\"T500\",F1620=$K$5,\"T500\",F1620=$K$6,\"T500\"),\"\")","v":""}]
[20251230,"船井総研ホールディングス",9757,"サービス業",9.7999999999999997E-5,"TOPIX Small 1","9757",{"$f":"IFERROR(_xlfn.IFS(F1621=$K$4,\"T500\",F1621=$K$5,\"T500\",F1621=$K$6,\"T500\"),\"\")","v":""}]
[20251230,"ＮＳＤ",9759,"情報・通信業",2.5399999999999999E-4,"TOPIX Mid400","9759",{"$f":"IFERROR(_xlfn.IFS(F1622=$K$4,\"T500\",F1622=$K$5,\"T500\",F1622=$K$6,\"T500\"),\"\")","v":"T500"}]
[20251230,"コナミグループ",9766,"情報・通信業",1.8979999999999999E-3,"TOPIX Mid400","9766",{"$f":"IFERROR(_xlfn.IFS(F1623=$K$4,\"T500\",F1623=$K$5,\"T500\",F1623=$K$6,\"T500\"),\"\")","v":"T500"}]
[20251230,"学究社",9769,"サービス業",2.0000000000000002E-5,"TOPIX Small 2","9769",{"$f":"IFERROR(_xlfn.IFS(F1624=$K$4,\"T500\",F1624=$K$5,\"T500\",F1624=$K$6,\"T500\"),\"\")","v":""}]
[20251230,"ナック",9788,"サービス業",1.2E-5,"TOPIX Small 2","9788",{"$f":"IFERROR(_xlfn.IFS(F1625=$K$4,\"T500\",F1625=$K$5,\"T500\",F1625=$K$6,\"T500\"),\"\")","v":""}]
[20251230,"福井コンピュータホールディングス",9790,"情報・通信業",3.4999999999999997E-5,"TOPIX Small 2","9790",{"$f":"IFERROR(_xlfn.IFS(F1626=$K$4,\"T500\",F1626=$K$5,\"T500\",F1626=$K$6,\"T500\"),\"\")","v":""}]
[20251230,"ダイセキ",9793,"サービス業",1.3899999999999999E-4,"TOPIX Small 1","9793",{"$f":"IFERROR(_xlfn.IFS(F1627=$K$4,\"T500\",F1627=$K$5,\"T500\",F1627=$K$6,\"T500\"),\"\")","v":""}]
[20251230,"ステップ",9795,"サービス業",1.9000000000000001E-5,"TOPIX Small 2","9795",{"$f":"IFERROR(_xlfn.IFS(F1628=$K$4,\"T500\",F1628=$K$5,\"T500\",F1628=$K$6,\"T500\"),\"\")","v":""}]
[20251230,"泉州電業",9824,"卸売業",7.4999999999999993E-5,"TOPIX Small 1","9824",{"$f":"IFERROR(_xlfn.IFS(F1629=$K$4,\"T500\",F1629=$K$5,\"T500\",F1629=$K$6,\"T500\"),\"\")","v":""}]
[20251230,"Ｇｅｎｋｉ　Ｇｌｏｂａｌ　Ｄｉｎｉｎｇ　Ｃｏｎｃｅｐｔｓ",9828,"小売業",3.8999999999999999E-5,"TOPIX Small 1","9828",{"$f":"IFERROR(_xlfn.IFS(F1630=$K$4,\"T500\",F1630=$K$5,\"T500\",F1630=$K$6,\"T500\"),\"\")","v":""}]
[20251230,"トラスコ中山",9830,"卸売業",1.11E-4,"TOPIX Small 1","9830",{"$f":"IFERROR(_xlfn.IFS(F1631=$K$4,\"T500\",F1631=$K$5,\"T500\",F1631=$K$6,\"T500\"),\"\")","v":""}]
[20251230,"ヤマダホールディングス",9831,"小売業",3.5E-4,"TOPIX Mid400","9831",{"$f":"IFERROR(_xlfn.IFS(F1632=$K$4,\"T500\",F1632=$K$5,\"T500\",F1632=$K$6,\"T500\"),\"\")","v":"T500"}]
[20251230,"オートバックスセブン",9832,"卸売業",1.26E-4,"TOPIX Small 1","9832",{"$f":"IFERROR(_xlfn.IFS(F1633=$K$4,\"T500\",F1633=$K$5,\"T500\",F1633=$K$6,\"T500\"),\"\")","v":""}]
[20251230,"モリト",9837,"卸売業",2.5999999999999998E-5,"TOPIX Small 2","9837",{"$f":"IFERROR(_xlfn.IFS(F1634=$K$4,\"T500\",F1634=$K$5,\"T500\",F1634=$K$6,\"T500\"),\"\")","v":""}]
[20251230,"アークランズ",9842,"小売業",1.26E-4,"TOPIX Small 1","9842",{"$f":"IFERROR(_xlfn.IFS(F1635=$K$4,\"T500\",F1635=$K$5,\"T500\",F1635=$K$6,\"T500\"),\"\")","v":""}]
[20251230,"ニトリホールディングス",9843,"小売業",9.7300000000000002E-4,"TOPIX Mid400","9843",{"$f":"IFERROR(_xlfn.IFS(F1636=$K$4,\"T500\",F1636=$K$5,\"T500\",F1636=$K$6,\"T500\"),\"\")","v":"T500"}]
[20251230,"グルメ杵屋",9850,"小売業",1.7E-5,"TOPIX Small 2","9850",{"$f":"IFERROR(_xlfn.IFS(F1637=$K$4,\"T500\",F1637=$K$5,\"T500\",F1637=$K$6,\"T500\"),\"\")","v":""}]
[20251230,"ケーユーホールディングス",9856,"小売業",1.9000000000000001E-5,"TOPIX Small 2","9856",{"$f":"IFERROR(_xlfn.IFS(F1638=$K$4,\"T500\",F1638=$K$5,\"T500\",F1638=$K$6,\"T500\"),\"\")","v":""}]
[20251230,"吉野家ホールディングス",9861,"小売業",2.4800000000000001E-4,"TOPIX Mid400","9861",{"$f":"IFERROR(_xlfn.IFS(F1639=$K$4,\"T500\",F1639=$K$5,\"T500\",F1639=$K$6,\"T500\"),\"\")","v":"T500"}]
[20251230,"加藤産業",9869,"卸売業",1.74E-4,"TOPIX Small 1","9869",{"$f":"IFERROR(_xlfn.IFS(F1640=$K$4,\"T500\",F1640=$K$5,\"T500\",F1640=$K$6,\"T500\"),\"\")","v":""}]
[20251230,"イノテック",9880,"電気機器",2.9E-5,"TOPIX Small 2","9880",{"$f":"IFERROR(_xlfn.IFS(F1641=$K$4,\"T500\",F1641=$K$5,\"T500\",F1641=$K$6,\"T500\"),\"\")","v":""}]
[20251230,"イエローハット",9882,"卸売業",9.1000000000000003E-5,"TOPIX Small 1","9882",{"$f":"IFERROR(_xlfn.IFS(F1642=$K$4,\"T500\",F1642=$K$5,\"T500\",F1642=$K$6,\"T500\"),\"\")","v":""}]
[20251230,"松屋フーズホールディングス",9887,"小売業",6.7000000000000002E-5,"TOPIX Small 1","9887",{"$f":"IFERROR(_xlfn.IFS(F1643=$K$4,\"T500\",F1643=$K$5,\"T500\",F1643=$K$6,\"T500\"),\"\")","v":""}]
[20251230,"ＪＢＣＣホールディングス",9889,"情報・通信業",8.7999999999999998E-5,"TOPIX Small 1","9889",{"$f":"IFERROR(_xlfn.IFS(F1644=$K$4,\"T500\",F1644=$K$5,\"T500\",F1644=$K$6,\"T500\"),\"\")","v":""}]
[20251230,"ＪＫホールディングス",9896,"卸売業",2.0000000000000002E-5,"TOPIX Small 2","9896",{"$f":"IFERROR(_xlfn.IFS(F1645=$K$4,\"T500\",F1645=$K$5,\"T500\",F1645=$K$6,\"T500\"),\"\")","v":""}]
[20251230,"サガミホールディングス",9900,"小売業",6.7000000000000002E-5,"TOPIX Small 1","9900",{"$f":"IFERROR(_xlfn.IFS(F1646=$K$4,\"T500\",F1646=$K$5,\"T500\",F1646=$K$6,\"T500\"),\"\")","v":""}]
[20251230,"日伝",9902,"卸売業",3.1000000000000001E-5,"TOPIX Small 2","9902",{"$f":"IFERROR(_xlfn.IFS(F1647=$K$4,\"T500\",F1647=$K$5,\"T500\",F1647=$K$6,\"T500\"),\"\")","v":""}]
[20251230,"ミロク情報サービス",9928,"情報・通信業",3.4999999999999997E-5,"TOPIX Small 2","9928",{"$f":"IFERROR(_xlfn.IFS(F1648=$K$4,\"T500\",F1648=$K$5,\"T500\",F1648=$K$6,\"T500\"),\"\")","v":""}]
[20251230,"杉本商事",9932,"卸売業",2.5000000000000001E-5,"TOPIX Small 2","9932",{"$f":"IFERROR(_xlfn.IFS(F1649=$K$4,\"T500\",F1649=$K$5,\"T500\",F1649=$K$6,\"T500\"),\"\")","v":""}]
[20251230,"因幡電機産業",9934,"卸売業",2.92E-4,"TOPIX Mid400","9934",{"$f":"IFERROR(_xlfn.IFS(F1650=$K$4,\"T500\",F1650=$K$5,\"T500\",F1650=$K$6,\"T500\"),\"\")","v":"T500"}]
[20251230,"王将フードサービス",9936,"小売業",1.45E-4,"TOPIX Small 1","9936",{"$f":"IFERROR(_xlfn.IFS(F1651=$K$4,\"T500\",F1651=$K$5,\"T500\",F1651=$K$6,\"T500\"),\"\")","v":""}]
[20251230,"ミニストップ",9946,"小売業",3.4E-5,"TOPIX Small 2","9946",{"$f":"IFERROR(_xlfn.IFS(F1652=$K$4,\"T500\",F1652=$K$5,\"T500\",F1652=$K$6,\"T500\"),\"\")","v":""}]
[20251230,"アークス",9948,"小売業",1.25E-4,"TOPIX Small 1","9948",{"$f":"IFERROR(_xlfn.IFS(F1653=$K$4,\"T500\",F1653=$K$5,\"T500\",F1653=$K$6,\"T500\"),\"\")","v":""}]
[20251230,"バローホールディングス",9956,"小売業",1.4100000000000001E-4,"TOPIX Small 1","9956",{"$f":"IFERROR(_xlfn.IFS(F1654=$K$4,\"T500\",F1654=$K$5,\"T500\",F1654=$K$6,\"T500\"),\"\")","v":""}]
[20251230,"東テク",9960,"卸売業",8.8999999999999995E-5,"TOPIX Small 1","9960",{"$f":"IFERROR(_xlfn.IFS(F1655=$K$4,\"T500\",F1655=$K$5,\"T500\",F1655=$K$6,\"T500\"),\"\")","v":""}]
[20251230,"ミスミグループ本社",9962,"卸売業",7.5699999999999997E-4,"TOPIX Mid400","9962",{"$f":"IFERROR(_xlfn.IFS(F1656=$K$4,\"T500\",F1656=$K$5,\"T500\",F1656=$K$6,\"T500\"),\"\")","v":"T500"}]
[20251230,"ベルク",9974,"小売業",7.2999999999999999E-5,"TOPIX Small 1","9974",{"$f":"IFERROR(_xlfn.IFS(F1657=$K$4,\"T500\",F1657=$K$5,\"T500\",F1657=$K$6,\"T500\"),\"\")","v":""}]
[20251230,"大庄",9979,"小売業",1.7E-5,"TOPIX Small 2","9979",{"$f":"IFERROR(_xlfn.IFS(F1658=$K$4,\"T500\",F1658=$K$5,\"T500\",F1658=$K$6,\"T500\"),\"\")","v":""}]
[20251230,"ファーストリテイリング",9983,"小売業",8.4259999999999995E-3,"TOPIX Core30","9983",{"$f":"IFERROR(_xlfn.IFS(F1659=$K$4,\"T500\",F1659=$K$5,\"T500\",F1659=$K$6,\"T500\"),\"\")","v":"T500"}]
[20251230,"ソフトバンクグループ",9984,"情報・通信業",1.753E-2,"TOPIX Core30","9984",{"$f":"IFERROR(_xlfn.IFS(F1660=$K$4,\"T500\",F1660=$K$5,\"T500\",F1660=$K$6,\"T500\"),\"\")","v":"T500"}]
[20251230,"スズケン",9987,"卸売業",4.46E-4,"TOPIX Mid400","9987",{"$f":"IFERROR(_xlfn.IFS(F1661=$K$4,\"T500\",F1661=$K$5,\"T500\",F1661=$K$6,\"T500\"),\"\")","v":"T500"}]
[20251230,"サンドラッグ",9989,"小売業",2.7900000000000001E-4,"TOPIX Mid400","9989",{"$f":"IFERROR(_xlfn.IFS(F1662=$K$4,\"T500\",F1662=$K$5,\"T500\",F1662=$K$6,\"T500\"),\"\")","v":"T500"}]
[20251230,"サックスバー　ホールディングス",9990,"小売業",1.4E-5,"TOPIX Small 2","9990",{"$f":"IFERROR(_xlfn.IFS(F1663=$K$4,\"T500\",F1663=$K$5,\"T500\",F1663=$K$6,\"T500\"),\"\")","v":""}]
[20251230,"ジェコス",9991,"卸売業",2.3E-5,"TOPIX Small 2","9991",{"$f":"IFERROR(_xlfn.IFS(F1664=$K$4,\"T500\",F1664=$K$5,\"T500\",F1664=$K$6,\"T500\"),\"\")","v":""}]
[20251230,"ベルーナ",9997,"小売業",5.3000000000000001E-5,"TOPIX Small 1","9997",{"$f":"IFERROR(_xlfn.IFS(F1665=$K$4,\"T500\",F1665=$K$5,\"T500\",F1665=$K$6,\"T500\"),\"\")","v":""}]
["（注1）ニューインデックス区分欄には、「TOPIX Core30」、「TOPIX Large70」、「TOPIX Mid400」、「TOPIX Small 1」、「TOPIX Small 2」のいずれかを記載します。",null,null,null,null,null,"0",{"$f":"IFERROR(_xlfn.IFS(F1666=$K$4,\"T500\",F1666=$K$5,\"T500\",F1666=$K$6,\"T500\"),\"\")","v":""}]
["　　　それぞれの記載は、以下の指数に組入れられていることを表します。",null,null,null,null,null,{"$f":"TEXT(C1667,0)","v":"0"},{"$f":"IFERROR(_xlfn.IFS(F1667=$K$4,\"T500\",F1667=$K$5,\"T500\",F1667=$K$6,\"T500\"),\"\")","v":""}]
["　　　・TOPIX Core30  … TOPIX Core30、 TOPIX 100、 TOPIX 500、 TOPIX 1000",null,null,null,null,null,"0",{"$f":"IFERROR(_xlfn.IFS(F1668=$K$4,\"T500\",F1668=$K$5,\"T500\",F1668=$K$6,\"T500\"),\"\")","v":""}]
["　　　・TOPIX Large70 … TOPIX Large70、TOPIX 100、 TOPIX 500、 TOPIX 1000",null,null,null,null,null,"0",{"$f":"IFERROR(_xlfn.IFS(F1669=$K$4,\"T500\",F1669=$K$5,\"T500\",F1669=$K$6,\"T500\"),\"\")","v":""}]
["　　　・TOPIX Mid400  … TOPIX Mid400、 TOPIX 500、 TOPIX 1000",null,null,null,null,null,"0",{"$f":"IFERROR(_xlfn.IFS(F1670=$K$4,\"T500\",F1670=$K$5,\"T500\",F1670=$K$6,\"T500\"),\"\")","v":""}]
["　　　・TOPIX Small 1 … TOPIX Small、TOPIX Small 500、 TOPIX 1000",null,null,null,null,null,"0",{"$f":"IFERROR(_xlfn.IFS(F1671=$K$4,\"T500\",F1671=$K$5,\"T500\",F1671=$K$6,\"T500\"),\"\")","v":""}]
["　　　・TOPIX Small 2 … TOPIX Small (非TOPIX 1000)",null,null,null,null,null,"0",{"$f":"IFERROR(_xlfn.IFS(F1672=$K$4,\"T500\",F1672=$K$5,\"T500\",F1672=$K$6,\"T500\"),\"\")","v":""}]
[null,null,null,null,null,null,"0",{"$f":"IFERROR(_xlfn.IFS(F1673=$K$4,\"T500\",F1673=$K$5,\"T500\",F1673=$K$6,\"T500\"),\"\")","v":""}]
["お問い合わせ先",null,null,null,null,null,"0",{"$f":"IFERROR(_xlfn.IFS(F1674=$K$4,\"T500\",F1674=$K$5,\"T500\",F1674=$K$6,\"T500\"),\"\")","v":""}]
["株式会社ＪＰＸ総研　インデックスビジネス部　index@jpx.co.jp",null,null,null,null,null,"0"]
[]
["【免責事項】"]
["・本資料の一切の権利は、株式会社ＪＰＸ総研又は株式会社ＪＰＸ総研の関連会社（以下「JPX」という。）に属しており、いかなる目的を問わず、無断複製・転載を禁じます。"]
["・JPXが算出する株価指数の指数値及び商標は、JPXの知的財産であり、JPXが算出する株価指数に関するすべての権利はJPXが所有しています。"]
["　このため、JPXが算出する株価指数を使用して、ファンドやリンク債などの金融商品を組成、売り出す場合（相対契約によるオプション、スワップ、ワラントなどのデリバティブ取引の対象にする場合を含みます。）など、"]
["　JPXが算出する株価指数を商業的に利用する場合には、JPXとのライセンス契約が必要となります。"]
["・本資料は、予告なく変更される場合があります。また、本資料に掲載されている情報の作成には万全を期していますが、当該情報の完全性を保証するものではありません。"]
["・当社は、本資料及び本資料から得た情報を利用したことにより発生するいかなる費用又は損害等の一切について責任を負いません。"]
[]
[]
[]
[]
[]
["　このため、JPXが算出する株価指数を使用して、ファンドやリンク債などの金融商品を組成、売り出す場合（相対契約によるオプション、スワップ、ワラントなどのデリバティブ取引の対象にする場合を含みます。）など、"]
["　JPXが算出する株価指数を商業的に利用する場合には、JPXとのライセンス契約が必要となります。"]
["・本資料は、予告なく変更される場合があります。また、本資料に掲載されている情報の作成には万全を期していますが、当該情報の完全性を保証するものではありません。"]
["・当社は、本資料及び本資料から得た情報を利用したことにより発生するいかなる費用又は損害等の一切について責任を負いません。"]

{"sheet":"注文管理ID","index":8,"n_rows":3001,"n_cols":2,"rows_kept":3001,"cut":false,"hidden":false,"merged":[]}
["管理番号","使用済\nフラグ"]
[1]
[2]
[3]
[4]
[5]
[6]
[7]
[8]
[9]
[10]
[11]
[12]
[13]
[14]
[15]
[16]
[17]
[18]
[19]
[20]
[21]
[22]
[23]
[24]
[25]
[26]
[27]
[28]
[29]
[30]
[31]
[32]
[33]
[34]
[35]
[36]
[37]
[38]
[39]
[40]
[41]
[42]
[43]
[44]
[45]
[46]
[47]
[48]
[49]
[50]
[51]
[52]
[53]
[54]
[55]
[56]
[57]
[58]
[59]
[60]
[61]
[62]
[63]
[64]
[65]
[66]
[67]
[68]
[69]
[70]
[71]
[72]
[73]
[74]
[75]
[76]
[77]
[78]
[79]
[80]
[81]
[82]
[83]
[84]
[85]
[86]
[87]
[88]
[89]
[90]
[91]
[92]
[93]
[94]
[95]
[96]
[97]
[98]
[99]
[100]
[101]
[102]
[103]
[104]
[105]
[106]
[107]
[108]
[109]
[110]
[111]
[112]
[113]
[114]
[115]
[116]
[117]
[118]
[119]
[120]
[121]
[122]
[123]
[124]
[125]
[126]
[127]
[128]
[129]
[130]
[131]
[132]
[133]
[134]
[135]
[136]
[137]
[138]
[139]
[140]
[141]
[142]
[143]
[144]
[145]
[146]
[147]
[148]
[149]
[150]
[151]
[152]
[153]
[154]
[155]
[156]
[157]
[158]
[159]
[160]
[161]
[162]
[163]
[164]
[165]
[166]
[167]
[168]
[169]
[170]
[171]
[172]
[173]
[174]
[175]
[176]
[177]
[178]
[179]
[180]
[181]
[182]
[183]
[184]
[185]
[186]
[187]
[188]
[189]
[190]
[191]
[192]
[193]
[194]
[195]
[196]
[197]
[198]
[199]
[200]
[201]
[202]
[203]
[204]
[205]
[206]
[207]
[208]
[209]
[210]
[211]
[212]
[213]
[214]
[215]
[216]
[217]
[218]
[219]
[220]
[221]
[222]
[223]
[224]
[225]
[226]
[227]
[228]
[229]
[230]
[231]
[232]
[233]
[234]
[235]
[236]
[237]
[238]
[239]
[240]
[241]
[242]
[243]
[244]
[245]
[246]
[247]
[248]
[249]
[250]
[251]
[252]
[253]
[254]
[255]
[256]
[257]
[258]
[259]
[260]
[261]
[262]
[263]
[264]
[265]
[266]
[267]
[268]
[269]
[270]
[271]
[272]
[273]
[274]
[275]
[276]
[277]
[278]
[279]
[280]
[281]
[282]
[283]
[284]
[285]
[286]
[287]
[288]
[289]
[290]
[291]
[292]
[293]
[294]
[295]
[296]
[297]
[298]
[299]
[300]
[301]
[302]
[303]
[304]
[305]
[306]
[307]
[308]
[309]
[310]
[311]
[312]
[313]
[314]
[315]
[316]
[317]
[318]
[319]
[320]
[321]
[322]
[323]
[324]
[325]
[326]
[327]
[328]
[329]
[330]
[331]
[332]
[333]
[334]
[335]
[336]
[337]
[338]
[339]
[340]
[341]
[342]
[343]
[344]
[345]
[346]
[347]
[348]
[349]
[350]
[351]
[352]
[353]
[354]
[355]
[356]
[357]
[358]
[359]
[360]
[361]
[362]
[363]
[364]
[365]
[366]
[367]
[368]
[369]
[370]
[371]
[372]
[373]
[374]
[375]
[376]
[377]
[378]
[379]
[380]
[381]
[382]
[383]
[384]
[385]
[386]
[387]
[388]
[389]
[390]
[391]
[392]
[393]
[394]
[395]
[396]
[397]
[398]
[399]
[400]
[401]
[402]
[403]
[404]
[405]
[406]
[407]
[408]
[409]
[410]
[411]
[412]
[413]
[414]
[415]
[416]
[417]
[418]
[419]
[420]
[421]
[422]
[423]
[424]
[425]
[426]
[427]
[428]
[429]
[430]
[431]
[432]
[433]
[434]
[435]
[436]
[437]
[438]
[439]
[440]
[441]
[442]
[443]
[444]
[445]
[446]
[447]
[448]
[449]
[450]
[451]
[452]
[453]
[454]
[455]
[456]
[457]
[458]
[459]
[460]
[461]
[462]
[463]
[464]
[465]
[466]
[467]
[468]
[469]
[470]
[471]
[472]
[473]
[474]
[475]
[476]
[477]
[478]
[479]
[480]
[481]
[482]
[483]
[484]
[485]
[486]
[487]
[488]
[489]
[490]
[491]
[492]
[493]
[494]
[495]
[496]
[497]
[498]
[499]
[500]
[501]
[502]
[503]
[504]
[505]
[506]
[507]
[508]
[509]
[510]
[511]
[512]
[513]
[514]
[515]
[516]
[517]
[518]
[519]
[520]
[521]
[522]
[523]
[524]
[525]
[526]
[527]
[528]
[529]
[530]
[531]
[532]
[533]
[534]
[535]
[536]
[537]
[538]
[539]
[540]
[541]
[542]
[543]
[544]
[545]
[546]
[547]
[548]
[549]
[550]
[551]
[552]
[553]
[554]
[555]
[556]
[557]
[558]
[559]
[560]
[561]
[562]
[563]
[564]
[565]
[566]
[567]
[568]
[569]
[570]
[571]
[572]
[573]
[574]
[575]
[576]
[577]
[578]
[579]
[580]
[581]
[582]
[583]
[584]
[585]
[586]
[587]
[588]
[589]
[590]
[591]
[592]
[593]
[594]
[595]
[596]
[597]
[598]
[599]
[600]
[601]
[602]
[603]
[604]
[605]
[606]
[607]
[608]
[609]
[610]
[611]
[612]
[613]
[614]
[615]
[616]
[617]
[618]
[619]
[620]
[621]
[622]
[623]
[624]
[625]
[626]
[627]
[628]
[629]
[630]
[631]
[632]
[633]
[634]
[635]
[636]
[637]
[638]
[639]
[640]
[641]
[642]
[643]
[644]
[645]
[646]
[647]
[648]
[649]
[650]
[651]
[652]
[653]
[654]
[655]
[656]
[657]
[658]
[659]
[660]
[661]
[662]
[663]
[664]
[665]
[666]
[667]
[668]
[669]
[670]
[671]
[672]
[673]
[674]
[675]
[676]
[677]
[678]
[679]
[680]
[681]
[682]
[683]
[684]
[685]
[686]
[687]
[688]
[689]
[690]
[691]
[692]
[693]
[694]
[695]
[696]
[697]
[698]
[699]
[700]
[701]
[702]
[703]
[704]
[705]
[706]
[707]
[708]
[709]
[710]
[711]
[712]
[713]
[714]
[715]
[716]
[717]
[718]
[719]
[720]
[721]
[722]
[723]
[724]
[725]
[726]
[727]
[728]
[729]
[730]
[731]
[732]
[733]
[734]
[735]
[736]
[737]
[738]
[739]
[740]
[741]
[742]
[743]
[744]
[745]
[746]
[747]
[748]
[749]
[750]
[751]
[752]
[753]
[754]
[755]
[756]
[757]
[758]
[759]
[760]
[761]
[762]
[763]
[764]
[765]
[766]
[767]
[768]
[769]
[770]
[771]
[772]
[773]
[774]
[775]
[776]
[777]
[778]
[779]
[780]
[781]
[782]
[783]
[784]
[785]
[786]
[787]
[788]
[789]
[790]
[791]
[792]
[793]
[794]
[795]
[796]
[797]
[798]
[799]
[800]
[801]
[802]
[803]
[804]
[805]
[806]
[807]
[808]
[809]
[810]
[811]
[812]
[813]
[814]
[815]
[816]
[817]
[818]
[819]
[820]
[821]
[822]
[823]
[824]
[825]
[826]
[827]
[828]
[829]
[830]
[831]
[832]
[833]
[834]
[835]
[836]
[837]
[838]
[839]
[840]
[841]
[842]
[843]
[844]
[845]
[846]
[847]
[848]
[849]
[850]
[851]
[852]
[853]
[854]
[855]
[856]
[857]
[858]
[859]
[860]
[861]
[862]
[863]
[864]
[865]
[866]
[867]
[868]
[869]
[870]
[871]
[872]
[873]
[874]
[875]
[876]
[877]
[878]
[879]
[880]
[881]
[882]
[883]
[884]
[885]
[886]
[887]
[888]
[889]
[890]
[891]
[892]
[893]
[894]
[895]
[896]
[897]
[898]
[899]
[900]
[901]
[902]
[903]
[904]
[905]
[906]
[907]
[908]
[909]
[910]
[911]
[912]
[913]
[914]
[915]
[916]
[917]
[918]
[919]
[920]
[921]
[922]
[923]
[924]
[925]
[926]
[927]
[928]
[929]
[930]
[931]
[932]
[933]
[934]
[935]
[936]
[937]
[938]
[939]
[940]
[941]
[942]
[943]
[944]
[945]
[946]
[947]
[948]
[949]
[950]
[951]
[952]
[953]
[954]
[955]
[956]
[957]
[958]
[959]
[960]
[961]
[962]
[963]
[964]
[965]
[966]
[967]
[968]
[969]
[970]
[971]
[972]
[973]
[974]
[975]
[976]
[977]
[978]
[979]
[980]
[981]
[982]
[983]
[984]
[985]
[986]
[987]
[988]
[989]
[990]
[991]
[992]
[993]
[994]
[995]
[996]
[997]
[998]
[999]
[1000]
[1001]
[1002]
[1003]
[1004]
[1005]
[1006]
[1007]
[1008]
[1009]
[1010]
[1011]
[1012]
[1013]
[1014]
[1015]
[1016]
[1017]
[1018]
[1019]
[1020]
[1021]
[1022]
[1023]
[1024]
[1025]
[1026]
[1027]
[1028]
[1029]
[1030]
[1031]
[1032]
[1033]
[1034]
[1035]
[1036]
[1037]
[1038]
[1039]
[1040]
[1041]
[1042]
[1043]
[1044]
[1045]
[1046]
[1047]
[1048]
[1049]
[1050]
[1051]
[1052]
[1053]
[1054]
[1055]
[1056]
[1057]
[1058]
[1059]
[1060]
[1061]
[1062]
[1063]
[1064]
[1065]
[1066]
[1067]
[1068]
[1069]
[1070]
[1071]
[1072]
[1073]
[1074]
[1075]
[1076]
[1077]
[1078]
[1079]
[1080]
[1081]
[1082]
[1083]
[1084]
[1085]
[1086]
[1087]
[1088]
[1089]
[1090]
[1091]
[1092]
[1093]
[1094]
[1095]
[1096]
[1097]
[1098]
[1099]
[1100]
[1101]
[1102]
[1103]
[1104]
[1105]
[1106]
[1107]
[1108]
[1109]
[1110]
[1111]
[1112]
[1113]
[1114]
[1115]
[1116]
[1117]
[1118]
[1119]
[1120]
[1121]
[1122]
[1123]
[1124]
[1125]
[1126]
[1127]
[1128]
[1129]
[1130]
[1131]
[1132]
[1133]
[1134]
[1135]
[1136]
[1137]
[1138]
[1139]
[1140]
[1141]
[1142]
[1143]
[1144]
[1145]
[1146]
[1147]
[1148]
[1149]
[1150]
[1151]
[1152]
[1153]
[1154]
[1155]
[1156]
[1157]
[1158]
[1159]
[1160]
[1161]
[1162]
[1163]
[1164]
[1165]
[1166]
[1167]
[1168]
[1169]
[1170]
[1171]
[1172]
[1173]
[1174]
[1175]
[1176]
[1177]
[1178]
[1179]
[1180]
[1181]
[1182]
[1183]
[1184]
[1185]
[1186]
[1187]
[1188]
[1189]
[1190]
[1191]
[1192]
[1193]
[1194]
[1195]
[1196]
[1197]
[1198]
[1199]
[1200]
[1201]
[1202]
[1203]
[1204]
[1205]
[1206]
[1207]
[1208]
[1209]
[1210]
[1211]
[1212]
[1213]
[1214]
[1215]
[1216]
[1217]
[1218]
[1219]
[1220]
[1221]
[1222]
[1223]
[1224]
[1225]
[1226]
[1227]
[1228]
[1229]
[1230]
[1231]
[1232]
[1233]
[1234]
[1235]
[1236]
[1237]
[1238]
[1239]
[1240]
[1241]
[1242]
[1243]
[1244]
[1245]
[1246]
[1247]
[1248]
[1249]
[1250]
[1251]
[1252]
[1253]
[1254]
[1255]
[1256]
[1257]
[1258]
[1259]
[1260]
[1261]
[1262]
[1263]
[1264]
[1265]
[1266]
[1267]
[1268]
[1269]
[1270]
[1271]
[1272]
[1273]
[1274]
[1275]
[1276]
[1277]
[1278]
[1279]
[1280]
[1281]
[1282]
[1283]
[1284]
[1285]
[1286]
[1287]
[1288]
[1289]
[1290]
[1291]
[1292]
[1293]
[1294]
[1295]
[1296]
[1297]
[1298]
[1299]
[1300]
[1301]
[1302]
[1303]
[1304]
[1305]
[1306]
[1307]
[1308]
[1309]
[1310]
[1311]
[1312]
[1313]
[1314]
[1315]
[1316]
[1317]
[1318]
[1319]
[1320]
[1321]
[1322]
[1323]
[1324]
[1325]
[1326]
[1327]
[1328]
[1329]
[1330]
[1331]
[1332]
[1333]
[1334]
[1335]
[1336]
[1337]
[1338]
[1339]
[1340]
[1341]
[1342]
[1343]
[1344]
[1345]
[1346]
[1347]
[1348]
[1349]
[1350]
[1351]
[1352]
[1353]
[1354]
[1355]
[1356]
[1357]
[1358]
[1359]
[1360]
[1361]
[1362]
[1363]
[1364]
[1365]
[1366]
[1367]
[1368]
[1369]
[1370]
[1371]
[1372]
[1373]
[1374]
[1375]
[1376]
[1377]
[1378]
[1379]
[1380]
[1381]
[1382]
[1383]
[1384]
[1385]
[1386]
[1387]
[1388]
[1389]
[1390]
[1391]
[1392]
[1393]
[1394]
[1395]
[1396]
[1397]
[1398]
[1399]
[1400]
[1401]
[1402]
[1403]
[1404]
[1405]
[1406]
[1407]
[1408]
[1409]
[1410]
[1411]
[1412]
[1413]
[1414]
[1415]
[1416]
[1417]
[1418]
[1419]
[1420]
[1421]
[1422]
[1423]
[1424]
[1425]
[1426]
[1427]
[1428]
[1429]
[1430]
[1431]
[1432]
[1433]
[1434]
[1435]
[1436]
[1437]
[1438]
[1439]
[1440]
[1441]
[1442]
[1443]
[1444]
[1445]
[1446]
[1447]
[1448]
[1449]
[1450]
[1451]
[1452]
[1453]
[1454]
[1455]
[1456]
[1457]
[1458]
[1459]
[1460]
[1461]
[1462]
[1463]
[1464]
[1465]
[1466]
[1467]
[1468]
[1469]
[1470]
[1471]
[1472]
[1473]
[1474]
[1475]
[1476]
[1477]
[1478]
[1479]
[1480]
[1481]
[1482]
[1483]
[1484]
[1485]
[1486]
[1487]
[1488]
[1489]
[1490]
[1491]
[1492]
[1493]
[1494]
[1495]
[1496]
[1497]
[1498]
[1499]
[1500]
[1501]
[1502]
[1503]
[1504]
[1505]
[1506]
[1507]
[1508]
[1509]
[1510]
[1511]
[1512]
[1513]
[1514]
[1515]
[1516]
[1517]
[1518]
[1519]
[1520]
[1521]
[1522]
[1523]
[1524]
[1525]
[1526]
[1527]
[1528]
[1529]
[1530]
[1531]
[1532]
[1533]
[1534]
[1535]
[1536]
[1537]
[1538]
[1539]
[1540]
[1541]
[1542]
[1543]
[1544]
[1545]
[1546]
[1547]
[1548]
[1549]
[1550]
[1551]
[1552]
[1553]
[1554]
[1555]
[1556]
[1557]
[1558]
[1559]
[1560]
[1561]
[1562]
[1563]
[1564]
[1565]
[1566]
[1567]
[1568]
[1569]
[1570]
[1571]
[1572]
[1573]
[1574]
[1575]
[1576]
[1577]
[1578]
[1579]
[1580]
[1581]
[1582]
[1583]
[1584]
[1585]
[1586]
[1587]
[1588]
[1589]
[1590]
[1591]
[1592]
[1593]
[1594]
[1595]
[1596]
[1597]
[1598]
[1599]
[1600]
[1601]
[1602]
[1603]
[1604]
[1605]
[1606]
[1607]
[1608]
[1609]
[1610]
[1611]
[1612]
[1613]
[1614]
[1615]
[1616]
[1617]
[1618]
[1619]
[1620]
[1621]
[1622]
[1623]
[1624]
[1625]
[1626]
[1627]
[1628]
[1629]
[1630]
[1631]
[1632]
[1633]
[1634]
[1635]
[1636]
[1637]
[1638]
[1639]
[1640]
[1641]
[1642]
[1643]
[1644]
[1645]
[1646]
[1647]
[1648]
[1649]
[1650]
[1651]
[1652]
[1653]
[1654]
[1655]
[1656]
[1657]
[1658]
[1659]
[1660]
[1661]
[1662]
[1663]
[1664]
[1665]
[1666]
[1667]
[1668]
[1669]
[1670]
[1671]
[1672]
[1673]
[1674]
[1675]
[1676]
[1677]
[1678]
[1679]
[1680]
[1681]
[1682]
[1683]
[1684]
[1685]
[1686]
[1687]
[1688]
[1689]
[1690]
[1691]
[1692]
[1693]
[1694]
[1695]
[1696]
[1697]
[1698]
[1699]
[1700]
[1701]
[1702]
[1703]
[1704]
[1705]
[1706]
[1707]
[1708]
[1709]
[1710]
[1711]
[1712]
[1713]
[1714]
[1715]
[1716]
[1717]
[1718]
[1719]
[1720]
[1721]
[1722]
[1723]
[1724]
[1725]
[1726]
[1727]
[1728]
[1729]
[1730]
[1731]
[1732]
[1733]
[1734]
[1735]
[1736]
[1737]
[1738]
[1739]
[1740]
[1741]
[1742]
[1743]
[1744]
[1745]
[1746]
[1747]
[1748]
[1749]
[1750]
[1751]
[1752]
[1753]
[1754]
[1755]
[1756]
[1757]
[1758]
[1759]
[1760]
[1761]
[1762]
[1763]
[1764]
[1765]
[1766]
[1767]
[1768]
[1769]
[1770]
[1771]
[1772]
[1773]
[1774]
[1775]
[1776]
[1777]
[1778]
[1779]
[1780]
[1781]
[1782]
[1783]
[1784]
[1785]
[1786]
[1787]
[1788]
[1789]
[1790]
[1791]
[1792]
[1793]
[1794]
[1795]
[1796]
[1797]
[1798]
[1799]
[1800]
[1801]
[1802]
[1803]
[1804]
[1805]
[1806]
[1807]
[1808]
[1809]
[1810]
[1811]
[1812]
[1813]
[1814]
[1815]
[1816]
[1817]
[1818]
[1819]
[1820]
[1821]
[1822]
[1823]
[1824]
[1825]
[1826]
[1827]
[1828]
[1829]
[1830]
[1831]
[1832]
[1833]
[1834]
[1835]
[1836]
[1837]
[1838]
[1839]
[1840]
[1841]
[1842]
[1843]
[1844]
[1845]
[1846]
[1847]
[1848]
[1849]
[1850]
[1851]
[1852]
[1853]
[1854]
[1855]
[1856]
[1857]
[1858]
[1859]
[1860]
[1861]
[1862]
[1863]
[1864]
[1865]
[1866]
[1867]
[1868]
[1869]
[1870]
[1871]
[1872]
[1873]
[1874]
[1875]
[1876]
[1877]
[1878]
[1879]
[1880]
[1881]
[1882]
[1883]
[1884]
[1885]
[1886]
[1887]
[1888]
[1889]
[1890]
[1891]
[1892]
[1893]
[1894]
[1895]
[1896]
[1897]
[1898]
[1899]
[1900]
[1901]
[1902]
[1903]
[1904]
[1905]
[1906]
[1907]
[1908]
[1909]
[1910]
[1911]
[1912]
[1913]
[1914]
[1915]
[1916]
[1917]
[1918]
[1919]
[1920]
[1921]
[1922]
[1923]
[1924]
[1925]
[1926]
[1927]
[1928]
[1929]
[1930]
[1931]
[1932]
[1933]
[1934]
[1935]
[1936]
[1937]
[1938]
[1939]
[1940]
[1941]
[1942]
[1943]
[1944]
[1945]
[1946]
[1947]
[1948]
[1949]
[1950]
[1951]
[1952]
[1953]
[1954]
[1955]
[1956]
[1957]
[1958]
[1959]
[1960]
[1961]
[1962]
[1963]
[1964]
[1965]
[1966]
[1967]
[1968]
[1969]
[1970]
[1971]
[1972]
[1973]
[1974]
[1975]
[1976]
[1977]
[1978]
[1979]
[1980]
[1981]
[1982]
[1983]
[1984]
[1985]
[1986]
[1987]
[1988]
[1989]
[1990]
[1991]
[1992]
[1993]
[1994]
[1995]
[1996]
[1997]
[1998]
[1999]
[2000]
[2001]
[2002]
[2003]
[2004]
[2005]
[2006]
[2007]
[2008]
[2009]
[2010]
[2011]
[2012]
[2013]
[2014]
[2015]
[2016]
[2017]
[2018]
[2019]
[2020]
[2021]
[2022]
[2023]
[2024]
[2025]
[2026]
[2027]
[2028]
[2029]
[2030]
[2031]
[2032]
[2033]
[2034]
[2035]
[2036]
[2037]
[2038]
[2039]
[2040]
[2041]
[2042]
[2043]
[2044]
[2045]
[2046]
[2047]
[2048]
[2049]
[2050]
[2051]
[2052]
[2053]
[2054]
[2055]
[2056]
[2057]
[2058]
[2059]
[2060]
[2061]
[2062]
[2063]
[2064]
[2065]
[2066]
[2067]
[2068]
[2069]
[2070]
[2071]
[2072]
[2073]
[2074]
[2075]
[2076]
[2077]
[2078]
[2079]
[2080]
[2081]
[2082]
[2083]
[2084]
[2085]
[2086]
[2087]
[2088]
[2089]
[2090]
[2091]
[2092]
[2093]
[2094]
[2095]
[2096]
[2097]
[2098]
[2099]
[2100]
[2101]
[2102]
[2103]
[2104]
[2105]
[2106]
[2107]
[2108]
[2109]
[2110]
[2111]
[2112]
[2113]
[2114]
[2115]
[2116]
[2117]
[2118]
[2119]
[2120]
[2121]
[2122]
[2123]
[2124]
[2125]
[2126]
[2127]
[2128]
[2129]
[2130]
[2131]
[2132]
[2133]
[2134]
[2135]
[2136]
[2137]
[2138]
[2139]
[2140]
[2141]
[2142]
[2143]
[2144]
[2145]
[2146]
[2147]
[2148]
[2149]
[2150]
[2151]
[2152]
[2153]
[2154]
[2155]
[2156]
[2157]
[2158]
[2159]
[2160]
[2161]
[2162]
[2163]
[2164]
[2165]
[2166]
[2167]
[2168]
[2169]
[2170]
[2171]
[2172]
[2173]
[2174]
[2175]
[2176]
[2177]
[2178]
[2179]
[2180]
[2181]
[2182]
[2183]
[2184]
[2185]
[2186]
[2187]
[2188]
[2189]
[2190]
[2191]
[2192]
[2193]
[2194]
[2195]
[2196]
[2197]
[2198]
[2199]
[2200]
[2201]
[2202]
[2203]
[2204]
[2205]
[2206]
[2207]
[2208]
[2209]
[2210]
[2211]
[2212]
[2213]
[2214]
[2215]
[2216]
[2217]
[2218]
[2219]
[2220]
[2221]
[2222]
[2223]
[2224]
[2225]
[2226]
[2227]
[2228]
[2229]
[2230]
[2231]
[2232]
[2233]
[2234]
[2235]
[2236]
[2237]
[2238]
[2239]
[2240]
[2241]
[2242]
[2243]
[2244]
[2245]
[2246]
[2247]
[2248]
[2249]
[2250]
[2251]
[2252]
[2253]
[2254]
[2255]
[2256]
[2257]
[2258]
[2259]
[2260]
[2261]
[2262]
[2263]
[2264]
[2265]
[2266]
[2267]
[2268]
[2269]
[2270]
[2271]
[2272]
[2273]
[2274]
[2275]
[2276]
[2277]
[2278]
[2279]
[2280]
[2281]
[2282]
[2283]
[2284]
[2285]
[2286]
[2287]
[2288]
[2289]
[2290]
[2291]
[2292]
[2293]
[2294]
[2295]
[2296]
[2297]
[2298]
[2299]
[2300]
[2301]
[2302]
[2303]
[2304]
[2305]
[2306]
[2307]
[2308]
[2309]
[2310]
[2311]
[2312]
[2313]
[2314]
[2315]
[2316]
[2317]
[2318]
[2319]
[2320]
[2321]
[2322]
[2323]
[2324]
[2325]
[2326]
[2327]
[2328]
[2329]
[2330]
[2331]
[2332]
[2333]
[2334]
[2335]
[2336]
[2337]
[2338]
[2339]
[2340]
[2341]
[2342]
[2343]
[2344]
[2345]
[2346]
[2347]
[2348]
[2349]
[2350]
[2351]
[2352]
[2353]
[2354]
[2355]
[2356]
[2357]
[2358]
[2359]
[2360]
[2361]
[2362]
[2363]
[2364]
[2365]
[2366]
[2367]
[2368]
[2369]
[2370]
[2371]
[2372]
[2373]
[2374]
[2375]
[2376]
[2377]
[2378]
[2379]
[2380]
[2381]
[2382]
[2383]
[2384]
[2385]
[2386]
[2387]
[2388]
[2389]
[2390]
[2391]
[2392]
[2393]
[2394]
[2395]
[2396]
[2397]
[2398]
[2399]
[2400]
[2401]
[2402]
[2403]
[2404]
[2405]
[2406]
[2407]
[2408]
[2409]
[2410]
[2411]
[2412]
[2413]
[2414]
[2415]
[2416]
[2417]
[2418]
[2419]
[2420]
[2421]
[2422]
[2423]
[2424]
[2425]
[2426]
[2427]
[2428]
[2429]
[2430]
[2431]
[2432]
[2433]
[2434]
[2435]
[2436]
[2437]
[2438]
[2439]
[2440]
[2441]
[2442]
[2443]
[2444]
[2445]
[2446]
[2447]
[2448]
[2449]
[2450]
[2451]
[2452]
[2453]
[2454]
[2455]
[2456]
[2457]
[2458]
[2459]
[2460]
[2461]
[2462]
[2463]
[2464]
[2465]
[2466]
[2467]
[2468]
[2469]
[2470]
[2471]
[2472]
[2473]
[2474]
[2475]
[2476]
[2477]
[2478]
[2479]
[2480]
[2481]
[2482]
[2483]
[2484]
[2485]
[2486]
[2487]
[2488]
[2489]
[2490]
[2491]
[2492]
[2493]
[2494]
[2495]
[2496]
[2497]
[2498]
[2499]
[2500]
[2501]
[2502]
[2503]
[2504]
[2505]
[2506]
[2507]
[2508]
[2509]
[2510]
[2511]
[2512]
[2513]
[2514]
[2515]
[2516]
[2517]
[2518]
[2519]
[2520]
[2521]
[2522]
[2523]
[2524]
[2525]
[2526]
[2527]
[2528]
[2529]
[2530]
[2531]
[2532]
[2533]
[2534]
[2535]
[2536]
[2537]
[2538]
[2539]
[2540]
[2541]
[2542]
[2543]
[2544]
[2545]
[2546]
[2547]
[2548]
[2549]
[2550]
[2551]
[2552]
[2553]
[2554]
[2555]
[2556]
[2557]
[2558]
[2559]
[2560]
[2561]
[2562]
[2563]
[2564]
[2565]
[2566]
[2567]
[2568]
[2569]
[2570]
[2571]
[2572]
[2573]
[2574]
[2575]
[2576]
[2577]
[2578]
[2579]
[2580]
[2581]
[2582]
[2583]
[2584]
[2585]
[2586]
[2587]
[2588]
[2589]
[2590]
[2591]
[2592]
[2593]
[2594]
[2595]
[2596]
[2597]
[2598]
[2599]
[2600]
[2601]
[2602]
[2603]
[2604]
[2605]
[2606]
[2607]
[2608]
[2609]
[2610]
[2611]
[2612]
[2613]
[2614]
[2615]
[2616]
[2617]
[2618]
[2619]
[2620]
[2621]
[2622]
[2623]
[2624]
[2625]
[2626]
[2627]
[2628]
[2629]
[2630]
[2631]
[2632]
[2633]
[2634]
[2635]
[2636]
[2637]
[2638]
[2639]
[2640]
[2641]
[2642]
[2643]
[2644]
[2645]
[2646]
[2647]
[2648]
[2649]
[2650]
[2651]
[2652]
[2653]
[2654]
[2655]
[2656]
[2657]
[2658]
[2659]
[2660]
[2661]
[2662]
[2663]
[2664]
[2665]
[2666]
[2667]
[2668]
[2669]
[2670]
[2671]
[2672]
[2673]
[2674]
[2675]
[2676]
[2677]
[2678]
[2679]
[2680]
[2681]
[2682]
[2683]
[2684]
[2685]
[2686]
[2687]
[2688]
[2689]
[2690]
[2691]
[2692]
[2693]
[2694]
[2695]
[2696]
[2697]
[2698]
[2699]
[2700]
[2701]
[2702]
[2703]
[2704]
[2705]
[2706]
[2707]
[2708]
[2709]
[2710]
[2711]
[2712]
[2713]
[2714]
[2715]
[2716]
[2717]
[2718]
[2719]
[2720]
[2721]
[2722]
[2723]
[2724]
[2725]
[2726]
[2727]
[2728]
[2729]
[2730]
[2731]
[2732]
[2733]
[2734]
[2735]
[2736]
[2737]
[2738]
[2739]
[2740]
[2741]
[2742]
[2743]
[2744]
[2745]
[2746]
[2747]
[2748]
[2749]
[2750]
[2751]
[2752]
[2753]
[2754]
[2755]
[2756]
[2757]
[2758]
[2759]
[2760]
[2761]
[2762]
[2763]
[2764]
[2765]
[2766]
[2767]
[2768]
[2769]
[2770]
[2771]
[2772]
[2773]
[2774]
[2775]
[2776]
[2777]
[2778]
[2779]
[2780]
[2781]
[2782]
[2783]
[2784]
[2785]
[2786]
[2787]
[2788]
[2789]
[2790]
[2791]
[2792]
[2793]
[2794]
[2795]
[2796]
[2797]
[2798]
[2799]
[2800]
[2801]
[2802]
[2803]
[2804]
[2805]
[2806]
[2807]
[2808]
[2809]
[2810]
[2811]
[2812]
[2813]
[2814]
[2815]
[2816]
[2817]
[2818]
[2819]
[2820]
[2821]
[2822]
[2823]
[2824]
[2825]
[2826]
[2827]
[2828]
[2829]
[2830]
[2831]
[2832]
[2833]
[2834]
[2835]
[2836]
[2837]
[2838]
[2839]
[2840]
[2841]
[2842]
[2843]
[2844]
[2845]
[2846]
[2847]
[2848]
[2849]
[2850]
[2851]
[2852]
[2853]
[2854]
[2855]
[2856]
[2857]
[2858]
[2859]
[2860]
[2861]
[2862]
[2863]
[2864]
[2865]
[2866]
[2867]
[2868]
[2869]
[2870]
[2871]
[2872]
[2873]
[2874]
[2875]
[2876]
[2877]
[2878]
[2879]
[2880]
[2881]
[2882]
[2883]
[2884]
[2885]
[2886]
[2887]
[2888]
[2889]
[2890]
[2891]
[2892]
[2893]
[2894]
[2895]
[2896]
[2897]
[2898]
[2899]
[2900]
[2901]
[2902]
[2903]
[2904]
[2905]
[2906]
[2907]
[2908]
[2909]
[2910]
[2911]
[2912]
[2913]
[2914]
[2915]
[2916]
[2917]
[2918]
[2919]
[2920]
[2921]
[2922]
[2923]
[2924]
[2925]
[2926]
[2927]
[2928]
[2929]
[2930]
[2931]
[2932]
[2933]
[2934]
[2935]
[2936]
[2937]
[2938]
[2939]
[2940]
[2941]
[2942]
[2943]
[2944]
[2945]
[2946]
[2947]
[2948]
[2949]
[2950]
[2951]
[2952]
[2953]
[2954]
[2955]
[2956]
[2957]
[2958]
[2959]
[2960]
[2961]
[2962]
[2963]
[2964]
[2965]
[2966]
[2967]
[2968]
[2969]
[2970]
[2971]
[2972]
[2973]
[2974]
[2975]
[2976]
[2977]
[2978]
[2979]
[2980]
[2981]
[2982]
[2983]
[2984]
[2985]
[2986]
[2987]
[2988]
[2989]
[2990]
[2991]
[2992]
[2993]
[2994]
[2995]
[2996]
[2997]
[2998]
[2999]
[3000]