{"text_format":"1","workbook":"xlsx","n_sheets":9,"sheets":["Hidden","説明","ETFリスト","逆指値注文一覧","トレール","注文照会","呼値の単位","TOPIX500","注文管理ID"],"not_rendered":{"charts":0,"images":13,"macros":1,"external_links":0,"defined_names":3,"comments":0,"pivot_tables":0},"unopened":[],"bounds":{"document_bytes":16777216,"sheet_cells":100000,"rows_first":2000,"rows_last":500,"rows_between":2000,"halvings":0,"cell_chars":16384,"cell_head_chars":4096},"cells_cut":0,"cells_raw":0,"read":"whole","date_system":"1900"}

{"sheet":"Hidden","index":0,"n_rows":0,"n_cols":0,"rows_kept":0,"cut":false,"hidden":true,"merged":[]}

{"sheet":"説明","index":1,"n_rows":250,"n_cols":5,"rows_kept":250,"cut":false,"hidden":false,"merged":[[1,1,3,19]]}
[]
[null,"サンプルシートの説明"]
[]
[]
[null,"Ver1.0.0 2026年5月1日時点"]
[]
[null,"■特徴"]
[null,"信用取引の返済逆指値S注文において、株価が自分にとって有利な方向に動いた場合、高値または安値を更新する毎に逆指値条件を自動訂正するトレール設定を行うことができます。"]
[null,"本サンプルシートでは最大5つまで同時にトレール設定が可能です。"]
[]
[]
[]
[]
[]
[]
[]
[]
[]
[]
[]
{"$rows_left_out":231}
{"sheet":"ETFリスト","index":2,"n_rows":426,"n_cols":5,"rows_kept":426,"cut":false,"hidden":false,"merged":[]}
[]
[null,null,null,null,"ETFの気配提示状況"]
[]
[null,null,null,null,"取引日"]
[]
["TEXT化"]
["銘柄コード",null,null,null,"コード"]
["1305","ETF",null,null,"1305"]
["1306","ETF",null,null,"1306"]
["1308","ETF",null,null,"1308"]
["1309","ETF",null,null,"1309"]
["1311","ETF",null,null,"1311"]
["1319","ETF",null,null,"1319"]
["1320","ETF",null,null,"1320"]
["1321","ETF",null,null,"1321"]
["1322","ETF",null,null,"1322"]
["1325","ETF",null,null,"1325"]
["1326","ETF",null,null,"1326"]
["1328","ETF",null,null,"1328"]
["1329","ETF",null,null,"1329"]
{"$rows_left_out":407}
{"sheet":"逆指値注文一覧","index":3,"n_rows":509,"n_cols":28,"rows_kept":509,"cut":false,"hidden":false,"merged":[]}
[]
[null,null,null,null,null,null,null,null,null,null,null,null,null,null,null,"＜トレール対象注文ピックアップ＞"]
[null,null,null,null,null,null,null,null,null,null,null,null,null,null,null,"＃","注文ID","銘柄コード","銘柄名称","取引\n区分","注文\n区分","注文数量","逆指値\nトリガー状況","逆指値\n条件単価","発動時\n注文区分","逆指値\n注文単価","注文期限","訂正可能\nフラグ"]
[null,null,null,null,null,null,null,null,null,null,null,null,null,null,null,"銘柄 1"]
[null,null,"銘柄抽出",null,null,null,null,null,null,null,null,null,null,null,null,"銘柄 2"]
[null,null,null," 銘柄コードでソートができます。",null,null,null,null,null,null,null,null,null,null,null,"銘柄 3"]
[null,null,null,null,null,null,null,null,null,null,null,null,null,null,null,"銘柄 4"]
[null,null,null,null,null,null,null,null,null,null,null,null,null,null,null,"銘柄 5"]
["#","注文ID","銘柄コード","銘柄名称","取引\n区分","注文\n区分","注文数量","逆指値\nトリガー状況","逆指値\n条件単価","発動時\n注文区分","逆指値\n注文単価","注文期限","訂正可能\nフラグ","対象\n選定"]
[1]
[2]
[3]
[4]
[5]
[6]
[7]
[8]
[9]
[10]
[11]
{"$rows_left_out":490}
{"sheet":"トレール","index":4,"n_rows":35,"n_cols":22,"rows_kept":35,"cut":false,"hidden":false,"merged":[[8,4,8,5],[8,8,8,9],[8,12,8,13],[8,16,8,17],[8,20,8,21]]}
[{"$f":"NOW()","v":"2026-05-08T13:02:33.020"},null,null,"銘柄 1",null,null,null,"銘柄 2",null,null,null,"銘柄 3",null,null,null,"銘柄 4",null,null,null,"銘柄 5"]
[null,null,null,{"$f":"IF(逆指値注文一覧!$R$4=\"\",\"Wait\",TEXT(逆指値注文一覧!$R$4,0))","v":"Wait"},{"$f":"IF(D2=\"wait\",\"\",_xlfn.SINGLE(_xll.SNT.StockInst(D2,\"銘柄名称\")))","v":""},null,null,{"$f":"IF(逆指値注文一覧!$R$5=\"\",\"Wait\",TEXT(逆指値注文一覧!$R$5,0))","v":"Wait"},{"$f":"IF(H2=\"wait\",\"\",_xlfn.SINGLE(_xll.SNT.StockInst(H2,\"銘柄名称\")))","v":""},null,null,{"$f":"IF(逆指値注文一覧!$R$6=\"\",\"Wait\",TEXT(逆指値注文一覧!$R$6,0))","v":"Wait"},{"$f":"IF(L2=\"wait\",\"\",_xlfn.SINGLE(_xll.SNT.StockInst(L2,\"銘柄名称\")))","v":""},null,null,{"$f":"IF(逆指値注文一覧!$R$7=\"\",\"Wait\",TEXT(逆指値注文一覧!$R$7,0))","v":"Wait"},{"$f":"IF(P2=\"wait\",\"\",_xlfn.SINGLE(_xll.SNT.StockInst(P2,\"銘柄名称\")))","v":""},null,null,{"$f":"IF(逆指値注文一覧!$R$8=\"\",\"Wait\",TEXT(逆指値注文一覧!$R$8,0))","v":"Wait"},{"$f":"IF(T2=\"wait\",\"\",_xlfn.SINGLE(_xll.SNT.StockInst(T2,\"銘柄名称\")))","v":""}]
[null,null,null,{"$f":"IF($D$2=\"wait\",\"\",IFERROR(VLOOKUP($D$2,ETFリスト!$A:$B,2,FALSE),\"\"))","v":""},null,{"$f":"IFERROR(VLOOKUP($D$2,TOPIX500!$G$1:$H$1674,2,FALSE),\"\")","v":""},null,{"$f":"IF($H$2=\"wait\",\"\",IFERROR(VLOOKUP($H$2,ETFリスト!$A:$B,2,FALSE),\"\"))","v":""},null,{"$f":"IFERROR(VLOOKUP($H$2,TOPIX500!$G$1:$H$1674,2,FALSE),\"\")","v":""},null,{"$f":"IF($L$2=\"wait\",\"\",IFERROR(VLOOKUP($L$2,ETFリスト!$A:$B,2,FALSE),\"\"))","v":""},null,{"$f":"IFERROR(VLOOKUP($L$2,TOPIX500!$G$1:$H$1674,2,FALSE),\"\")","v":""},null,{"$f":"IF($P$2=\"wait\",\"\",IFERROR(VLOOKUP($P$2,ETFリスト!$A:$B,2,FALSE),\"\"))","v":""},null,{"$f":"IFERROR(VLOOKUP($P$2,TOPIX500!$G$1:$H$1674,2,FALSE),\"\")","v":""},null,{"$f":"IF($T$2=\"wait\",\"\",IFERROR(VLOOKUP($T$2,ETFリスト!$A:$B,2,FALSE),\"\"))","v":""},null,{"$f":"IFERROR(VLOOKUP($T$2,TOPIX500!$G$1:$H$1674,2,FALSE),\"\")","v":""}]
[null,null,null,"現値",{"$f":"_xll.SNT.StockInst($D$2,\"現値\")","v":"=@SNT.StockInst($D$2,\"現値\") => 接続待ち"},{"$f":"MID(_xll.SNT.StockInst($D$2,\"現値日時\"),12,5)","v":"tockI"},null,"現値",{"$f":"_xll.SNT.StockInst($H$2,\"現値\")","v":"=@SNT.StockInst($H$2,\"現値\") => 接続待ち"},{"$f":"MID(_xll.SNT.StockInst($H$2,\"現値日時\"),12,5)","v":"tockI"},null,"現値",{"$f":"_xll.SNT.StockInst($L$2,\"現値\")","v":"=@SNT.StockInst($L$2,\"現値\") => 接続待ち"},{"$f":"MID(_xll.SNT.StockInst($L$2,\"現値日時\"),12,5)","v":"tockI"},null,"現値",{"$f":"_xll.SNT.StockInst($P$2,\"現値\")","v":"=@SNT.StockInst($P$2,\"現値\") => 接続待ち"},{"$f":"MID(_xll.SNT.StockInst($P$2,\"現値日時\"),12,5)","v":"tockI"},null,"現値",{"$f":"_xll.SNT.StockInst($T$2,\"現値\")","v":"=@SNT.StockInst($T$2,\"現値\") => 接続待ち"},{"$f":"MID(_xll.SNT.StockInst($T$2,\"現値日時\"),12,5)","v":"tockI"}]
[null,null,null,"前日比",{"$f":"IFERROR(IF(_xll.SNT.StockInst($D$2,\"前日終値\")=0,0,E4-_xll.SNT.StockInst($D$2,\"前日終値\")),\"\")","v":""},null,null,"前日比",{"$f":"IFERROR(IF(_xll.SNT.StockInst($H$2,\"前日終値\")=0,0,I4-_xll.SNT.StockInst($H$2,\"前日終値\")),\"\")","v":""},null,null,"前日比",{"$f":"IFERROR(IF(_xll.SNT.StockInst($L$2,\"前日終値\")=0,0,M4-_xll.SNT.StockInst($L$2,\"前日終値\")),\"\")","v":""},null,null,"前日比",{"$f":"IFERROR(IF(_xll.SNT.StockInst($P$2,\"前日終値\")=0,0,Q4-_xll.SNT.StockInst($P$2,\"前日終値\")),\"\")","v":""},null,null,"前日比",{"$f":"IFERROR(IF(_xll.SNT.StockInst($T$2,\"前日終値\")=0,0,U4-_xll.SNT.StockInst($T$2,\"前日終値\")),\"\")","v":""}]
[null,null,null,"始値",{"$f":"_xll.SNT.StockInst($D$2,\"始値\")","v":"=@SNT.StockInst($D$2,\"始値\") => 接続待ち"},{"$f":"MID(_xll.SNT.StockInst($D$2,\"始値時刻\"),12,5)","v":"tockI"},null,"始値",{"$f":"_xll.SNT.StockInst($H$2,\"始値\")","v":"=@SNT.StockInst($H$2,\"始値\") => 接続待ち"},{"$f":"MID(_xll.SNT.StockInst($H$2,\"始値時刻\"),12,5)","v":"tockI"},null,"始値",{"$f":"_xll.SNT.StockInst($L$2,\"始値\")","v":"=@SNT.StockInst($L$2,\"始値\") => 接続待ち"},{"$f":"MID(_xll.SNT.StockInst($L$2,\"始値時刻\"),12,5)","v":"tockI"},null,"始値",{"$f":"_xll.SNT.StockInst($P$2,\"始値\")","v":"=@SNT.StockInst($P$2,\"始値\") => 接続待ち"},{"$f":"MID(_xll.SNT.StockInst($P$2,\"始値時刻\"),12,5)","v":"tockI"},null,"始値",{"$f":"_xll.SNT.StockInst($T$2,\"始値\")","v":"=@SNT.StockInst($T$2,\"始値\") => 接続待ち"},{"$f":"MID(_xll.SNT.StockInst($T$2,\"始値時刻\"),12,5)","v":"tockI"}]
[null,null,null,"高値",{"$f":"_xll.SNT.StockInst($D$2,\"高値\")","v":"=@SNT.StockInst($D$2,\"高値\") => 接続待ち"},{"$f":"MID(_xll.SNT.StockInst($D$2,\"高値時刻\"),12,5)","v":"tockI"},null,"高値",{"$f":"_xll.SNT.StockInst($H$2,\"高値\")","v":"=@SNT.StockInst($H$2,\"高値\") => 接続待ち"},{"$f":"MID(_xll.SNT.StockInst($H$2,\"高値時刻\"),12,5)","v":"tockI"},null,"高値",{"$f":"_xll.SNT.StockInst($L$2,\"高値\")","v":"=@SNT.StockInst($L$2,\"高値\") => 接続待ち"},{"$f":"MID(_xll.SNT.StockInst($L$2,\"高値時刻\"),12,5)","v":"tockI"},null,"高値",{"$f":"_xll.SNT.StockInst($P$2,\"高値\")","v":"=@SNT.StockInst($P$2,\"高値\") => 接続待ち"},{"$f":"MID(_xll.SNT.StockInst($P$2,\"高値時刻\"),12,5)","v":"tockI"},null,"高値",{"$f":"_xll.SNT.StockInst($T$2,\"高値\")","v":"=@SNT.StockInst($T$2,\"高値\") => 接続待ち"},{"$f":"MID(_xll.SNT.StockInst($T$2,\"高値時刻\"),12,5)","v":"tockI"}]
[null,null,null,"安値",{"$f":"_xll.SNT.StockInst($D$2,\"安値\")","v":"=@SNT.StockInst($D$2,\"安値\") => 接続待ち"},{"$f":"MID(_xll.SNT.StockInst($D$2,\"安値時刻\"),12,5)","v":"tockI"},null,"安値",{"$f":"_xll.SNT.StockInst($H$2,\"安値\")","v":"=@SNT.StockInst($H$2,\"安値\") => 接続待ち"},{"$f":"MID(_xll.SNT.StockInst($H$2,\"安値時刻\"),12,5)","v":"tockI"},null,"安値",{"$f":"_xll.SNT.StockInst($L$2,\"安値\")","v":"=@SNT.StockInst($L$2,\"安値\") => 接続待ち"},{"$f":"MID(_xll.SNT.StockInst($L$2,\"安値時刻\"),12,5)","v":"tockI"},null,"安値",{"$f":"_xll.SNT.StockInst($P$2,\"安値\")","v":"=@SNT.StockInst($P$2,\"安値\") => 接続待ち"},{"$f":"MID(_xll.SNT.StockInst($P$2,\"安値時刻\"),12,5)","v":"tockI"},null,"安値",{"$f":"_xll.SNT.StockInst($T$2,\"安値\")","v":"=@SNT.StockInst($T$2,\"安値\") => 接続待ち"},{"$f":"MID(_xll.SNT.StockInst($T$2,\"安値時刻\"),12,5)","v":"tockI"}]
[null,"高安　監視間隔（秒）",null,"売買高",{"$f":"_xll.SNT.StockInst($D$2,\"売買高\")","v":"=@SNT.StockInst($D$2,\"売買高\") => 接続待ち"},null,null,"売買高",{"$f":"_xll.SNT.StockInst($H$2,\"売買高\")","v":"=@SNT.StockInst($H$2,\"売買高\") => 接続待ち"},null,null,"売買高",{"$f":"_xll.SNT.StockInst($L$2,\"売買高\")","v":"=@SNT.StockInst($L$2,\"売買高\") => 接続待ち"},null,null,"売買高",{"$f":"_xll.SNT.StockInst($P$2,\"売買高\")","v":"=@SNT.StockInst($P$2,\"売買高\") => 接続待ち"},null,null,"売買高",{"$f":"_xll.SNT.StockInst($T$2,\"売買高\")","v":"=@SNT.StockInst($T$2,\"売買高\") => 接続待ち"}]
[null,3,null,"売数量","値段","買数量",null,"売数量","値段","買数量",null,"売数量","値段","買数量",null,"売数量","値段","買数量",null,"売数量","値段","買数量"]
[null,null,null,{"$f":"_xll.SNT.StockInst($D$2,\"売気配数量_5本目\")","v":"=@SNT.StockInst($D$2,\"売気配数量_5本目\") => 接続待ち"},{"$f":"_xll.SNT.StockInst($D$2,\"売気配価格_5本目\")","v":"=@SNT.StockInst($D$2,\"売気配価格_5本目\") => 接続待ち"},null,null,{"$f":"_xll.SNT.StockInst($H$2,\"売気配数量_5本目\")","v":"=@SNT.StockInst($H$2,\"売気配数量_5本目\") => 接続待ち"},{"$f":"_xll.SNT.StockInst($H$2,\"売気配価格_5本目\")","v":"=@SNT.StockInst($H$2,\"売気配価格_5本目\") => 接続待ち"},null,null,{"$f":"_xll.SNT.StockInst($L$2,\"売気配数量_5本目\")","v":"=@SNT.StockInst($L$2,\"売気配数量_5本目\") => 接続待ち"},{"$f":"_xll.SNT.StockInst($L$2,\"売気配価格_5本目\")","v":"=@SNT.StockInst($L$2,\"売気配価格_5本目\") => 接続待ち"},null,null,{"$f":"_xll.SNT.StockInst($P$2,\"売気配数量_5本目\")","v":"=@SNT.StockInst($P$2,\"売気配数量_5本目\") => 接続待ち"},{"$f":"_xll.SNT.StockInst($P$2,\"売気配価格_5本目\")","v":"=@SNT.StockInst($P$2,\"売気配価格_5本目\") => 接続待ち"},null,null,{"$f":"_xll.SNT.StockInst($T$2,\"売気配数量_5本目\")","v":"=@SNT.StockInst($T$2,\"売気配数量_5本目\") => 接続待ち"},{"$f":"_xll.SNT.StockInst($T$2,\"売気配価格_5本目\")","v":"=@SNT.StockInst($T$2,\"売気配価格_5本目\") => 接続待ち"}]
[null,"監視時間乖離（秒）",null,{"$f":"_xll.SNT.StockInst($D$2,\"売気配数量_4本目\")","v":"=@SNT.StockInst($D$2,\"売気配数量_4本目\") => 接続待ち"},{"$f":"_xll.SNT.StockInst($D$2,\"売気配価格_4本目\")","v":"=@SNT.StockInst($D$2,\"売気配価格_4本目\") => 接続待ち"},null,null,{"$f":"_xll.SNT.StockInst($H$2,\"売気配数量_4本目\")","v":"=@SNT.StockInst($H$2,\"売気配数量_4本目\") => 接続待ち"},{"$f":"_xll.SNT.StockInst($H$2,\"売気配価格_4本目\")","v":"=@SNT.StockInst($H$2,\"売気配価格_4本目\") => 接続待ち"},null,null,{"$f":"_xll.SNT.StockInst($L$2,\"売気配数量_4本目\")","v":"=@SNT.StockInst($L$2,\"売気配数量_4本目\") => 接続待ち"},{"$f":"_xll.SNT.StockInst($L$2,\"売気配価格_4本目\")","v":"=@SNT.StockInst($L$2,\"売気配価格_4本目\") => 接続待ち"},null,null,{"$f":"_xll.SNT.StockInst($P$2,\"売気配数量_4本目\")","v":"=@SNT.StockInst($P$2,\"売気配数量_4本目\") => 接続待ち"},{"$f":"_xll.SNT.StockInst($P$2,\"売気配価格_4本目\")","v":"=@SNT.StockInst($P$2,\"売気配価格_4本目\") => 接続待ち"},null,null,{"$f":"_xll.SNT.StockInst($T$2,\"売気配数量_4本目\")","v":"=@SNT.StockInst($T$2,\"売気配数量_4本目\") => 接続待ち"},{"$f":"_xll.SNT.StockInst($T$2,\"売気配価格_4本目\")","v":"=@SNT.StockInst($T$2,\"売気配価格_4本目\") => 接続待ち"}]
[{"$f":"IFERROR(IF(B13=\"\",\"\",IF(B13>180,\"監視停止可能性あり\",\"\")),\"\")","v":""},{"$f":"IF(COUNT(D34,H34,L34,P34,T34)=0,\"\",ABS(A1-MAX(D34,H34,L34,P34,T34))*86400)","v":""},null,{"$f":"_xll.SNT.StockInst($D$2,\"売気配数量_3本目\")","v":"=@SNT.StockInst($D$2,\"売気配数量_3本目\") => 接続待ち"},{"$f":"_xll.SNT.StockInst($D$2,\"売気配価格_3本目\")","v":"=@SNT.StockInst($D$2,\"売気配価格_3本目\") => 接続待ち"},null,null,{"$f":"_xll.SNT.StockInst($H$2,\"売気配数量_3本目\")","v":"=@SNT.StockInst($H$2,\"売気配数量_3本目\") => 接続待ち"},{"$f":"_xll.SNT.StockInst($H$2,\"売気配価格_3本目\")","v":"=@SNT.StockInst($H$2,\"売気配価格_3本目\") => 接続待ち"},null,null,{"$f":"_xll.SNT.StockInst($L$2,\"売気配数量_3本目\")","v":"=@SNT.StockInst($L$2,\"売気配数量_3本目\") => 接続待ち"},{"$f":"_xll.SNT.StockInst($L$2,\"売気配価格_3本目\")","v":"=@SNT.StockInst($L$2,\"売気配価格_3本目\") => 接続待ち"},null,null,{"$f":"_xll.SNT.StockInst($P$2,\"売気配数量_3本目\")","v":"=@SNT.StockInst($P$2,\"売気配数量_3本目\") => 接続待ち"},{"$f":"_xll.SNT.StockInst($P$2,\"売気配価格_3本目\")","v":"=@SNT.StockInst($P$2,\"売気配価格_3本目\") => 接続待ち"},null,null,{"$f":"_xll.SNT.StockInst($T$2,\"売気配数量_3本目\")","v":"=@SNT.StockInst($T$2,\"売気配数量_3本目\") => 接続待ち"},{"$f":"_xll.SNT.StockInst($T$2,\"売気配価格_3本目\")","v":"=@SNT.StockInst($T$2,\"売気配価格_3本目\") => 接続待ち"}]
[null,null,null,{"$f":"_xll.SNT.StockInst($D$2,\"売気配数量_2本目\")","v":"=@SNT.StockInst($D$2,\"売気配数量_2本目\") => 接続待ち"},{"$f":"_xll.SNT.StockInst($D$2,\"売気配価格_2本目\")","v":"=@SNT.StockInst($D$2,\"売気配価格_2本目\") => 接続待ち"},null,null,{"$f":"_xll.SNT.StockInst($H$2,\"売気配数量_2本目\")","v":"=@SNT.StockInst($H$2,\"売気配数量_2本目\") => 接続待ち"},{"$f":"_xll.SNT.StockInst($H$2,\"売気配価格_2本目\")","v":"=@SNT.StockInst($H$2,\"売気配価格_2本目\") => 接続待ち"},null,null,{"$f":"_xll.SNT.StockInst($L$2,\"売気配数量_2本目\")","v":"=@SNT.StockInst($L$2,\"売気配数量_2本目\") => 接続待ち"},{"$f":"_xll.SNT.StockInst($L$2,\"売気配価格_2本目\")","v":"=@SNT.StockInst($L$2,\"売気配価格_2本目\") => 接続待ち"},null,null,{"$f":"_xll.SNT.StockInst($P$2,\"売気配数量_2本目\")","v":"=@SNT.StockInst($P$2,\"売気配数量_2本目\") => 接続待ち"},{"$f":"_xll.SNT.StockInst($P$2,\"売気配価格_2本目\")","v":"=@SNT.StockInst($P$2,\"売気配価格_2本目\") => 接続待ち"},null,null,{"$f":"_xll.SNT.StockInst($T$2,\"売気配数量_2本目\")","v":"=@SNT.StockInst($T$2,\"売気配数量_2本目\") => 接続待ち"},{"$f":"_xll.SNT.StockInst($T$2,\"売気配価格_2本目\")","v":"=@SNT.StockInst($T$2,\"売気配価格_2本目\") => 接続待ち"}]
[null,null,null,{"$f":"_xll.SNT.StockInst($D$2,\"売気配数量_1本目\")","v":"=@SNT.StockInst($D$2,\"売気配数量_1本目\") => 接続待ち"},{"$f":"_xll.SNT.StockInst($D$2,\"売気配価格_1本目\")","v":"=@SNT.StockInst($D$2,\"売気配価格_1本目\") => 接続待ち"},null,null,{"$f":"_xll.SNT.StockInst($H$2,\"売気配数量_1本目\")","v":"=@SNT.StockInst($H$2,\"売気配数量_1本目\") => 接続待ち"},{"$f":"_xll.SNT.StockInst($H$2,\"売気配価格_1本目\")","v":"=@SNT.StockInst($H$2,\"売気配価格_1本目\") => 接続待ち"},null,null,{"$f":"_xll.SNT.StockInst($L$2,\"売気配数量_1本目\")","v":"=@SNT.StockInst($L$2,\"売気配数量_1本目\") => 接続待ち"},{"$f":"_xll.SNT.StockInst($L$2,\"売気配価格_1本目\")","v":"=@SNT.StockInst($L$2,\"売気配価格_1本目\") => 接続待ち"},null,null,{"$f":"_xll.SNT.StockInst($P$2,\"売気配数量_1本目\")","v":"=@SNT.StockInst($P$2,\"売気配数量_1本目\") => 接続待ち"},{"$f":"_xll.SNT.StockInst($P$2,\"売気配価格_1本目\")","v":"=@SNT.StockInst($P$2,\"売気配価格_1本目\") => 接続待ち"},null,null,{"$f":"_xll.SNT.StockInst($T$2,\"売気配数量_1本目\")","v":"=@SNT.StockInst($T$2,\"売気配数量_1本目\") => 接続待ち"},{"$f":"_xll.SNT.StockInst($T$2,\"売気配価格_1本目\")","v":"=@SNT.StockInst($T$2,\"売気配価格_1本目\") => 接続待ち"}]
[null,null,null,null,{"$f":"_xll.SNT.StockInst($D$2,\"買気配価格_1本目\")","v":"=@SNT.StockInst($D$2,\"買気配価格_1本目\") => 接続待ち"},{"$f":"_xll.SNT.StockInst($D$2,\"買気配数量_1本目\")","v":"=@SNT.StockInst($D$2,\"買気配数量_1本目\") => 接続待ち"},null,null,{"$f":"_xll.SNT.StockInst($H$2,\"買気配価格_1本目\")","v":"=@SNT.StockInst($H$2,\"買気配価格_1本目\") => 接続待ち"},{"$f":"_xll.SNT.StockInst($H$2,\"買気配数量_1本目\")","v":"=@SNT.StockInst($H$2,\"買気配数量_1本目\") => 接続待ち"},null,null,{"$f":"_xll.SNT.StockInst($L$2,\"買気配価格_1本目\")","v":"=@SNT.StockInst($L$2,\"買気配価格_1本目\") => 接続待ち"},{"$f":"_xll.SNT.StockInst($L$2,\"買気配数量_1本目\")","v":"=@SNT.StockInst($L$2,\"買気配数量_1本目\") => 接続待ち"},null,null,{"$f":"_xll.SNT.StockInst($P$2,\"買気配価格_1本目\")","v":"=@SNT.StockInst($P$2,\"買気配価格_1本目\") => 接続待ち"},{"$f":"_xll.SNT.StockInst($P$2,\"買気配数量_1本目\")","v":"=@SNT.StockInst($P$2,\"買気配数量_1本目\") => 接続待ち"},null,null,{"$f":"_xll.SNT.StockInst($T$2,\"買気配価格_1本目\")","v":"=@SNT.StockInst($T$2,\"買気配価格_1本目\") => 接続待ち"},{"$f":"_xll.SNT.StockInst($T$2,\"買気配数量_1本目\")","v":"=@SNT.StockInst($T$2,\"買気配数量_1本目\") => 接続待ち"}]
[null,null,null,null,{"$f":"_xll.SNT.StockInst($D$2,\"買気配価格_2本目\")","v":"=@SNT.StockInst($D$2,\"買気配価格_2本目\") => 接続待ち"},{"$f":"_xll.SNT.StockInst($D$2,\"買気配数量_2本目\")","v":"=@SNT.StockInst($D$2,\"買気配数量_2本目\") => 接続待ち"},null,null,{"$f":"_xll.SNT.StockInst($H$2,\"買気配価格_2本目\")","v":"=@SNT.StockInst($H$2,\"買気配価格_2本目\") => 接続待ち"},{"$f":"_xll.SNT.StockInst($H$2,\"買気配数量_2本目\")","v":"=@SNT.StockInst($H$2,\"買気配数量_2本目\") => 接続待ち"},null,null,{"$f":"_xll.SNT.StockInst($L$2,\"買気配価格_2本目\")","v":"=@SNT.StockInst($L$2,\"買気配価格_2本目\") => 接続待ち"},{"$f":"_xll.SNT.StockInst($L$2,\"買気配数量_2本目\")","v":"=@SNT.StockInst($L$2,\"買気配数量_2本目\") => 接続待ち"},null,null,{"$f":"_xll.SNT.StockInst($P$2,\"買気配価格_2本目\")","v":"=@SNT.StockInst($P$2,\"買気配価格_2本目\") => 接続待ち"},{"$f":"_xll.SNT.StockInst($P$2,\"買気配数量_2本目\")","v":"=@SNT.StockInst($P$2,\"買気配数量_2本目\") => 接続待ち"},null,null,{"$f":"_xll.SNT.StockInst($T$2,\"買気配価格_2本目\")","v":"=@SNT.StockInst($T$2,\"買気配価格_2本目\") => 接続待ち"},{"$f":"_xll.SNT.StockInst($T$2,\"買気配数量_2本目\")","v":"=@SNT.StockInst($T$2,\"買気配数量_2本目\") => 接続待ち"}]
[null,null,null,null,{"$f":"_xll.SNT.StockInst($D$2,\"買気配価格_3本目\")","v":"=@SNT.StockInst($D$2,\"買気配価格_3本目\") => 接続待ち"},{"$f":"_xll.SNT.StockInst($D$2,\"買気配数量_3本目\")","v":"=@SNT.StockInst($D$2,\"買気配数量_3本目\") => 接続待ち"},null,null,{"$f":"_xll.SNT.StockInst($H$2,\"買気配価格_3本目\")","v":"=@SNT.StockInst($H$2,\"買気配価格_3本目\") => 接続待ち"},{"$f":"_xll.SNT.StockInst($H$2,\"買気配数量_3本目\")","v":"=@SNT.StockInst($H$2,\"買気配数量_3本目\") => 接続待ち"},null,null,{"$f":"_xll.SNT.StockInst($L$2,\"買気配価格_3本目\")","v":"=@SNT.StockInst($L$2,\"買気配価格_3本目\") => 接続待ち"},{"$f":"_xll.SNT.StockInst($L$2,\"買気配数量_3本目\")","v":"=@SNT.StockInst($L$2,\"買気配数量_3本目\") => 接続待ち"},null,null,{"$f":"_xll.SNT.StockInst($P$2,\"買気配価格_3本目\")","v":"=@SNT.StockInst($P$2,\"買気配価格_3本目\") => 接続待ち"},{"$f":"_xll.SNT.StockInst($P$2,\"買気配数量_3本目\")","v":"=@SNT.StockInst($P$2,\"買気配数量_3本目\") => 接続待ち"},null,null,{"$f":"_xll.SNT.StockInst($T$2,\"買気配価格_3本目\")","v":"=@SNT.StockInst($T$2,\"買気配価格_3本目\") => 接続待ち"},{"$f":"_xll.SNT.StockInst($T$2,\"買気配数量_3本目\")","v":"=@SNT.StockInst($T$2,\"買気配数量_3本目\") => 接続待ち"}]
[null,null,null,null,{"$f":"_xll.SNT.StockInst($D$2,\"買気配価格_4本目\")","v":"=@SNT.StockInst($D$2,\"買気配価格_4本目\") => 接続待ち"},{"$f":"_xll.SNT.StockInst($D$2,\"買気配数量_4本目\")","v":"=@SNT.StockInst($D$2,\"買気配数量_4本目\") => 接続待ち"},null,null,{"$f":"_xll.SNT.StockInst($H$2,\"買気配価格_4本目\")","v":"=@SNT.StockInst($H$2,\"買気配価格_4本目\") => 接続待ち"},{"$f":"_xll.SNT.StockInst($H$2,\"買気配数量_4本目\")","v":"=@SNT.StockInst($H$2,\"買気配数量_4本目\") => 接続待ち"},null,null,{"$f":"_xll.SNT.StockInst($L$2,\"買気配価格_4本目\")","v":"=@SNT.StockInst($L$2,\"買気配価格_4本目\") => 接続待ち"},{"$f":"_xll.SNT.StockInst($L$2,\"買気配数量_4本目\")","v":"=@SNT.StockInst($L$2,\"買気配数量_4本目\") => 接続待ち"},null,null,{"$f":"_xll.SNT.StockInst($P$2,\"買気配価格_4本目\")","v":"=@SNT.StockInst($P$2,\"買気配価格_4本目\") => 接続待ち"},{"$f":"_xll.SNT.StockInst($P$2,\"買気配数量_4本目\")","v":"=@SNT.StockInst($P$2,\"買気配数量_4本目\") => 接続待ち"},null,null,{"$f":"_xll.SNT.StockInst($T$2,\"買気配価格_4本目\")","v":"=@SNT.StockInst($T$2,\"買気配価格_4本目\") => 接続待ち"},{"$f":"_xll.SNT.StockInst($T$2,\"買気配数量_4本目\")","v":"=@SNT.StockInst($T$2,\"買気配数量_4本目\") => 接続待ち"}]
[null,null,null,null,{"$f":"_xll.SNT.StockInst($D$2,\"買気配価格_5本目\")","v":"=@SNT.StockInst($D$2,\"買気配価格_5本目\") => 接続待ち"},{"$f":"_xll.SNT.StockInst($D$2,\"買気配数量_5本目\")","v":"=@SNT.StockInst($D$2,\"買気配数量_5本目\") => 接続待ち"},null,null,{"$f":"_xll.SNT.StockInst($H$2,\"買気配価格_5本目\")","v":"=@SNT.StockInst($H$2,\"買気配価格_5本目\") => 接続待ち"},{"$f":"_xll.SNT.StockInst($H$2,\"買気配数量_5本目\")","v":"=@SNT.StockInst($H$2,\"買気配数量_5本目\") => 接続待ち"},null,null,{"$f":"_xll.SNT.StockInst($L$2,\"買気配価格_5本目\")","v":"=@SNT.StockInst($L$2,\"買気配価格_5本目\") => 接続待ち"},{"$f":"_xll.SNT.StockInst($L$2,\"買気配数量_5本目\")","v":"=@SNT.StockInst($L$2,\"買気配数量_5本目\") => 接続待ち"},null,null,{"$f":"_xll.SNT.StockInst($P$2,\"買気配価格_5本目\")","v":"=@SNT.StockInst($P$2,\"買気配価格_5本目\") => 接続待ち"},{"$f":"_xll.SNT.StockInst($P$2,\"買気配数量_5本目\")","v":"=@SNT.StockInst($P$2,\"買気配数量_5本目\") => 接続待ち"},null,null,{"$f":"_xll.SNT.StockInst($T$2,\"買気配価格_5本目\")","v":"=@SNT.StockInst($T$2,\"買気配価格_5本目\") => 接続待ち"},{"$f":"_xll.SNT.StockInst($T$2,\"買気配数量_5本目\")","v":"=@SNT.StockInst($T$2,\"買気配数量_5本目\") => 接続待ち"}]
{"$rows_left_out":16}
{"sheet":"注文照会","index":5,"n_rows":507,"n_cols":16,"rows_kept":507,"cut":false,"hidden":false,"merged":[]}
[]
["信用取引　信用注文約定照会"]
[null,null,null,null,"ソート"]
["出力数",null,null,null,"銘柄コード","約定状態"]
[60]
[]
["＃","注文ID","銘柄コード","銘柄名称","口座区分","取引区分","注文区分","執行条件","注文数量","注文単価区分","注文単価","約定状態","失効状態","約定数量","未約定数量","注文日時"]
[1]
[2]
[3]
[4]
[5]
[6]
[7]
[8]
[9]
[10]
[11]
[12]
[13]
{"$rows_left_out":488}
{"sheet":"呼値の単位","index":6,"n_rows":19,"n_cols":5,"rows_kept":19,"cut":false,"hidden":false,"merged":[]}
[]
["＜値刻み設定＞"]
["以上","以下","一般単位","TOPIX単位","ETF"]
[1,1000,1,0.1,1]
[1000.1,3000,1,0.5,1]
[3000.5,5000,5,1,1]
[5001,10000,10,1,1]
[10001,30000,10,5,5]
[30001,50000,50,10,10]
[50001,100000,100,10,10]
[100001,300000,100,50,50]
[300001,500000,500,100,100]
[500001,1000000,1000,100,100]
[1000001,3000000,1000,500,500]
[3000001,5000000,5000,1000,1000]
[5000001,10000000,10000,1000,1000]
[10000001,30000000,10000,5000,5000]
[30000001,50000000,50000,10000,10000]
[50000001,null,100000,10000,10000]

{"sheet":"TOPIX500","index":7,"n_rows":1692,"n_cols":21,"rows_kept":1692,"cut":false,"hidden":false,"merged":[]}
["日付","銘柄名","コード","業種","TOPIXに占める個別銘柄のウエイト","ニューインデックス区分","TEXTコード","flag",null,null,"構成銘柄情報",null,"https://www.jpx.co.jp/markets/indices/topix/index.html#heading_5",null,null,null,null,null,null,null,"2026年5月1日時点データ"]
[20251230,"極洋",1301,"水産・農林業",5.8999999999999998E-5,"TOPIX Small 1",{"$f":"TEXT(C2,0)","v":"1301"},{"$f":"IFERROR(_xlfn.IFS(F2=$K$4,\"T500\",F2=$K$5,\"T500\",F2=$K$6,\"T500\"),\"\")","v":""}]
[20251230,"ニッスイ",1332,"水産・農林業",3.0499999999999999E-4,"TOPIX Mid400",{"$f":"TEXT(C3,0)","v":"1332"},{"$f":"IFERROR(_xlfn.IFS(F3=$K$4,\"T500\",F3=$K$5,\"T500\",F3=$K$6,\"T500\"),\"\")","v":"T500"},null,null,"＜フラグピック区分＞"]
[20251230,"マルハニチロ",1333,"水産・農林業",1.8100000000000001E-4,"TOPIX Mid400","1333",{"$f":"IFERROR(_xlfn.IFS(F4=$K$4,\"T500\",F4=$K$5,\"T500\",F4=$K$6,\"T500\"),\"\")","v":"T500"},null,null,"TOPIX Core30"]
[20251230,"ユキグニファクトリー",1375,"水産・農林業",2.5999999999999998E-5,"TOPIX Small 2","1375",{"$f":"IFERROR(_xlfn.IFS(F5=$K$4,\"T500\",F5=$K$5,\"T500\",F5=$K$6,\"T500\"),\"\")","v":""},null,null,"TOPIX Large70"]
[20251230,"カネコ種苗",1376,"水産・農林業",1.2999999999999999E-5,"TOPIX Small 2","1376",{"$f":"IFERROR(_xlfn.IFS(F6=$K$4,\"T500\",F6=$K$5,\"T500\",F6=$K$6,\"T500\"),\"\")","v":""},null,null,"TOPIX Mid400"]
[20251230,"サカタのタネ",1377,"水産・農林業",1.4999999999999999E-4,"TOPIX Small 1","1377",{"$f":"IFERROR(_xlfn.IFS(F7=$K$4,\"T500\",F7=$K$5,\"T500\",F7=$K$6,\"T500\"),\"\")","v":""}]
[20251230,"ホクト",1379,"水産・農林業",5.1999999999999997E-5,"TOPIX Small 2","1379",{"$f":"IFERROR(_xlfn.IFS(F8=$K$4,\"T500\",F8=$K$5,\"T500\",F8=$K$6,\"T500\"),\"\")","v":""}]
[20251230,"ショーボンドホールディングス",1414,"建設業",2.02E-4,"TOPIX Mid400","1414",{"$f":"IFERROR(_xlfn.IFS(F9=$K$4,\"T500\",F9=$K$5,\"T500\",F9=$K$6,\"T500\"),\"\")","v":"T500"}]
[20251230,"ミライト・ワン",1417,"建設業",3.4699999999999998E-4,"TOPIX Mid400","1417",{"$f":"IFERROR(_xlfn.IFS(F10=$K$4,\"T500\",F10=$K$5,\"T500\",F10=$K$6,\"T500\"),\"\")","v":"T500"}]
[20251230,"タマホーム",1419,"建設業",6.4999999999999994E-5,"TOPIX Small 1","1419",{"$f":"IFERROR(_xlfn.IFS(F11=$K$4,\"T500\",F11=$K$5,\"T500\",F11=$K$6,\"T500\"),\"\")","v":""}]
[20251230,"ｒｏｂｏｔ　ｈｏｍｅ",1435,"不動産業",1.0000000000000001E-5,"TOPIX Small 2","1435",{"$f":"IFERROR(_xlfn.IFS(F12=$K$4,\"T500\",F12=$K$5,\"T500\",F12=$K$6,\"T500\"),\"\")","v":""}]
[20251230,"住石ホールディングス",1514,"鉱業",1.4E-5,"TOPIX Small 2","1514",{"$f":"IFERROR(_xlfn.IFS(F13=$K$4,\"T500\",F13=$K$5,\"T500\",F13=$K$6,\"T500\"),\"\")","v":""}]
[20251230,"日鉄鉱業",1515,"鉱業",1.25E-4,"TOPIX Small 1","1515",{"$f":"IFERROR(_xlfn.IFS(F14=$K$4,\"T500\",F14=$K$5,\"T500\",F14=$K$6,\"T500\"),\"\")","v":""}]
[20251230,"三井松島ホールディングス",1518,"その他製品",5.0000000000000002E-5,"TOPIX Small 1","1518",{"$f":"IFERROR(_xlfn.IFS(F15=$K$4,\"T500\",F15=$K$5,\"T500\",F15=$K$6,\"T500\"),\"\")","v":""}]
[20251230,"ＩＮＰＥＸ",1605,"鉱業",3.052E-3,"TOPIX Mid400","1605",{"$f":"IFERROR(_xlfn.IFS(F16=$K$4,\"T500\",F16=$K$5,\"T500\",F16=$K$6,\"T500\"),\"\")","v":"T500"}]
[20251230,"石油資源開発",1662,"鉱業",2.81E-4,"TOPIX Small 1","1662",{"$f":"IFERROR(_xlfn.IFS(F17=$K$4,\"T500\",F17=$K$5,\"T500\",F17=$K$6,\"T500\"),\"\")","v":""}]
[20251230,"Ｋ＆Ｏエナジーグループ",1663,"鉱業",5.0000000000000002E-5,"TOPIX Small 1","1663",{"$f":"IFERROR(_xlfn.IFS(F18=$K$4,\"T500\",F18=$K$5,\"T500\",F18=$K$6,\"T500\"),\"\")","v":""}]
[20251230,"リョーサン菱洋ホールディングス","167A","卸売業",1.2999999999999999E-4,"TOPIX Small 1","167A",{"$f":"IFERROR(_xlfn.IFS(F19=$K$4,\"T500\",F19=$K$5,\"T500\",F19=$K$6,\"T500\"),\"\")","v":""}]
[20251230,"第一カッター興業",1716,"建設業",1.0000000000000001E-5,"TOPIX Small 2","1716",{"$f":"IFERROR(_xlfn.IFS(F20=$K$4,\"T500\",F20=$K$5,\"T500\",F20=$K$6,\"T500\"),\"\")","v":""}]
{"$rows_left_out":1673}
{"sheet":"注文管理ID","index":8,"n_rows":3001,"n_cols":2,"rows_kept":3001,"cut":false,"hidden":false,"merged":[]}
["管理番号","使用済\nフラグ"]
[1]
[2]
[3]
[4]
[5]
[6]
[7]
[8]
[9]
[10]
[11]
[12]
[13]
[14]
[15]
[16]
[17]
[18]
[19]
{"$rows_left_out":2981}